Diagnosed failure

Parameters/TestRpc.TestCallWithChainCertAndChainCA/SSL_TCP: /data0/somelongdirectorytoavoidrpathissues/src/kudu/src/kudu/rpc/rpc-test.cc:270: Failure
Failed
Bad status: Runtime error: could not verify certificate chain (error with cert: subject=CN = localhost, ST = sadfjas, C = AS, emailAddress = sdflkdsajf, O = lskdfjlsad, OU = sldfkja, issuer=C = AS, ST = ASDfkjdhf, L = lskdjf, O = saldfja, OU = skdjf, CN = localhost, emailAddress = sadjflkadsj): : certificate has expired
Google Test trace:
/data0/somelongdirectorytoavoidrpathissues/src/kudu/src/kudu/rpc/rpc-test.cc:267: Connecting to 0.0.0.0:34667
I20260928 06:32:05.633450 16826 test_util.cc:175] -----------------------------------------------
I20260928 06:32:05.633513 16826 test_util.cc:176] Had fatal failures, leaving test files at /tmp/dist-test-taskvPFgit/test-tmp/rpc-test.5.Parameters_TestRpc.TestCallWithChainCertAndChainCA_SSL_TCP.1790577125580909-16826-0

Full log

Note: This is test shard 6 of 8.
[==========] Running 21 tests from 2 test suites.
[----------] Global test environment set-up.
[----------] 20 tests from Parameters/TestRpc
[ RUN      ] Parameters/TestRpc.TestMessengerCreateDestroy/SSL_TCP
WARNING: Logging before InitGoogleLogging() is written to STDERR
I20260928 06:32:05.602771 16826 rpc-test.cc:169] started messenger TestCreateDestroy
[       OK ] Parameters/TestRpc.TestMessengerCreateDestroy/SSL_TCP (19 ms)
[ RUN      ] Parameters/TestRpc.TestNegotiationDeadlock/SSL_TCP
I20260928 06:32:05.613451 16846 acceptor_pool.cc:254] collecting diagnostics on the listening RPC socket 0.0.0.0:46187 every 8 connection(s)
I20260928 06:32:05.613483 16847 acceptor_pool.cc:254] collecting diagnostics on the listening RPC socket 0.0.0.0:46187 every 8 connection(s)
[       OK ] Parameters/TestRpc.TestNegotiationDeadlock/SSL_TCP (16 ms)
[ RUN      ] Parameters/TestRpc.TestCallWithChainCertAndChainCA/SSL_TCP
I20260928 06:32:05.629930 16862 acceptor_pool.cc:254] collecting diagnostics on the listening RPC socket 0.0.0.0:34667 every 8 connection(s)
I20260928 06:32:05.629959 16863 acceptor_pool.cc:254] collecting diagnostics on the listening RPC socket 0.0.0.0:34667 every 8 connection(s)
/data0/somelongdirectorytoavoidrpathissues/src/kudu/src/kudu/rpc/rpc-test.cc:270: Failure
Failed
Bad status: Runtime error: could not verify certificate chain (error with cert: subject=CN = localhost, ST = sadfjas, C = AS, emailAddress = sdflkdsajf, O = lskdfjlsad, OU = sldfkja, issuer=C = AS, ST = ASDfkjdhf, L = lskdjf, O = saldfja, OU = skdjf, CN = localhost, emailAddress = sadjflkadsj): : certificate has expired
Google Test trace:
/data0/somelongdirectorytoavoidrpathissues/src/kudu/src/kudu/rpc/rpc-test.cc:267: Connecting to 0.0.0.0:34667
I20260928 06:32:05.633450 16826 test_util.cc:175] -----------------------------------------------
I20260928 06:32:05.633513 16826 test_util.cc:176] Had fatal failures, leaving test files at /tmp/dist-test-taskvPFgit/test-tmp/rpc-test.5.Parameters_TestRpc.TestCallWithChainCertAndChainCA_SSL_TCP.1790577125580909-16826-0
[  FAILED  ] Parameters/TestRpc.TestCallWithChainCertAndChainCA/SSL_TCP, where GetParam() = (true, false) (13 ms)
[ RUN      ] Parameters/TestRpc.TestCallWithPasswordProtectedKey/SSL_TCP
I20260928 06:32:05.656826 16887 acceptor_pool.cc:254] collecting diagnostics on the listening RPC socket 0.0.0.0:36111 every 8 connection(s)
I20260928 06:32:05.656888 16888 acceptor_pool.cc:254] collecting diagnostics on the listening RPC socket 0.0.0.0:36111 every 8 connection(s)
[       OK ] Parameters/TestRpc.TestCallWithPasswordProtectedKey/SSL_TCP (35 ms)
[ RUN      ] Parameters/TestRpc.TestCallToBadServer/SSL_TCP
I20260928 06:32:05.677937 16826 rpc-test.cc:394] Status: Network error: Client connection negotiation failed: client connection to 0.0.0.0:0: connect: Connection refused (error 111)
I20260928 06:32:05.678213 16826 rpc-test.cc:394] Status: Network error: Client connection negotiation failed: client connection to 0.0.0.0:0: connect: Connection refused (error 111)
I20260928 06:32:05.678495 16826 rpc-test.cc:394] Status: Network error: Client connection negotiation failed: client connection to 0.0.0.0:0: connect: Connection refused (error 111)
I20260928 06:32:05.678740 16826 rpc-test.cc:394] Status: Network error: Client connection negotiation failed: client connection to 0.0.0.0:0: connect: Connection refused (error 111)
I20260928 06:32:05.678906 16826 rpc-test.cc:394] Status: Network error: Client connection negotiation failed: client connection to 0.0.0.0:0: connect: Connection refused (error 111)
[       OK ] Parameters/TestRpc.TestCallToBadServer/SSL_TCP (10 ms)
[ RUN      ] Parameters/TestRpc.TestWrongService/SSL_TCP
I20260928 06:32:05.698500 16922 acceptor_pool.cc:254] collecting diagnostics on the listening RPC socket 0.0.0.0:41493 every 8 connection(s)
I20260928 06:32:05.698550 16923 acceptor_pool.cc:254] collecting diagnostics on the listening RPC socket 0.0.0.0:41493 every 8 connection(s)
I20260928 06:32:05.727259 16920 messenger.cc:345] service WrongServiceName not registered on TestServer
[       OK ] Parameters/TestRpc.TestWrongService/SSL_TCP (49 ms)
[ RUN      ] Parameters/TestRpc.TestConnectionKeepalive/SSL_TCP
I20260928 06:32:05.741106 16945 acceptor_pool.cc:254] collecting diagnostics on the listening RPC socket 0.0.0.0:38651 every 8 connection(s)
I20260928 06:32:05.741158 16946 acceptor_pool.cc:254] collecting diagnostics on the listening RPC socket 0.0.0.0:38651 every 8 connection(s)
I20260928 06:32:05.741307 16826 rpc-test.cc:488] Connecting to 0.0.0.0:38651
[       OK ] Parameters/TestRpc.TestConnectionKeepalive/SSL_TCP (1067 ms)
[ RUN      ] Parameters/TestRpc.TestClientConnectionMetrics/SSL_TCP
I20260928 06:32:06.816218 16970 acceptor_pool.cc:254] collecting diagnostics on the listening RPC socket 0.0.0.0:44633 every 8 connection(s)
I20260928 06:32:06.816278 16971 acceptor_pool.cc:254] collecting diagnostics on the listening RPC socket 0.0.0.0:44633 every 8 connection(s)
I20260928 06:32:06.816437 16826 rpc-test.cc:569] Connecting to 0.0.0.0:44633
[       OK ] Parameters/TestRpc.TestClientConnectionMetrics/SSL_TCP (8111 ms)
[ RUN      ] Parameters/TestRpc.TestCredentialsPolicy/SSL_TCP
I20260928 06:32:14.922158 16993 acceptor_pool.cc:254] collecting diagnostics on the listening RPC socket 0.0.0.0:39163 every 8 connection(s)
I20260928 06:32:14.922228 16994 acceptor_pool.cc:254] collecting diagnostics on the listening RPC socket 0.0.0.0:39163 every 8 connection(s)
I20260928 06:32:14.922415 16826 rpc-test.cc:700] Connecting to 0.0.0.0:39163
[       OK ] Parameters/TestRpc.TestCredentialsPolicy/SSL_TCP (32 ms)
[ RUN      ] Parameters/TestRpc.TestCallLongerThanKeepalive/SSL_TCP
I20260928 06:32:14.957784 17018 acceptor_pool.cc:254] collecting diagnostics on the listening RPC socket 0.0.0.0:33885 every 8 connection(s)
I20260928 06:32:14.957823 17019 acceptor_pool.cc:254] collecting diagnostics on the listening RPC socket 0.0.0.0:33885 every 8 connection(s)
I20260928 06:32:14.973027 17022 rpc-test-base.h:222] got call: sleep_micros: 3000000 deferred: true
I20260928 06:32:17.973845 17022 rpcz_store.cc:275] Call kudu.rpc.GenericCalculatorService.Sleep from 127.0.0.1:40776 (request call id 0) took 3000 ms. Trace:
I20260928 06:32:17.973975 17022 rpcz_store.cc:276] 0928 06:32:14.972976 (+     0us) service_pool.cc:170] Inserting onto call queue
0928 06:32:14.973008 (+    32us) service_pool.cc:227] Handling call
0928 06:32:17.973812 (+3000804us) inbound_call.cc:173] Queueing success response
Metrics: {}
[       OK ] Parameters/TestRpc.TestCallLongerThanKeepalive/SSL_TCP (3035 ms)
[ RUN      ] Parameters/TestRpc.TestRpcSidecar/SSL_TCP
I20260928 06:32:17.984107 17043 acceptor_pool.cc:254] collecting diagnostics on the listening RPC socket 0.0.0.0:40031 every 8 connection(s)
I20260928 06:32:17.984148 17044 acceptor_pool.cc:254] collecting diagnostics on the listening RPC socket 0.0.0.0:40031 every 8 connection(s)
[       OK ] Parameters/TestRpc.TestRpcSidecar/SSL_TCP (53 ms)
[ RUN      ] Parameters/TestRpc.TestRpcSidecarLimits/SSL_TCP
I20260928 06:32:20.182348 17068 acceptor_pool.cc:254] collecting diagnostics on the listening RPC socket 0.0.0.0:44651 every 8 connection(s)
I20260928 06:32:20.182423 17069 acceptor_pool.cc:254] collecting diagnostics on the listening RPC socket 0.0.0.0:44651 every 8 connection(s)
W20260928 06:32:20.198774 16826 serialization.cc:72] Serialized kudu.rpc_test.PushStringsRequestPB (2147483654 bytes) is larger than the maximum configured RPC message size (52428800 bytes). Sending anyway, but peer may reject the data.
W20260928 06:32:20.201709 17066 connection.cc:535] server connection from 127.0.0.1:58522 recv error: Network error: RPC frame had a length of 2147483714, but we only support messages up to 52428800 bytes long.
W20260928 06:32:20.201756 17066 connection.cc:158] shutting down server connection from 127.0.0.1:58522 with pending inbound data: 4/2147483714 bytes received; last active 0 ns ago: status Network error: RPC frame had a length of 2147483714, but we only support messages up to 52428800 bytes long.
W20260928 06:32:20.201907 17081 connection.cc:698] client connection to 0.0.0.0:44651 send error: Network error: failed to write to TLS socket: Connection reset by peer
W20260928 06:32:20.202034 17081 connection.cc:196] Error closing socket: Network error: TlsSocket::Close: Success
I20260928 06:32:20.213045 17093 acceptor_pool.cc:254] collecting diagnostics on the listening RPC socket 0.0.0.0:42497 every 8 connection(s)
I20260928 06:32:20.213179 17094 acceptor_pool.cc:254] collecting diagnostics on the listening RPC socket 0.0.0.0:42497 every 8 connection(s)
W20260928 06:32:24.837847 17090 connection.cc:577] server connection from 127.0.0.1:43992: received bad data: 'Corruption: Invalid packet: message had a length of 2147483710, but we only support messages up to 2147483647 bytes
'
[       OK ] Parameters/TestRpc.TestRpcSidecarLimits/SSL_TCP (6811 ms)
[ RUN      ] Parameters/TestRpc.TestCallTimeoutDoesntAffectNegotiation/SSL_TCP
I20260928 06:32:24.855283 17118 acceptor_pool.cc:254] collecting diagnostics on the listening RPC socket 0.0.0.0:42065 every 8 connection(s)
I20260928 06:32:24.855333 17119 acceptor_pool.cc:254] collecting diagnostics on the listening RPC socket 0.0.0.0:42065 every 8 connection(s)
W20260928 06:32:24.865856 17114 negotiation.cc:266] Injecting 500ms delay in negotiation
I20260928 06:32:24.916138 16826 rpc-test-base.h:595] status: Timed out: connection negotiation to 0.0.0.0:42065 for RPC Sleep timed out after 0.050s (ON_OUTBOUND_QUEUE), seconds elapsed: 0.0506335
[       OK ] Parameters/TestRpc.TestCallTimeoutDoesntAffectNegotiation/SSL_TCP (531 ms)
[ RUN      ] Parameters/TestRpc.TestRpcHandlerLatencyMetric/SSL_TCP
I20260928 06:32:25.396247 17143 acceptor_pool.cc:254] collecting diagnostics on the listening RPC socket 0.0.0.0:36401 every 8 connection(s)
I20260928 06:32:25.396272 17144 acceptor_pool.cc:254] collecting diagnostics on the listening RPC socket 0.0.0.0:36401 every 8 connection(s)
I20260928 06:32:25.438338 16826 rpc-test.cc:1236] Sleep() min lat: 20277
I20260928 06:32:25.438406 16826 rpc-test.cc:1237] Sleep() mean lat: 20277
I20260928 06:32:25.438432 16826 rpc-test.cc:1238] Sleep() max lat: 20277
I20260928 06:32:25.438462 16826 rpc-test.cc:1239] Sleep() #calls: 1
[       OK ] Parameters/TestRpc.TestRpcHandlerLatencyMetric/SSL_TCP (67 ms)
[ RUN      ] Parameters/TestRpc.TimedOutOnResponseMetricServiceQueue/SSL_TCP
I20260928 06:32:25.451304 17169 acceptor_pool.cc:254] collecting diagnostics on the listening RPC socket 0.0.0.0:39121 every 8 connection(s)
I20260928 06:32:25.451354 17170 acceptor_pool.cc:254] collecting diagnostics on the listening RPC socket 0.0.0.0:39121 every 8 connection(s)
W20260928 06:32:25.522661 17171 rpcz_store.cc:267] Call kudu.rpc_test.CalculatorService.Sleep from 127.0.0.1:36944 (request call id 2) took 20 ms (client timeout 20 ms). Trace:
W20260928 06:32:25.522820 17171 rpcz_store.cc:269] 0928 06:32:25.502422 (+     0us) service_pool.cc:170] Inserting onto call queue
0928 06:32:25.522630 (+ 20208us) service_pool.cc:214] Skipping call since client already timed out
0928 06:32:25.522643 (+    13us) inbound_call.cc:173] Queueing failure response
Metrics: {}
[       OK ] Parameters/TestRpc.TimedOutOnResponseMetricServiceQueue/SSL_TCP (84 ms)
[ RUN      ] Parameters/TestRpc.RpcPendingConnectionsMetric/SSL_TCP
I20260928 06:32:25.526099 17192 acceptor_pool.cc:254] collecting diagnostics on the listening RPC socket 0.0.0.0:38329 every 8 connection(s)
I20260928 06:32:25.526162 17193 acceptor_pool.cc:254] collecting diagnostics on the listening RPC socket 0.0.0.0:38329 every 8 connection(s)
W20260928 06:32:25.526772 17188 negotiation.cc:337] Failed RPC negotiation. Trace:
0928 06:32:25.526591 (+     0us) reactor.cc:625] Submitting negotiation task for server connection from 127.0.0.1:35948 (local address 127.0.0.1:38329)
0928 06:32:25.526652 (+    61us) server_negotiation.cc:206] Beginning negotiation
0928 06:32:25.526654 (+     2us) server_negotiation.cc:399] Waiting for connection header
0928 06:32:25.526723 (+    69us) negotiation.cc:327] Negotiation complete: Network error: Server connection negotiation failed: server connection from 127.0.0.1:35948: BlockingRecv error: recv got EOF from 127.0.0.1:35948 (error 108)
Metrics: {"server-negotiator.queue_time_us":32}
[       OK ] Parameters/TestRpc.RpcPendingConnectionsMetric/SSL_TCP (13 ms)
[ RUN      ] Parameters/TestRpc.TestRpcContextClientDeadline/SSL_TCP
I20260928 06:32:25.555388 17208 acceptor_pool.cc:254] collecting diagnostics on the listening RPC socket 0.0.0.0:46365 every 8 connection(s)
I20260928 06:32:25.555641 17209 acceptor_pool.cc:254] collecting diagnostics on the listening RPC socket 0.0.0.0:46365 every 8 connection(s)
[       OK ] Parameters/TestRpc.TestRpcContextClientDeadline/SSL_TCP (51 ms)
[ RUN      ] Parameters/TestRpc.TestApplicationFeatureFlagUnsupportedServer/SSL_TCP
I20260928 06:32:25.600863 17234 acceptor_pool.cc:254] collecting diagnostics on the listening RPC socket 0.0.0.0:42593 every 8 connection(s)
I20260928 06:32:25.600876 17233 acceptor_pool.cc:254] collecting diagnostics on the listening RPC socket 0.0.0.0:42593 every 8 connection(s)
[       OK ] Parameters/TestRpc.TestApplicationFeatureFlagUnsupportedServer/SSL_TCP (24 ms)
[ RUN      ] Parameters/TestRpc.TestCancellationAsync/SSL_TCP
I20260928 06:32:25.630116 17258 acceptor_pool.cc:254] collecting diagnostics on the listening RPC socket 0.0.0.0:39883 every 8 connection(s)
I20260928 06:32:25.630173 17259 acceptor_pool.cc:254] collecting diagnostics on the listening RPC socket 0.0.0.0:39883 every 8 connection(s)
I20260928 06:32:25.630357 16826 rpc-test.cc:1716] Connecting to 0.0.0.0:39883
I20260928 06:32:25.642644 16826 test_util.cc:268] Using random seed: 984972946
I20260928 06:32:25.660683 17262 rpc-test-base.h:240] got call: sleep_micros: 500 pattern: 4294967295 num_repetitions: 2097152 sidecar_idx: 0
I20260928 06:32:25.676522 17262 rpc-test-base.h:240] got call: sleep_micros: 500 pattern: 4294967295 num_repetitions: 2097152 sidecar_idx: 0
I20260928 06:32:25.687772 17262 rpc-test-base.h:240] got call: sleep_micros: 500 pattern: 4294967295 num_repetitions: 2097152 sidecar_idx: 0
I20260928 06:32:25.705170 17262 rpc-test-base.h:240] got call: sleep_micros: 500 pattern: 4294967295 num_repetitions: 2097152 sidecar_idx: 0
I20260928 06:32:25.716810 17262 rpc-test-base.h:240] got call: sleep_micros: 500 pattern: 4294967295 num_repetitions: 2097152 sidecar_idx: 0
I20260928 06:32:25.726740 17262 rpc-test-base.h:240] got call: sleep_micros: 500 pattern: 4294967295 num_repetitions: 2097152 sidecar_idx: 0
I20260928 06:32:25.737099 17262 rpc-test-base.h:240] got call: sleep_micros: 500 pattern: 4294967295 num_repetitions: 2097152 sidecar_idx: 0
I20260928 06:32:25.748181 17262 rpc-test-base.h:240] got call: sleep_micros: 500 pattern: 4294967295 num_repetitions: 2097152 sidecar_idx: 0
W20260928 06:32:25.751281 17256 connection.cc:441] server connection from 127.0.0.1:51418 torn down before Call kudu.rpc.GenericCalculatorService.SleepWithSidecar from 127.0.0.1:51418 (request call id 9) could send its response
[       OK ] Parameters/TestRpc.TestCancellationAsync/SSL_TCP (138 ms)
[ RUN      ] Parameters/TestRpc.TestPerformanceBySocketType/SSL_TCP
I20260928 06:32:25.768312 17283 acceptor_pool.cc:254] collecting diagnostics on the listening RPC socket 0.0.0.0:44851 every 8 connection(s)
I20260928 06:32:25.768360 17284 acceptor_pool.cc:254] collecting diagnostics on the listening RPC socket 0.0.0.0:44851 every 8 connection(s)
I20260928 06:32:25.768604 16826 rpc-test.cc:1846] Connecting to 0.0.0.0:44851
I20260928 06:32:27.383828 16826 rpc-test.cc:1859] Sending 1024MB via ssl-enabled tcp socket: real 1.610s	user 1.367s	sys 1.523s
I20260928 06:32:28.924599 16826 rpc-test.cc:1859] Sending 1024MB via ssl-enabled tcp socket: real 1.541s	user 1.391s	sys 1.354s
I20260928 06:32:30.544749 16826 rpc-test.cc:1859] Sending 1024MB via ssl-enabled tcp socket: real 1.620s	user 1.420s	sys 1.465s
I20260928 06:32:32.168393 16826 rpc-test.cc:1859] Sending 1024MB via ssl-enabled tcp socket: real 1.624s	user 1.487s	sys 1.403s
I20260928 06:32:33.719184 16826 rpc-test.cc:1859] Sending 1024MB via ssl-enabled tcp socket: real 1.551s	user 1.422s	sys 1.350s
[       OK ] Parameters/TestRpc.TestPerformanceBySocketType/SSL_TCP (7968 ms)
[----------] 20 tests from Parameters/TestRpc (28136 ms total)

[----------] 1 test from Parameters/TestRpcSocketTxRxQueue
[ RUN      ] Parameters/TestRpcSocketTxRxQueue.OverCapacity/0
W20260928 06:32:33.995910 17309 negotiation.cc:337] Failed RPC negotiation. Trace:
0928 06:32:33.732847 (+     0us) reactor.cc:625] Submitting negotiation task for client connection to 0.0.0.0:44551 (local address 127.0.0.1:49094)
0928 06:32:33.732884 (+    37us) negotiation.cc:107] Waiting for socket to connect
0928 06:32:33.732892 (+     8us) client_negotiation.cc:174] Beginning negotiation
0928 06:32:33.732940 (+    48us) client_negotiation.cc:252] Sending NEGOTIATE NegotiatePB request
0928 06:32:33.995702 (+262762us) negotiation.cc:327] Negotiation complete: Network error: Client connection negotiation failed: client connection to 0.0.0.0:44551: BlockingRecv error: recv error from unknown peer: Transport endpoint is not connected (error 107)
Metrics: {"client-negotiator.queue_time_us":17}
W20260928 06:32:33.996045 17345 negotiation.cc:337] Failed RPC negotiation. Trace:
0928 06:32:33.736385 (+     0us) reactor.cc:625] Submitting negotiation task for client connection to 0.0.0.0:44551 (local address 127.0.0.1:49136)
0928 06:32:33.736458 (+    73us) negotiation.cc:107] Waiting for socket to connect
0928 06:32:33.736468 (+    10us) client_negotiation.cc:174] Beginning negotiation
0928 06:32:33.736514 (+    46us) client_negotiation.cc:252] Sending NEGOTIATE NegotiatePB request
0928 06:32:33.996005 (+259491us) negotiation.cc:327] Negotiation complete: Network error: Client connection negotiation failed: client connection to 0.0.0.0:44551: BlockingRecv error: recv error from unknown peer: Transport endpoint is not connected (error 107)
Metrics: {"client-negotiator.queue_time_us":53}
W20260928 06:32:33.995910 17327 negotiation.cc:337] Failed RPC negotiation. Trace:
0928 06:32:33.734597 (+     0us) reactor.cc:625] Submitting negotiation task for client connection to 0.0.0.0:44551 (local address 127.0.0.1:49112)
0928 06:32:33.734654 (+    57us) negotiation.cc:107] Waiting for socket to connect
0928 06:32:33.734663 (+     9us) client_negotiation.cc:174] Beginning negotiation
0928 06:32:33.734708 (+    45us) client_negotiation.cc:252] Sending NEGOTIATE NegotiatePB request
0928 06:32:33.995707 (+260999us) negotiation.cc:327] Negotiation complete: Network error: Client connection negotiation failed: client connection to 0.0.0.0:44551: BlockingRecv error: recv error from unknown peer: Transport endpoint is not connected (error 107)
Metrics: {"client-negotiator.queue_time_us":35}
W20260928 06:32:33.995910 17318 negotiation.cc:337] Failed RPC negotiation. Trace:
0928 06:32:33.733714 (+     0us) reactor.cc:625] Submitting negotiation task for client connection to 0.0.0.0:44551 (local address 127.0.0.1:49100)
0928 06:32:33.733775 (+    61us) negotiation.cc:107] Waiting for socket to connect
0928 06:32:33.733784 (+     9us) client_negotiation.cc:174] Beginning negotiation
0928 06:32:33.733824 (+    40us) client_negotiation.cc:252] Sending NEGOTIATE NegotiatePB request
0928 06:32:33.995706 (+261882us) negotiation.cc:327] Negotiation complete: Network error: Client connection negotiation failed: client connection to 0.0.0.0:44551: BlockingRecv error: recv error from unknown peer: Transport endpoint is not connected (error 107)
Metrics: {"client-negotiator.queue_time_us":36}
W20260928 06:32:33.996351 17336 negotiation.cc:337] Failed RPC negotiation. Trace:
0928 06:32:33.735483 (+     0us) reactor.cc:625] Submitting negotiation task for client connection to 0.0.0.0:44551 (local address 127.0.0.1:49128)
0928 06:32:33.735540 (+    57us) negotiation.cc:107] Waiting for socket to connect
0928 06:32:33.735549 (+     9us) client_negotiation.cc:174] Beginning negotiation
0928 06:32:33.735594 (+    45us) client_negotiation.cc:252] Sending NEGOTIATE NegotiatePB request
0928 06:32:33.995961 (+260367us) negotiation.cc:327] Negotiation complete: Network error: Client connection negotiation failed: client connection to 0.0.0.0:44551: BlockingRecv error: recv error from unknown peer: Transport endpoint is not connected (error 107)
Metrics: {"client-negotiator.queue_time_us":36}
W20260928 06:32:33.995958 17300 negotiation.cc:337] Failed RPC negotiation. Trace:
0928 06:32:33.731986 (+     0us) reactor.cc:625] Submitting negotiation task for client connection to 0.0.0.0:44551 (local address 127.0.0.1:49080)
0928 06:32:33.732046 (+    60us) negotiation.cc:107] Waiting for socket to connect
0928 06:32:33.732057 (+    11us) client_negotiation.cc:174] Beginning negotiation
0928 06:32:33.732114 (+    57us) client_negotiation.cc:252] Sending NEGOTIATE NegotiatePB request
0928 06:32:33.995702 (+263588us) negotiation.cc:327] Negotiation complete: Network error: Client connection negotiation failed: client connection to 0.0.0.0:44551: BlockingRecv error: recv error from unknown peer: Transport endpoint is not connected (error 107)
Metrics: {"client-negotiator.queue_time_us":36}
[       OK ] Parameters/TestRpcSocketTxRxQueue.OverCapacity/0 (1037 ms)
[----------] 1 test from Parameters/TestRpcSocketTxRxQueue (1037 ms total)

[----------] Global test environment tear-down
[==========] 21 tests from 2 test suites ran. (29174 ms total)
[  PASSED  ] 20 tests.
[  FAILED  ] 1 test, listed below:
[  FAILED  ] Parameters/TestRpc.TestCallWithChainCertAndChainCA/SSL_TCP, where GetParam() = (true, false)

 1 FAILED TEST