Diagnosed failure

AuthzProviders/TSAuthzITest.Kudu3661/Ranger: /home/jenkins-slave/workspace/build_and_test_flaky/src/kudu/integration-tests/external_mini_cluster-itest-base.cc:66: Failure
Failed
Bad status: Timed out: Failed to start the Ranger service: process with PID 13189 is not yet bound to any port at the specified addresses; last attempt running lsof returned 'Not found: could not find pattern of a bound port in lsof output: p13189
f334
n127.0.0.1:45028->127.12.95.84:42693
f335
n127.0.0.1:45038->127.12.95.84:42693
f336
n127.0.0.1:45048->127.12.95.84:42693
f337
n127.0.0.1:45058->127.12.95.84:42693
f338
n127.0.0.1:45064->127.12.95.84:42693'
/home/jenkins-slave/workspace/build_and_test_flaky/src/kudu/integration-tests/ts_authz-itest.cc:470: Failure
Expected: StartClusterWithOpts(std::move(opts)) doesn't generate new fatal failures in the current thread.
  Actual: it does.
I20260924 08:01:33.443431 12669 external_mini_cluster-itest-base.cc:80] Found fatal failure
I20260924 08:01:33.445158 12669 mini_ranger.cc:67] Stopping Ranger...
I20260924 08:01:33.486178 12669 mini_ranger.cc:69] Stopped Ranger
2026-09-24 08:01:33.486 UTC [12707] LOG:  received smart shutdown request
2026-09-24 08:01:33.490 UTC [12707] LOG:  background worker "logical replication launcher" (PID 12715) exited with exit code 1
2026-09-24 08:01:33.490 UTC [12710] LOG:  shutting down
2026-09-24 08:01:33.493 UTC [12710] LOG:  checkpoint starting: shutdown immediate
2026-09-24 08:01:33.970 UTC [12710] LOG:  checkpoint complete: wrote 1511 buffers (9.2%); 0 WAL file(s) added, 0 removed, 0 recycled; write=0.025 s, sync=0.447 s, total=0.480 s; sync files=848, longest=0.005 s, average=0.001 s; distance=8863 kB, estimate=8863 kB; lsn=0/1D225D8, redo lsn=0/1D225D8
2026-09-24 08:01:33.977 UTC [12707] LOG:  database system is shut down
2026-09-24T08:01:33Z chronyd exiting
I20260924 08:01:33.994340 12669 test_util.cc:182] -----------------------------------------------
I20260924 08:01:33.994426 12669 test_util.cc:183] Had failures, leaving test files at /tmp/dist-test-taskGoZl2g/test-tmp/ts_authz-itest.1.AuthzProviders_TSAuthzITest.Kudu3661_Ranger.1790236757264992-12669-0

Full log

Note: This is test shard 2 of 2.
[==========] Running 3 tests from 2 test suites.
[----------] Global test environment set-up.
[----------] 2 tests from AuthzProviders/TSAuthzITest
[ RUN      ] AuthzProviders/TSAuthzITest.Kudu3661/Ranger
Loading random data
Initializing database '/tmp/dist-test-taskGoZl2g/test-tmp/ts_authz-itest.1.AuthzProviders_TSAuthzITest.Kudu3661_Ranger.1790236757264992-12669-0/krb5kdc/principal' for realm 'KRBTEST.COM',
master key name 'K/M@KRBTEST.COM'
Sep 24 07:59:17 dist-test-slave-hwwr krb5kdc[12676](info): setting up network...
krb5kdc: setsockopt(10,IPV6_V6ONLY,1) worked
Sep 24 07:59:17 dist-test-slave-hwwr krb5kdc[12676](info): set up 2 sockets
Sep 24 07:59:17 dist-test-slave-hwwr krb5kdc[12676](info): commencing operation
krb5kdc: starting...
WARNING: Logging before InitGoogleLogging() is written to STDERR
W20260924 07:59:19.273833 12669 mini_kdc.cc:121] Time spent starting KDC: real 1.991s	user 0.000s	sys 0.007s
WARNING: no policy specified for test-admin@KRBTEST.COM; defaulting to no policy
Authenticating as principal slave/admin@KRBTEST.COM with password.
Principal "test-admin@KRBTEST.COM" created.
WARNING: no policy specified for test-user@KRBTEST.COM; defaulting to no policy
Authenticating as principal slave/admin@KRBTEST.COM with password.
Principal "test-user@KRBTEST.COM" created.
WARNING: no policy specified for joe-interloper@KRBTEST.COM; defaulting to no policy
Authenticating as principal slave/admin@KRBTEST.COM with password.
Principal "joe-interloper@KRBTEST.COM" created.
Authenticating as principal slave/admin@KRBTEST.COM with password.
Entry for principal test-user with kvno 1, encryption type aes256-cts-hmac-sha1-96 added to keytab WRFILE:/tmp/dist-test-taskGoZl2g/test-tmp/ts_authz-itest.1.AuthzProviders_TSAuthzITest.Kudu3661_Ranger.1790236757264992-12669-0/krb5kdc/test-user.keytab.
Entry for principal test-user with kvno 1, encryption type aes128-cts-hmac-sha1-96 added to keytab WRFILE:/tmp/dist-test-taskGoZl2g/test-tmp/ts_authz-itest.1.AuthzProviders_TSAuthzITest.Kudu3661_Ranger.1790236757264992-12669-0/krb5kdc/test-user.keytab.
Sep 24 07:59:19 dist-test-slave-hwwr krb5kdc[12676](info): AS_REQ (2 etypes {17 16}) 127.0.0.1: ISSUE: authtime 1790236759, etypes {rep=17 tkt=17 ses=17}, test-admin@KRBTEST.COM for krbtgt/KRBTEST.COM@KRBTEST.COM
Password for test-admin@KRBTEST.COM: 
2026-09-24T07:59:19Z chronyd version 4.6.1 starting (+CMDMON +NTP +REFCLOCK +RTC -PRIVDROP -SCFILTER -SIGND +ASYNCDNS -NTS -SECHASH -IPV6 +DEBUG)
2026-09-24T07:59:19Z Disabled control of system clock
WARNING: no policy specified for rangeradmin/127.12.95.84@KRBTEST.COM; defaulting to no policy
Authenticating as principal test-admin/admin@KRBTEST.COM with password.
Principal "rangeradmin/127.12.95.84@KRBTEST.COM" created.
Authenticating as principal test-admin/admin@KRBTEST.COM with password.
Entry for principal rangeradmin/127.12.95.84@KRBTEST.COM with kvno 2, encryption type aes256-cts-hmac-sha1-96 added to keytab WRFILE:/tmp/dist-test-taskGoZl2g/test-tmp/ts_authz-itest.1.AuthzProviders_TSAuthzITest.Kudu3661_Ranger.1790236757264992-12669-0/krb5kdc/rangeradmin_127.12.95.84@KRBTEST.COM.keytab.
Entry for principal rangeradmin/127.12.95.84@KRBTEST.COM with kvno 2, encryption type aes128-cts-hmac-sha1-96 added to keytab WRFILE:/tmp/dist-test-taskGoZl2g/test-tmp/ts_authz-itest.1.AuthzProviders_TSAuthzITest.Kudu3661_Ranger.1790236757264992-12669-0/krb5kdc/rangeradmin_127.12.95.84@KRBTEST.COM.keytab.
WARNING: no policy specified for rangerlookup/127.12.95.84@KRBTEST.COM; defaulting to no policy
Authenticating as principal test-admin/admin@KRBTEST.COM with password.
Principal "rangerlookup/127.12.95.84@KRBTEST.COM" created.
Authenticating as principal test-admin/admin@KRBTEST.COM with password.
Entry for principal rangerlookup/127.12.95.84@KRBTEST.COM with kvno 2, encryption type aes256-cts-hmac-sha1-96 added to keytab WRFILE:/tmp/dist-test-taskGoZl2g/test-tmp/ts_authz-itest.1.AuthzProviders_TSAuthzITest.Kudu3661_Ranger.1790236757264992-12669-0/krb5kdc/rangerlookup_127.12.95.84@KRBTEST.COM.keytab.
Entry for principal rangerlookup/127.12.95.84@KRBTEST.COM with kvno 2, encryption type aes128-cts-hmac-sha1-96 added to keytab WRFILE:/tmp/dist-test-taskGoZl2g/test-tmp/ts_authz-itest.1.AuthzProviders_TSAuthzITest.Kudu3661_Ranger.1790236757264992-12669-0/krb5kdc/rangerlookup_127.12.95.84@KRBTEST.COM.keytab.
WARNING: no policy specified for HTTP/127.12.95.84@KRBTEST.COM; defaulting to no policy
Authenticating as principal test-admin/admin@KRBTEST.COM with password.
Principal "HTTP/127.12.95.84@KRBTEST.COM" created.
Authenticating as principal test-admin/admin@KRBTEST.COM with password.
Entry for principal HTTP/127.12.95.84@KRBTEST.COM with kvno 2, encryption type aes256-cts-hmac-sha1-96 added to keytab WRFILE:/tmp/dist-test-taskGoZl2g/test-tmp/ts_authz-itest.1.AuthzProviders_TSAuthzITest.Kudu3661_Ranger.1790236757264992-12669-0/krb5kdc/HTTP_127.12.95.84@KRBTEST.COM.keytab.
Entry for principal HTTP/127.12.95.84@KRBTEST.COM with kvno 2, encryption type aes128-cts-hmac-sha1-96 added to keytab WRFILE:/tmp/dist-test-taskGoZl2g/test-tmp/ts_authz-itest.1.AuthzProviders_TSAuthzITest.Kudu3661_Ranger.1790236757264992-12669-0/krb5kdc/HTTP_127.12.95.84@KRBTEST.COM.keytab.
I20260924 07:59:19.442268 12669 mini_postgres.cc:62] Running initdb...
The files belonging to this database system will be owned by user "slave".
This user must also own the server process.

The database cluster will be initialized with locale "C".
The default database encoding has accordingly been set to "SQL_ASCII".
The default text search configuration will be set to "english".

Data page checksums are disabled.

creating directory /tmp/dist-test-taskGoZl2g/test-tmp/ts_authz-itest.1.AuthzProviders_TSAuthzITest.Kudu3661_Ranger.1790236757264992-12669-0/minicluster-data/postgres ... ok
creating subdirectories ... ok
selecting dynamic shared memory implementation ... posix
selecting default "max_connections" ... 100
selecting default "shared_buffers" ... 128MB
selecting default time zone ... Etc/UTC
creating configuration files ... ok
running bootstrap script ... ok
performing post-bootstrap initialization ... ok
syncing data to disk ... ok

initdb: warning: enabling "trust" authentication for local connections
initdb: hint: You can change this by editing pg_hba.conf or using the option -A, or --auth-local and --auth-host, the next time you run initdb.

Success. You can now start the database server using:

    /tmp/dist-test-taskGoZl2g/build/debug/bin/postgres/pg_ctl -D /tmp/dist-test-taskGoZl2g/test-tmp/ts_authz-itest.1.AuthzProviders_TSAuthzITest.Kudu3661_Ranger.1790236757264992-12669-0/minicluster-data/postgres -l logfile start

2026-09-24 07:59:22.028 UTC [12707] LOG:  starting PostgreSQL 17.2 on x86_64-pc-linux-gnu, compiled by gcc (Ubuntu 7.5.0-3ubuntu1~18.04) 7.5.0, 64-bit
2026-09-24 07:59:22.028 UTC [12707] LOG:  listening on IPv4 address "127.12.95.84", port 42693
2026-09-24 07:59:22.031 UTC [12707] LOG:  listening on Unix socket "/tmp/.s.PGSQL.42693"
2026-09-24 07:59:22.036 UTC [12712] LOG:  database system was shut down at 2026-09-24 07:59:20 UTC
2026-09-24 07:59:22.041 UTC [12707] LOG:  database system is ready to accept connections
I20260924 07:59:23.961424 12669 mini_postgres.cc:96] Postgres bound to 42693
2026-09-24 07:59:23.967 UTC [12718] FATAL:  database "slave" does not exist
127.12.95.84:42693 - accepting connections
I20260924 07:59:23.968098 12669 mini_ranger.cc:162] Starting Ranger...
I20260924 07:59:23.985981 12669 mini_ranger.cc:85] Created miniranger Postgres user
I20260924 07:59:24.056833 12669 mini_ranger.cc:88] Created ranger Postgres database
I20260924 07:59:24.056945 12669 mini_ranger.cc:179] Starting Ranger out of /tmp/dist-test-taskGoZl2g/test-tmp/ts_authz-itest.1.AuthzProviders_TSAuthzITest.Kudu3661_Ranger.1790236757264992-12669-0/minicluster-data/ranger-admin
2026-09-24 07:59:24,511  [I] DB FLAVOR :POSTGRES
2026-09-24 07:59:24,511  [I] --------- Verifying Ranger DB connection ---------
2026-09-24 07:59:24,511  [I] Checking connection..
2026-09-24 07:59:24,512  [JISQL] /usr/lib/jvm/temurin-17-jdk-amd64/bin/java  -cp /tmp/dist-test-taskGoZl2g/build/debug/bin/postgresql.jar:/tmp/dist-test-taskGoZl2g/thirdparty/installed/common/opt/ranger/jisql/lib/* org.apache.util.sql.Jisql -driver postgresql -cstring jdbc:postgresql://127.12.95.84:42693/ranger -u miniranger -p '********' -noheader -trim -c \;  -query "select 1;"
2026-09-24 07:59:24,863  [I] Checking connection passed.
2026-09-24 07:59:24,864  [I] --------- Verifying version history table ---------
2026-09-24 07:59:24,864  [JISQL] /usr/lib/jvm/temurin-17-jdk-amd64/bin/java  -cp /tmp/dist-test-taskGoZl2g/build/debug/bin/postgresql.jar:/tmp/dist-test-taskGoZl2g/thirdparty/installed/common/opt/ranger/jisql/lib/* org.apache.util.sql.Jisql -driver postgresql -cstring jdbc:postgresql://127.12.95.84:42693/ranger -u miniranger -p '********' -noheader -trim -c \;  -query "select * from (select table_name from information_schema.tables where table_catalog='ranger' and table_name = 'x_db_version_h') as temp;"
2026-09-24 07:59:25,175  [I] Table x_db_version_h does not exist in database ranger
2026-09-24 07:59:25,176  [JISQL] /usr/lib/jvm/temurin-17-jdk-amd64/bin/java  -cp /tmp/dist-test-taskGoZl2g/build/debug/bin/postgresql.jar:/tmp/dist-test-taskGoZl2g/thirdparty/installed/common/opt/ranger/jisql/lib/* org.apache.util.sql.Jisql -driver postgresql -cstring jdbc:postgresql://127.12.95.84:42693/ranger -u miniranger -p '********' -noheader -trim -c \;  -query "select * from (select table_name from information_schema.tables where table_catalog='ranger' and table_name = 'x_db_version_h') as temp;"
2026-09-24 07:59:25,473  [I] Table x_db_version_h does not exist in database ranger
2026-09-24 07:59:25,474  [I] Importing x_db_version_h table schema to database ranger from file: create_dbversion_catalog.sql
2026-09-24 07:59:25,474  [JISQL] /usr/lib/jvm/temurin-17-jdk-amd64/bin/java  -cp /tmp/dist-test-taskGoZl2g/build/debug/bin/postgresql.jar:/tmp/dist-test-taskGoZl2g/thirdparty/installed/common/opt/ranger/jisql/lib/* org.apache.util.sql.Jisql -driver postgresql -cstring jdbc:postgresql://127.12.95.84:42693/ranger -u miniranger -p '********' -noheader -trim -c \; -input /tmp/dist-test-taskGoZl2g/thirdparty/installed/common/opt/ranger/db/postgres/create_dbversion_catalog.sql 
2026-09-24 07:59:25.754 UTC [12834] WARNING:  there is no transaction in progress
2026-09-24 07:59:25,779  [I] create_dbversion_catalog.sql file imported successfully
2026-09-24 07:59:25,779  [JISQL] /usr/lib/jvm/temurin-17-jdk-amd64/bin/java  -cp /tmp/dist-test-taskGoZl2g/build/debug/bin/postgresql.jar:/tmp/dist-test-taskGoZl2g/thirdparty/installed/common/opt/ranger/jisql/lib/* org.apache.util.sql.Jisql -driver postgresql -cstring jdbc:postgresql://127.12.95.84:42693/ranger -u miniranger -p '********' -noheader -trim -c \;  -query "select * from (select table_name from information_schema.tables where table_catalog='ranger' and table_name = 'x_db_version_h') as temp;"
2026-09-24 07:59:26,081  [I] Table x_db_version_h already exists in database 'ranger'
2026-09-24 07:59:26,082  [I] --------- Importing Ranger Core DB Schema ---------
2026-09-24 07:59:26,082  [JISQL] /usr/lib/jvm/temurin-17-jdk-amd64/bin/java  -cp /tmp/dist-test-taskGoZl2g/build/debug/bin/postgresql.jar:/tmp/dist-test-taskGoZl2g/thirdparty/installed/common/opt/ranger/jisql/lib/* org.apache.util.sql.Jisql -driver postgresql -cstring jdbc:postgresql://127.12.95.84:42693/ranger -u miniranger -p '********' -noheader -trim -c \;  -query "select version from x_db_version_h where version = 'CORE_DB_SCHEMA' and active = 'Y';"
2026-09-24 07:59:26,392  [JISQL] /usr/lib/jvm/temurin-17-jdk-amd64/bin/java  -cp /tmp/dist-test-taskGoZl2g/build/debug/bin/postgresql.jar:/tmp/dist-test-taskGoZl2g/thirdparty/installed/common/opt/ranger/jisql/lib/* org.apache.util.sql.Jisql -driver postgresql -cstring jdbc:postgresql://127.12.95.84:42693/ranger -u miniranger -p '********' -noheader -trim -c \;  -query "select version from x_db_version_h where version = 'CORE_DB_SCHEMA' and active = 'N';"
2026-09-24 07:59:26,731  [JISQL] /usr/lib/jvm/temurin-17-jdk-amd64/bin/java  -cp /tmp/dist-test-taskGoZl2g/build/debug/bin/postgresql.jar:/tmp/dist-test-taskGoZl2g/thirdparty/installed/common/opt/ranger/jisql/lib/* org.apache.util.sql.Jisql -driver postgresql -cstring jdbc:postgresql://127.12.95.84:42693/ranger -u miniranger -p '********' -noheader -trim -c \;  -query "insert into x_db_version_h (version, inst_at, inst_by, updated_at, updated_by,active) values ('CORE_DB_SCHEMA', current_timestamp, 'Ranger 2.6.0', current_timestamp, 'dist-test-slave-hwwr.c.gcp-upstream.internal','N') ;"
2026-09-24 07:59:27,062  [JISQL] /usr/lib/jvm/temurin-17-jdk-amd64/bin/java  -cp /tmp/dist-test-taskGoZl2g/build/debug/bin/postgresql.jar:/tmp/dist-test-taskGoZl2g/thirdparty/installed/common/opt/ranger/jisql/lib/* org.apache.util.sql.Jisql -driver postgresql -cstring jdbc:postgresql://127.12.95.84:42693/ranger -u miniranger -p '********' -noheader -trim -c \;  -query "select * from (select table_name from information_schema.tables where table_catalog='ranger' and table_name = 'x_portal_user') as temp;"
2026-09-24 07:59:27,357  [I] Table x_portal_user does not exist in database ranger
2026-09-24 07:59:27,357  [JISQL] /usr/lib/jvm/temurin-17-jdk-amd64/bin/java  -cp /tmp/dist-test-taskGoZl2g/build/debug/bin/postgresql.jar:/tmp/dist-test-taskGoZl2g/thirdparty/installed/common/opt/ranger/jisql/lib/* org.apache.util.sql.Jisql -driver postgresql -cstring jdbc:postgresql://127.12.95.84:42693/ranger -u miniranger -p '********' -noheader -trim -c \;  -query "select * from (select table_name from information_schema.tables where table_catalog='ranger' and table_name = 'x_policy_ref_group') as temp;"
2026-09-24 07:59:27,667  [I] Table x_policy_ref_group does not exist in database ranger
2026-09-24 07:59:27,667  [JISQL] /usr/lib/jvm/temurin-17-jdk-amd64/bin/java  -cp /tmp/dist-test-taskGoZl2g/build/debug/bin/postgresql.jar:/tmp/dist-test-taskGoZl2g/thirdparty/installed/common/opt/ranger/jisql/lib/* org.apache.util.sql.Jisql -driver postgresql -cstring jdbc:postgresql://127.12.95.84:42693/ranger -u miniranger -p '********' -noheader -trim -c \;  -query "select version from x_db_version_h where version = 'DB_PATCHES' and active = 'Y';"
2026-09-24 07:59:28,031  [JISQL] /usr/lib/jvm/temurin-17-jdk-amd64/bin/java  -cp /tmp/dist-test-taskGoZl2g/build/debug/bin/postgresql.jar:/tmp/dist-test-taskGoZl2g/thirdparty/installed/common/opt/ranger/jisql/lib/* org.apache.util.sql.Jisql -driver postgresql -cstring jdbc:postgresql://127.12.95.84:42693/ranger -u miniranger -p '********' -noheader -trim -c \;  -query "select version from x_db_version_h where version = 'JAVA_PATCHES' and active = 'Y';"
2026-09-24 07:59:28,315  [I] Importing DB schema to database ranger from file: ranger_core_db_postgres.sql
2026-09-24 07:59:28,315  [JISQL] /usr/lib/jvm/temurin-17-jdk-amd64/bin/java  -cp /tmp/dist-test-taskGoZl2g/build/debug/bin/postgresql.jar:/tmp/dist-test-taskGoZl2g/thirdparty/installed/common/opt/ranger/jisql/lib/* org.apache.util.sql.Jisql -driver postgresql -cstring jdbc:postgresql://127.12.95.84:42693/ranger -u miniranger -p '********' -noheader -trim -c \; -input /tmp/dist-test-taskGoZl2g/thirdparty/installed/common/opt/ranger/db/postgres/optimized/current/ranger_core_db_postgres.sql 
2026-09-24 07:59:29.134 UTC [13032] WARNING:  there is no transaction in progress
2026-09-24 07:59:29.145 UTC [13032] WARNING:  there is no transaction in progress
2026-09-24 07:59:29.157 UTC [13032] WARNING:  there is no transaction in progress
2026-09-24 07:59:29.168 UTC [13032] WARNING:  there is no transaction in progress
2026-09-24 07:59:29.179 UTC [13032] WARNING:  there is no transaction in progress
2026-09-24 07:59:29.190 UTC [13032] WARNING:  there is no transaction in progress
2026-09-24 07:59:29.237 UTC [13032] WARNING:  there is no transaction in progress
2026-09-24 07:59:29.243 UTC [13032] WARNING:  there is no transaction in progress
2026-09-24 07:59:29.254 UTC [13032] WARNING:  there is no transaction in progress
2026-09-24 07:59:29.263 UTC [13032] WARNING:  there is no transaction in progress
2026-09-24 07:59:29.272 UTC [13032] WARNING:  there is no transaction in progress
2026-09-24 07:59:29.282 UTC [13032] WARNING:  there is no transaction in progress
2026-09-24 07:59:29.289 UTC [13032] WARNING:  there is no transaction in progress
2026-09-24 07:59:29.298 UTC [13032] WARNING:  there is no transaction in progress
2026-09-24 07:59:29.303 UTC [13032] WARNING:  there is no transaction in progress
2026-09-24 07:59:29.311 UTC [13032] WARNING:  there is no transaction in progress
2026-09-24 07:59:29.317 UTC [13032] WARNING:  there is no transaction in progress
2026-09-24 07:59:29.324 UTC [13032] WARNING:  there is no transaction in progress
2026-09-24 07:59:29.329 UTC [13032] WARNING:  there is no transaction in progress
2026-09-24 07:59:29.335 UTC [13032] WARNING:  there is no transaction in progress
2026-09-24 07:59:29.339 UTC [13032] WARNING:  there is no transaction in progress
2026-09-24 07:59:29.343 UTC [13032] WARNING:  there is no transaction in progress
2026-09-24 07:59:29,777  [I] ranger_core_db_postgres.sql file imported successfully
2026-09-24 07:59:29,777  [JISQL] /usr/lib/jvm/temurin-17-jdk-amd64/bin/java  -cp /tmp/dist-test-taskGoZl2g/build/debug/bin/postgresql.jar:/tmp/dist-test-taskGoZl2g/thirdparty/installed/common/opt/ranger/jisql/lib/* org.apache.util.sql.Jisql -driver postgresql -cstring jdbc:postgresql://127.12.95.84:42693/ranger -u miniranger -p '********' -noheader -trim -c \;  -query "update x_db_version_h set inst_by='Ranger 2.6.0' where active='Y' and updated_by='localhost';"
2026-09-24 07:59:30,106  [I] Patches status entries updated from base ranger version to current installed ranger version:Ranger 2.6.0
2026-09-24 07:59:30,107  [JISQL] /usr/lib/jvm/temurin-17-jdk-amd64/bin/java  -cp /tmp/dist-test-taskGoZl2g/build/debug/bin/postgresql.jar:/tmp/dist-test-taskGoZl2g/thirdparty/installed/common/opt/ranger/jisql/lib/* org.apache.util.sql.Jisql -driver postgresql -cstring jdbc:postgresql://127.12.95.84:42693/ranger -u miniranger -p '********' -noheader -trim -c \;  -query "select * from (select table_name from information_schema.tables where table_catalog='ranger' and table_name = 'x_portal_user') as temp;"
2026-09-24 07:59:30,411  [I] Table x_portal_user already exists in database 'ranger'
2026-09-24 07:59:30,412  [JISQL] /usr/lib/jvm/temurin-17-jdk-amd64/bin/java  -cp /tmp/dist-test-taskGoZl2g/build/debug/bin/postgresql.jar:/tmp/dist-test-taskGoZl2g/thirdparty/installed/common/opt/ranger/jisql/lib/* org.apache.util.sql.Jisql -driver postgresql -cstring jdbc:postgresql://127.12.95.84:42693/ranger -u miniranger -p '********' -noheader -trim -c \;  -query "select * from (select table_name from information_schema.tables where table_catalog='ranger' and table_name = 'x_policy_ref_group') as temp;"
2026-09-24 07:59:30,712  [I] Table x_policy_ref_group already exists in database 'ranger'
2026-09-24 07:59:30,712  [JISQL] /usr/lib/jvm/temurin-17-jdk-amd64/bin/java  -cp /tmp/dist-test-taskGoZl2g/build/debug/bin/postgresql.jar:/tmp/dist-test-taskGoZl2g/thirdparty/installed/common/opt/ranger/jisql/lib/* org.apache.util.sql.Jisql -driver postgresql -cstring jdbc:postgresql://127.12.95.84:42693/ranger -u miniranger -p '********' -noheader -trim -c \;  -query "select version from x_db_version_h where version = 'DB_PATCHES' and active = 'Y';"
2026-09-24 07:59:31,047  [JISQL] /usr/lib/jvm/temurin-17-jdk-amd64/bin/java  -cp /tmp/dist-test-taskGoZl2g/build/debug/bin/postgresql.jar:/tmp/dist-test-taskGoZl2g/thirdparty/installed/common/opt/ranger/jisql/lib/* org.apache.util.sql.Jisql -driver postgresql -cstring jdbc:postgresql://127.12.95.84:42693/ranger -u miniranger -p '********' -noheader -trim -c \;  -query "select version from x_db_version_h where version = 'JAVA_PATCHES' and active = 'Y';"
2026-09-24 07:59:31,374  [JISQL] /usr/lib/jvm/temurin-17-jdk-amd64/bin/java  -cp /tmp/dist-test-taskGoZl2g/build/debug/bin/postgresql.jar:/tmp/dist-test-taskGoZl2g/thirdparty/installed/common/opt/ranger/jisql/lib/* org.apache.util.sql.Jisql -driver postgresql -cstring jdbc:postgresql://127.12.95.84:42693/ranger -u miniranger -p '********' -noheader -trim -c \;  -query "update x_db_version_h set active='Y' where version='CORE_DB_SCHEMA' and active='N' and updated_by='dist-test-slave-hwwr.c.gcp-upstream.internal';"
2026-09-24 07:59:31,702  [I] CORE_DB_SCHEMA import status has been updated
2026-09-24 07:59:31,702  [JISQL] /usr/lib/jvm/temurin-17-jdk-amd64/bin/java  -cp /tmp/dist-test-taskGoZl2g/build/debug/bin/postgresql.jar:/tmp/dist-test-taskGoZl2g/thirdparty/installed/common/opt/ranger/jisql/lib/* org.apache.util.sql.Jisql -driver postgresql -cstring jdbc:postgresql://127.12.95.84:42693/ranger -u miniranger -p '********' -noheader -trim -c \;  -query "select version from x_db_version_h where version = 'DB_PATCHES' and inst_by = 'Ranger 2.6.0' and active = 'Y';"
2026-09-24 07:59:32,057  [I] DB_PATCHES have already been applied
I20260924 07:59:32.063524 12669 mini_ranger.cc:192] Using Ranger class path: /tmp/dist-test-taskGoZl2g/test-tmp/ts_authz-itest.1.AuthzProviders_TSAuthzITest.Kudu3661_Ranger.1790236757264992-12669-0/minicluster-data/ranger-admin:/tmp/dist-test-taskGoZl2g/thirdparty/installed/common/opt/ranger/ews/lib/*:/usr/lib/jvm/temurin-17-jdk-amd64/lib/*:/tmp/dist-test-taskGoZl2g/thirdparty/installed/common/opt/hadoop/*:/tmp/dist-test-taskGoZl2g/build/debug/bin/postgresql.jar:/tmp/dist-test-taskGoZl2g/thirdparty/installed/common/opt/ranger/ews/webapp
I20260924 07:59:32.063599 12669 mini_ranger.cc:194] Using host: 127.12.95.84
I20260924 07:59:32.066372 12669 mini_ranger.cc:240] Ranger admin URL: http://127.12.95.84:44235
Sep 24, 2026 7:59:32 AM org.apache.ranger.server.tomcat.EmbeddedServer getKeyManagers
WARNING: Config 'ranger.keystore.file' or 'ranger.service.https.attrib.keystore.file' is not found or contains blank value
Sep 24, 2026 7:59:32 AM org.apache.ranger.server.tomcat.EmbeddedServer getTrustManagers
WARNING: Config 'ranger.truststore.file' is not found or contains blank value!
Sep 24, 2026 7:59:33 AM org.apache.ranger.server.tomcat.EmbeddedServer start
INFO: Deriving webapp folder from catalina.base property. folder=/tmp/dist-test-taskGoZl2g/test-tmp/ts_authz-itest.1.AuthzProviders_TSAuthzITest.Kudu3661_Ranger.1790236757264992-12669-0/minicluster-data/ranger-admin/ews/webapp
Sep 24, 2026 7:59:33 AM org.apache.ranger.server.tomcat.EmbeddedServer start
INFO: Webapp file =/tmp/dist-test-taskGoZl2g/test-tmp/ts_authz-itest.1.AuthzProviders_TSAuthzITest.Kudu3661_Ranger.1790236757264992-12669-0/minicluster-data/ranger-admin/ews/webapp, webAppName = /
Sep 24, 2026 7:59:33 AM org.apache.ranger.server.tomcat.EmbeddedServer start
INFO: Adding webapp [/] = path [/tmp/dist-test-taskGoZl2g/test-tmp/ts_authz-itest.1.AuthzProviders_TSAuthzITest.Kudu3661_Ranger.1790236757264992-12669-0/minicluster-data/ranger-admin/ews/webapp] .....
Sep 24, 2026 7:59:33 AM org.apache.catalina.core.StandardContext setPath
WARNING: A context path must either be an empty string or start with a '/' and do not end with a '/'. The path [/] does not meet these criteria and has been changed to []
Sep 24, 2026 7:59:33 AM org.apache.ranger.server.tomcat.EmbeddedServer start
INFO: Finished init of webapp [/] = path [/tmp/dist-test-taskGoZl2g/test-tmp/ts_authz-itest.1.AuthzProviders_TSAuthzITest.Kudu3661_Ranger.1790236757264992-12669-0/minicluster-data/ranger-admin/ews/webapp].
Sep 24, 2026 7:59:33 AM org.apache.ranger.server.tomcat.EmbeddedServer startServer
INFO: Server Name : miniranger
Sep 24, 2026 7:59:33 AM org.apache.coyote.AbstractProtocol init
INFO: Initializing ProtocolHandler ["http-nio-44235"]
Sep 24, 2026 7:59:33 AM org.apache.catalina.util.LifecycleBase handleSubClassException
SEVERE: Failed to initialize component [Connector["http-nio-44235"]]
org.apache.catalina.LifecycleException: Protocol handler initialization failed
	at org.apache.catalina.connector.Connector.initInternal(Connector.java:1027)
	at org.apache.catalina.util.LifecycleBase.init(LifecycleBase.java:122)
	at org.apache.catalina.core.StandardService.initInternal(StandardService.java:525)
	at org.apache.catalina.util.LifecycleBase.init(LifecycleBase.java:122)
	at org.apache.catalina.core.StandardServer.initInternal(StandardServer.java:986)
	at org.apache.catalina.util.LifecycleBase.init(LifecycleBase.java:122)
	at org.apache.catalina.util.LifecycleBase.start(LifecycleBase.java:155)
	at org.apache.catalina.startup.Tomcat.start(Tomcat.java:438)
	at org.apache.ranger.server.tomcat.EmbeddedServer.startServer(EmbeddedServer.java:351)
	at org.apache.ranger.server.tomcat.EmbeddedServer.start(EmbeddedServer.java:317)
	at org.apache.ranger.server.tomcat.EmbeddedServer.main(EmbeddedServer.java:95)
Caused by: java.net.BindException: Address already in use
	at java.base/sun.nio.ch.Net.bind0(Native Method)
	at java.base/sun.nio.ch.Net.bind(Net.java:567)
	at java.base/sun.nio.ch.ServerSocketChannelImpl.netBind(ServerSocketChannelImpl.java:337)
	at java.base/sun.nio.ch.ServerSocketChannelImpl.bind(ServerSocketChannelImpl.java:294)
	at org.apache.tomcat.util.net.NioEndpoint.initServerSocket(NioEndpoint.java:268)
	at org.apache.tomcat.util.net.NioEndpoint.bind(NioEndpoint.java:223)
	at org.apache.tomcat.util.net.AbstractEndpoint.bindWithCleanup(AbstractEndpoint.java:1373)
	at org.apache.tomcat.util.net.AbstractEndpoint.init(AbstractEndpoint.java:1386)
	at org.apache.coyote.AbstractProtocol.init(AbstractProtocol.java:663)
	at org.apache.coyote.http11.AbstractHttp11Protocol.init(AbstractHttp11Protocol.java:80)
	at org.apache.catalina.connector.Connector.initInternal(Connector.java:1025)
	... 10 more

Sep 24, 2026 7:59:33 AM org.apache.catalina.core.StandardService startInternal
INFO: Starting service [Tomcat]
Sep 24, 2026 7:59:33 AM org.apache.catalina.core.StandardEngine startInternal
INFO: Starting Servlet engine: [Apache Tomcat/9.0.98]
Sep 24, 2026 7:59:34 AM org.apache.catalina.startup.ContextConfig getDefaultWebXmlFragment
INFO: No global web.xml found
Sep 24, 2026 7:59:39 AM org.apache.jasper.servlet.TldScanner scanJars
INFO: At least one JAR was scanned for TLDs yet contained no TLDs. Enable debug logging for this logger for a complete list of JARs that were scanned but no TLDs were found in them. Skipping unneeded JARs during scanning can improve startup time and JSP compilation time.
Sep 24, 2026 7:59:39 AM org.apache.catalina.core.ApplicationContext log
INFO: Initializing Spring root WebApplicationContext
[EL Warning]: metadata: 2026-09-24 07:59:44.056--ServerSession(266738123)--You have specified multiple ids for the entity class [org.apache.ranger.entity.view.VXXPrincipal] without specifying an @IdClass. By doing this you may lose the ability to find by identity, distributed cache support etc. Note: You may however use EntityManager find operations by passing a list of primary key fields. Else, you will have to use JPQL queries to read your entities. For other id options see @PrimaryKey.
Sep 24, 2026 8:00:04 AM com.sun.jersey.api.core.PackagesResourceConfig init
INFO: Scanning for root resource and provider classes in the packages:
  org.apache.ranger.rest
  org.apache.ranger.common
  xa.rest
Sep 24, 2026 8:00:04 AM com.sun.jersey.api.core.ScanningResourceConfig logClasses
INFO: Root resource classes found:
  class org.apache.ranger.rest.PublicAPIsv2
  class org.apache.ranger.rest.XUserREST
  class org.apache.ranger.rest.MetricsREST
  class org.apache.ranger.rest.TagREST
  class org.apache.ranger.rest.ServiceREST
  class org.apache.ranger.rest.UserREST
  class org.apache.ranger.rest.XAuditREST
  class org.apache.ranger.rest.AssetREST
  class org.apache.ranger.rest.XKeyREST
  class org.apache.ranger.rest.RoleREST
  class org.apache.ranger.rest.SecurityZoneREST
  class org.apache.ranger.rest.PublicAPIs
Sep 24, 2026 8:00:04 AM com.sun.jersey.api.core.ScanningResourceConfig logClasses
INFO: Provider classes found:
  class org.apache.ranger.common.RangerJsonParserExceptionMapper
  class org.apache.ranger.common.RangerJsonMappingExceptionMapper
  class org.apache.ranger.common.RangerJAXBContextResolver
  class org.apache.ranger.common.RangerJsonProvider
Sep 24, 2026 8:00:04 AM com.sun.jersey.spi.spring.container.servlet.SpringServlet getContext
INFO: Using default applicationContext
Sep 24, 2026 8:00:04 AM com.sun.jersey.spi.spring.container.SpringComponentProviderFactory registerSpringBeans
INFO: Registering Spring bean, rangerJsonMappingExceptionMapper, of type org.apache.ranger.common.RangerJsonMappingExceptionMapper as a provider class
Sep 24, 2026 8:00:04 AM com.sun.jersey.spi.spring.container.SpringComponentProviderFactory registerSpringBeans
INFO: Registering Spring bean, rangerJsonParserExceptionMapper, of type org.apache.ranger.common.RangerJsonParserExceptionMapper as a provider class
Sep 24, 2026 8:00:04 AM com.sun.jersey.spi.spring.container.SpringComponentProviderFactory registerSpringBeans
INFO: Registering Spring bean, rangerJsonProvider, of type org.apache.ranger.common.RangerJsonProvider as a provider class
Sep 24, 2026 8:00:04 AM com.sun.jersey.spi.spring.container.SpringComponentProviderFactory registerSpringBeans
INFO: Registering Spring bean, assetREST, of type org.apache.ranger.rest.AssetREST as a root resource class
Sep 24, 2026 8:00:04 AM com.sun.jersey.spi.spring.container.SpringComponentProviderFactory registerSpringBeans
INFO: Registering Spring bean, metricsREST, of type org.apache.ranger.rest.MetricsREST as a root resource class
Sep 24, 2026 8:00:04 AM com.sun.jersey.spi.spring.container.SpringComponentProviderFactory registerSpringBeans
INFO: Registering Spring bean, publicAPIs, of type org.apache.ranger.rest.PublicAPIs as a root resource class
Sep 24, 2026 8:00:04 AM com.sun.jersey.spi.spring.container.SpringComponentProviderFactory registerSpringBeans
INFO: Registering Spring bean, publicAPIsv2, of type org.apache.ranger.rest.PublicAPIsv2 as a root resource class
Sep 24, 2026 8:00:04 AM com.sun.jersey.spi.spring.container.SpringComponentProviderFactory registerSpringBeans
INFO: Registering Spring bean, roleREST, of type org.apache.ranger.rest.RoleREST as a root resource class
Sep 24, 2026 8:00:04 AM com.sun.jersey.spi.spring.container.SpringComponentProviderFactory registerSpringBeans
INFO: Registering Spring bean, securityZoneREST, of type org.apache.ranger.rest.SecurityZoneREST as a root resource class
Sep 24, 2026 8:00:04 AM com.sun.jersey.spi.spring.container.SpringComponentProviderFactory registerSpringBeans
INFO: Registering Spring bean, serviceREST, of type org.apache.ranger.rest.ServiceREST as a root resource class
Sep 24, 2026 8:00:04 AM com.sun.jersey.spi.spring.container.SpringComponentProviderFactory registerSpringBeans
INFO: Registering Spring bean, tagREST, of type org.apache.ranger.rest.TagREST as a root resource class
Sep 24, 2026 8:00:04 AM com.sun.jersey.spi.spring.container.SpringComponentProviderFactory registerSpringBeans
INFO: Registering Spring bean, userREST, of type org.apache.ranger.rest.UserREST as a root resource class
Sep 24, 2026 8:00:04 AM com.sun.jersey.spi.spring.container.SpringComponentProviderFactory registerSpringBeans
INFO: Registering Spring bean, XAuditREST, of type org.apache.ranger.rest.XAuditREST as a root resource class
Sep 24, 2026 8:00:04 AM com.sun.jersey.spi.spring.container.SpringComponentProviderFactory registerSpringBeans
INFO: Registering Spring bean, XKeyREST, of type org.apache.ranger.rest.XKeyREST as a root resource class
Sep 24, 2026 8:00:04 AM com.sun.jersey.spi.spring.container.SpringComponentProviderFactory registerSpringBeans
INFO: Registering Spring bean, XUserREST, of type org.apache.ranger.rest.XUserREST as a root resource class
Sep 24, 2026 8:00:04 AM com.sun.jersey.server.impl.application.WebApplicationImpl _initiate
INFO: Initiating Jersey application, version 'Jersey: 1.19.4 05/24/2017 03:20 PM'
Sep 24, 2026 8:00:05 AM com.sun.jersey.spi.inject.Errors processErrorMessages
WARNING: The following warnings have been detected with resource and/or provider classes:
  WARNING: A HTTP GET method, public void org.apache.ranger.rest.RoleREST.getRolesInJson(javax.servlet.http.HttpServletRequest,javax.servlet.http.HttpServletResponse), MUST return a non-void type.
  WARNING: A HTTP GET method, public void org.apache.ranger.rest.ServiceREST.getPoliciesInExcel(javax.servlet.http.HttpServletRequest,javax.servlet.http.HttpServletResponse), MUST return a non-void type.
  WARNING: A HTTP GET method, public void org.apache.ranger.rest.ServiceREST.getPoliciesInCsv(javax.servlet.http.HttpServletRequest,javax.servlet.http.HttpServletResponse) throws java.io.IOException, MUST return a non-void type.
  WARNING: A HTTP GET method, public void org.apache.ranger.rest.ServiceREST.getPoliciesInJson(javax.servlet.http.HttpServletRequest,javax.servlet.http.HttpServletResponse,java.lang.Boolean), MUST return a non-void type.
I20260924 08:01:33.442538 12669 mini_ranger.cc:161] Time spent starting Ranger: real 129.474s	user 0.010s	sys 0.092s
/home/jenkins-slave/workspace/build_and_test_flaky/src/kudu/integration-tests/external_mini_cluster-itest-base.cc:66: Failure
Failed
Bad status: Timed out: Failed to start the Ranger service: process with PID 13189 is not yet bound to any port at the specified addresses; last attempt running lsof returned 'Not found: could not find pattern of a bound port in lsof output: p13189
f334
n127.0.0.1:45028->127.12.95.84:42693
f335
n127.0.0.1:45038->127.12.95.84:42693
f336
n127.0.0.1:45048->127.12.95.84:42693
f337
n127.0.0.1:45058->127.12.95.84:42693
f338
n127.0.0.1:45064->127.12.95.84:42693'
/home/jenkins-slave/workspace/build_and_test_flaky/src/kudu/integration-tests/ts_authz-itest.cc:470: Failure
Expected: StartClusterWithOpts(std::move(opts)) doesn't generate new fatal failures in the current thread.
  Actual: it does.
I20260924 08:01:33.443431 12669 external_mini_cluster-itest-base.cc:80] Found fatal failure
I20260924 08:01:33.445158 12669 mini_ranger.cc:67] Stopping Ranger...
I20260924 08:01:33.486178 12669 mini_ranger.cc:69] Stopped Ranger
2026-09-24 08:01:33.486 UTC [12707] LOG:  received smart shutdown request
2026-09-24 08:01:33.490 UTC [12707] LOG:  background worker "logical replication launcher" (PID 12715) exited with exit code 1
2026-09-24 08:01:33.490 UTC [12710] LOG:  shutting down
2026-09-24 08:01:33.493 UTC [12710] LOG:  checkpoint starting: shutdown immediate
2026-09-24 08:01:33.970 UTC [12710] LOG:  checkpoint complete: wrote 1511 buffers (9.2%); 0 WAL file(s) added, 0 removed, 0 recycled; write=0.025 s, sync=0.447 s, total=0.480 s; sync files=848, longest=0.005 s, average=0.001 s; distance=8863 kB, estimate=8863 kB; lsn=0/1D225D8, redo lsn=0/1D225D8
2026-09-24 08:01:33.977 UTC [12707] LOG:  database system is shut down
2026-09-24T08:01:33Z chronyd exiting
I20260924 08:01:33.994340 12669 test_util.cc:182] -----------------------------------------------
I20260924 08:01:33.994426 12669 test_util.cc:183] Had failures, leaving test files at /tmp/dist-test-taskGoZl2g/test-tmp/ts_authz-itest.1.AuthzProviders_TSAuthzITest.Kudu3661_Ranger.1790236757264992-12669-0
[  FAILED  ] AuthzProviders/TSAuthzITest.Kudu3661/Ranger, where GetParam() = 0 (136720 ms)
[ RUN      ] AuthzProviders/TSAuthzITest.TableScanCLI/Ranger
Loading random data
Initializing database '/tmp/dist-test-taskGoZl2g/test-tmp/ts_authz-itest.1.AuthzProviders_TSAuthzITest.TableScanCLI_Ranger.1790236757264992-12669-0/krb5kdc/principal' for realm 'KRBTEST.COM',
master key name 'K/M@KRBTEST.COM'
Sep 24 08:01:34 dist-test-slave-hwwr krb5kdc[13346](info): setting up network...
krb5kdc: setsockopt(10,IPV6_V6ONLY,1) worked
Sep 24 08:01:34 dist-test-slave-hwwr krb5kdc[13346](info): set up 2 sockets
Sep 24 08:01:34 dist-test-slave-hwwr krb5kdc[13346](info): commencing operation
krb5kdc: starting...
W20260924 08:01:36.009752 12669 mini_kdc.cc:121] Time spent starting KDC: real 2.014s	user 0.000s	sys 0.007s
WARNING: no policy specified for test-admin@KRBTEST.COM; defaulting to no policy
Authenticating as principal slave/admin@KRBTEST.COM with password.
Principal "test-admin@KRBTEST.COM" created.
WARNING: no policy specified for test-user@KRBTEST.COM; defaulting to no policy
Authenticating as principal slave/admin@KRBTEST.COM with password.
Principal "test-user@KRBTEST.COM" created.
WARNING: no policy specified for joe-interloper@KRBTEST.COM; defaulting to no policy
Authenticating as principal slave/admin@KRBTEST.COM with password.
Principal "joe-interloper@KRBTEST.COM" created.
Authenticating as principal slave/admin@KRBTEST.COM with password.
Entry for principal test-user with kvno 1, encryption type aes256-cts-hmac-sha1-96 added to keytab WRFILE:/tmp/dist-test-taskGoZl2g/test-tmp/ts_authz-itest.1.AuthzProviders_TSAuthzITest.TableScanCLI_Ranger.1790236757264992-12669-0/krb5kdc/test-user.keytab.
Entry for principal test-user with kvno 1, encryption type aes128-cts-hmac-sha1-96 added to keytab WRFILE:/tmp/dist-test-taskGoZl2g/test-tmp/ts_authz-itest.1.AuthzProviders_TSAuthzITest.TableScanCLI_Ranger.1790236757264992-12669-0/krb5kdc/test-user.keytab.
Sep 24 08:01:36 dist-test-slave-hwwr krb5kdc[13346](info): AS_REQ (2 etypes {17 16}) 127.0.0.1: ISSUE: authtime 1790236896, etypes {rep=17 tkt=17 ses=17}, test-admin@KRBTEST.COM for krbtgt/KRBTEST.COM@KRBTEST.COM
Password for test-admin@KRBTEST.COM: 
2026-09-24T08:01:36Z chronyd version 4.6.1 starting (+CMDMON +NTP +REFCLOCK +RTC -PRIVDROP -SCFILTER -SIGND +ASYNCDNS -NTS -SECHASH -IPV6 +DEBUG)
2026-09-24T08:01:36Z Disabled control of system clock
WARNING: no policy specified for rangeradmin/127.12.95.84@KRBTEST.COM; defaulting to no policy
Authenticating as principal test-admin/admin@KRBTEST.COM with password.
Principal "rangeradmin/127.12.95.84@KRBTEST.COM" created.
Authenticating as principal test-admin/admin@KRBTEST.COM with password.
Entry for principal rangeradmin/127.12.95.84@KRBTEST.COM with kvno 2, encryption type aes256-cts-hmac-sha1-96 added to keytab WRFILE:/tmp/dist-test-taskGoZl2g/test-tmp/ts_authz-itest.1.AuthzProviders_TSAuthzITest.TableScanCLI_Ranger.1790236757264992-12669-0/krb5kdc/rangeradmin_127.12.95.84@KRBTEST.COM.keytab.
Entry for principal rangeradmin/127.12.95.84@KRBTEST.COM with kvno 2, encryption type aes128-cts-hmac-sha1-96 added to keytab WRFILE:/tmp/dist-test-taskGoZl2g/test-tmp/ts_authz-itest.1.AuthzProviders_TSAuthzITest.TableScanCLI_Ranger.1790236757264992-12669-0/krb5kdc/rangeradmin_127.12.95.84@KRBTEST.COM.keytab.
WARNING: no policy specified for rangerlookup/127.12.95.84@KRBTEST.COM; defaulting to no policy
Authenticating as principal test-admin/admin@KRBTEST.COM with password.
Principal "rangerlookup/127.12.95.84@KRBTEST.COM" created.
Authenticating as principal test-admin/admin@KRBTEST.COM with password.
Entry for principal rangerlookup/127.12.95.84@KRBTEST.COM with kvno 2, encryption type aes256-cts-hmac-sha1-96 added to keytab WRFILE:/tmp/dist-test-taskGoZl2g/test-tmp/ts_authz-itest.1.AuthzProviders_TSAuthzITest.TableScanCLI_Ranger.1790236757264992-12669-0/krb5kdc/rangerlookup_127.12.95.84@KRBTEST.COM.keytab.
Entry for principal rangerlookup/127.12.95.84@KRBTEST.COM with kvno 2, encryption type aes128-cts-hmac-sha1-96 added to keytab WRFILE:/tmp/dist-test-taskGoZl2g/test-tmp/ts_authz-itest.1.AuthzProviders_TSAuthzITest.TableScanCLI_Ranger.1790236757264992-12669-0/krb5kdc/rangerlookup_127.12.95.84@KRBTEST.COM.keytab.
WARNING: no policy specified for HTTP/127.12.95.84@KRBTEST.COM; defaulting to no policy
Authenticating as principal test-admin/admin@KRBTEST.COM with password.
Principal "HTTP/127.12.95.84@KRBTEST.COM" created.
Authenticating as principal test-admin/admin@KRBTEST.COM with password.
Entry for principal HTTP/127.12.95.84@KRBTEST.COM with kvno 2, encryption type aes256-cts-hmac-sha1-96 added to keytab WRFILE:/tmp/dist-test-taskGoZl2g/test-tmp/ts_authz-itest.1.AuthzProviders_TSAuthzITest.TableScanCLI_Ranger.1790236757264992-12669-0/krb5kdc/HTTP_127.12.95.84@KRBTEST.COM.keytab.
Entry for principal HTTP/127.12.95.84@KRBTEST.COM with kvno 2, encryption type aes128-cts-hmac-sha1-96 added to keytab WRFILE:/tmp/dist-test-taskGoZl2g/test-tmp/ts_authz-itest.1.AuthzProviders_TSAuthzITest.TableScanCLI_Ranger.1790236757264992-12669-0/krb5kdc/HTTP_127.12.95.84@KRBTEST.COM.keytab.
I20260924 08:01:36.172261 12669 mini_postgres.cc:62] Running initdb...
The files belonging to this database system will be owned by user "slave".
This user must also own the server process.

The database cluster will be initialized with locale "C".
The default database encoding has accordingly been set to "SQL_ASCII".
The default text search configuration will be set to "english".

Data page checksums are disabled.

creating directory /tmp/dist-test-taskGoZl2g/test-tmp/ts_authz-itest.1.AuthzProviders_TSAuthzITest.TableScanCLI_Ranger.1790236757264992-12669-0/minicluster-data/postgres ... ok
creating subdirectories ... ok
selecting dynamic shared memory implementation ... posix
selecting default "max_connections" ... 100
selecting default "shared_buffers" ... 128MB
selecting default time zone ... Etc/UTC
creating configuration files ... ok
running bootstrap script ... ok
performing post-bootstrap initialization ... ok
syncing data to disk ... ok

initdb: warning: enabling "trust" authentication for local connections
initdb: hint: You can change this by editing pg_hba.conf or using the option -A, or --auth-local and --auth-host, the next time you run initdb.

Success. You can now start the database server using:

    /tmp/dist-test-taskGoZl2g/build/debug/bin/postgres/pg_ctl -D /tmp/dist-test-taskGoZl2g/test-tmp/ts_authz-itest.1.AuthzProviders_TSAuthzITest.TableScanCLI_Ranger.1790236757264992-12669-0/minicluster-data/postgres -l logfile start

2026-09-24 08:01:38.833 UTC [13377] LOG:  starting PostgreSQL 17.2 on x86_64-pc-linux-gnu, compiled by gcc (Ubuntu 7.5.0-3ubuntu1~18.04) 7.5.0, 64-bit
2026-09-24 08:01:38.833 UTC [13377] LOG:  listening on IPv4 address "127.12.95.84", port 38557
2026-09-24 08:01:38.838 UTC [13377] LOG:  listening on Unix socket "/tmp/.s.PGSQL.38557"
2026-09-24 08:01:38.843 UTC [13382] LOG:  database system was shut down at 2026-09-24 08:01:37 UTC
2026-09-24 08:01:38.848 UTC [13377] LOG:  database system is ready to accept connections
I20260924 08:01:40.761373 12669 mini_postgres.cc:96] Postgres bound to 38557
2026-09-24 08:01:40.767 UTC [13388] FATAL:  database "slave" does not exist
127.12.95.84:38557 - accepting connections
I20260924 08:01:40.767822 12669 mini_ranger.cc:162] Starting Ranger...
I20260924 08:01:40.786046 12669 mini_ranger.cc:85] Created miniranger Postgres user
I20260924 08:01:40.859170 12669 mini_ranger.cc:88] Created ranger Postgres database
I20260924 08:01:40.859269 12669 mini_ranger.cc:179] Starting Ranger out of /tmp/dist-test-taskGoZl2g/test-tmp/ts_authz-itest.1.AuthzProviders_TSAuthzITest.TableScanCLI_Ranger.1790236757264992-12669-0/minicluster-data/ranger-admin
2026-09-24 08:01:41,249  [I] DB FLAVOR :POSTGRES
2026-09-24 08:01:41,249  [I] --------- Verifying Ranger DB connection ---------
2026-09-24 08:01:41,250  [I] Checking connection..
2026-09-24 08:01:41,250  [JISQL] /usr/lib/jvm/temurin-17-jdk-amd64/bin/java  -cp /tmp/dist-test-taskGoZl2g/build/debug/bin/postgresql.jar:/tmp/dist-test-taskGoZl2g/thirdparty/installed/common/opt/ranger/jisql/lib/* org.apache.util.sql.Jisql -driver postgresql -cstring jdbc:postgresql://127.12.95.84:38557/ranger -u miniranger -p '********' -noheader -trim -c \;  -query "select 1;"
2026-09-24 08:01:41,595  [I] Checking connection passed.
2026-09-24 08:01:41,595  [I] --------- Verifying version history table ---------
2026-09-24 08:01:41,596  [JISQL] /usr/lib/jvm/temurin-17-jdk-amd64/bin/java  -cp /tmp/dist-test-taskGoZl2g/build/debug/bin/postgresql.jar:/tmp/dist-test-taskGoZl2g/thirdparty/installed/common/opt/ranger/jisql/lib/* org.apache.util.sql.Jisql -driver postgresql -cstring jdbc:postgresql://127.12.95.84:38557/ranger -u miniranger -p '********' -noheader -trim -c \;  -query "select * from (select table_name from information_schema.tables where table_catalog='ranger' and table_name = 'x_db_version_h') as temp;"
2026-09-24 08:01:41,918  [I] Table x_db_version_h does not exist in database ranger
2026-09-24 08:01:41,918  [JISQL] /usr/lib/jvm/temurin-17-jdk-amd64/bin/java  -cp /tmp/dist-test-taskGoZl2g/build/debug/bin/postgresql.jar:/tmp/dist-test-taskGoZl2g/thirdparty/installed/common/opt/ranger/jisql/lib/* org.apache.util.sql.Jisql -driver postgresql -cstring jdbc:postgresql://127.12.95.84:38557/ranger -u miniranger -p '********' -noheader -trim -c \;  -query "select * from (select table_name from information_schema.tables where table_catalog='ranger' and table_name = 'x_db_version_h') as temp;"
2026-09-24 08:01:42,248  [I] Table x_db_version_h does not exist in database ranger
2026-09-24 08:01:42,248  [I] Importing x_db_version_h table schema to database ranger from file: create_dbversion_catalog.sql
2026-09-24 08:01:42,249  [JISQL] /usr/lib/jvm/temurin-17-jdk-amd64/bin/java  -cp /tmp/dist-test-taskGoZl2g/build/debug/bin/postgresql.jar:/tmp/dist-test-taskGoZl2g/thirdparty/installed/common/opt/ranger/jisql/lib/* org.apache.util.sql.Jisql -driver postgresql -cstring jdbc:postgresql://127.12.95.84:38557/ranger -u miniranger -p '********' -noheader -trim -c \; -input /tmp/dist-test-taskGoZl2g/thirdparty/installed/common/opt/ranger/db/postgres/create_dbversion_catalog.sql 
2026-09-24 08:01:42.576 UTC [13504] WARNING:  there is no transaction in progress
2026-09-24 08:01:42,591  [I] create_dbversion_catalog.sql file imported successfully
2026-09-24 08:01:42,592  [JISQL] /usr/lib/jvm/temurin-17-jdk-amd64/bin/java  -cp /tmp/dist-test-taskGoZl2g/build/debug/bin/postgresql.jar:/tmp/dist-test-taskGoZl2g/thirdparty/installed/common/opt/ranger/jisql/lib/* org.apache.util.sql.Jisql -driver postgresql -cstring jdbc:postgresql://127.12.95.84:38557/ranger -u miniranger -p '********' -noheader -trim -c \;  -query "select * from (select table_name from information_schema.tables where table_catalog='ranger' and table_name = 'x_db_version_h') as temp;"
2026-09-24 08:01:42,951  [I] Table x_db_version_h already exists in database 'ranger'
2026-09-24 08:01:42,951  [I] --------- Importing Ranger Core DB Schema ---------
2026-09-24 08:01:42,952  [JISQL] /usr/lib/jvm/temurin-17-jdk-amd64/bin/java  -cp /tmp/dist-test-taskGoZl2g/build/debug/bin/postgresql.jar:/tmp/dist-test-taskGoZl2g/thirdparty/installed/common/opt/ranger/jisql/lib/* org.apache.util.sql.Jisql -driver postgresql -cstring jdbc:postgresql://127.12.95.84:38557/ranger -u miniranger -p '********' -noheader -trim -c \;  -query "select version from x_db_version_h where version = 'CORE_DB_SCHEMA' and active = 'Y';"
2026-09-24 08:01:43,315  [JISQL] /usr/lib/jvm/temurin-17-jdk-amd64/bin/java  -cp /tmp/dist-test-taskGoZl2g/build/debug/bin/postgresql.jar:/tmp/dist-test-taskGoZl2g/thirdparty/installed/common/opt/ranger/jisql/lib/* org.apache.util.sql.Jisql -driver postgresql -cstring jdbc:postgresql://127.12.95.84:38557/ranger -u miniranger -p '********' -noheader -trim -c \;  -query "select version from x_db_version_h where version = 'CORE_DB_SCHEMA' and active = 'N';"
2026-09-24 08:01:43,718  [JISQL] /usr/lib/jvm/temurin-17-jdk-amd64/bin/java  -cp /tmp/dist-test-taskGoZl2g/build/debug/bin/postgresql.jar:/tmp/dist-test-taskGoZl2g/thirdparty/installed/common/opt/ranger/jisql/lib/* org.apache.util.sql.Jisql -driver postgresql -cstring jdbc:postgresql://127.12.95.84:38557/ranger -u miniranger -p '********' -noheader -trim -c \;  -query "insert into x_db_version_h (version, inst_at, inst_by, updated_at, updated_by,active) values ('CORE_DB_SCHEMA', current_timestamp, 'Ranger 2.6.0', current_timestamp, 'dist-test-slave-hwwr.c.gcp-upstream.internal','N') ;"
2026-09-24 08:01:44,070  [JISQL] /usr/lib/jvm/temurin-17-jdk-amd64/bin/java  -cp /tmp/dist-test-taskGoZl2g/build/debug/bin/postgresql.jar:/tmp/dist-test-taskGoZl2g/thirdparty/installed/common/opt/ranger/jisql/lib/* org.apache.util.sql.Jisql -driver postgresql -cstring jdbc:postgresql://127.12.95.84:38557/ranger -u miniranger -p '********' -noheader -trim -c \;  -query "select * from (select table_name from information_schema.tables where table_catalog='ranger' and table_name = 'x_portal_user') as temp;"
2026-09-24 08:01:44,472  [I] Table x_portal_user does not exist in database ranger
2026-09-24 08:01:44,473  [JISQL] /usr/lib/jvm/temurin-17-jdk-amd64/bin/java  -cp /tmp/dist-test-taskGoZl2g/build/debug/bin/postgresql.jar:/tmp/dist-test-taskGoZl2g/thirdparty/installed/common/opt/ranger/jisql/lib/* org.apache.util.sql.Jisql -driver postgresql -cstring jdbc:postgresql://127.12.95.84:38557/ranger -u miniranger -p '********' -noheader -trim -c \;  -query "select * from (select table_name from information_schema.tables where table_catalog='ranger' and table_name = 'x_policy_ref_group') as temp;"
2026-09-24 08:01:44,885  [I] Table x_policy_ref_group does not exist in database ranger
2026-09-24 08:01:44,886  [JISQL] /usr/lib/jvm/temurin-17-jdk-amd64/bin/java  -cp /tmp/dist-test-taskGoZl2g/build/debug/bin/postgresql.jar:/tmp/dist-test-taskGoZl2g/thirdparty/installed/common/opt/ranger/jisql/lib/* org.apache.util.sql.Jisql -driver postgresql -cstring jdbc:postgresql://127.12.95.84:38557/ranger -u miniranger -p '********' -noheader -trim -c \;  -query "select version from x_db_version_h where version = 'DB_PATCHES' and active = 'Y';"
2026-09-24 08:01:45,308  [JISQL] /usr/lib/jvm/temurin-17-jdk-amd64/bin/java  -cp /tmp/dist-test-taskGoZl2g/build/debug/bin/postgresql.jar:/tmp/dist-test-taskGoZl2g/thirdparty/installed/common/opt/ranger/jisql/lib/* org.apache.util.sql.Jisql -driver postgresql -cstring jdbc:postgresql://127.12.95.84:38557/ranger -u miniranger -p '********' -noheader -trim -c \;  -query "select version from x_db_version_h where version = 'JAVA_PATCHES' and active = 'Y';"
2026-09-24 08:01:45,730  [I] Importing DB schema to database ranger from file: ranger_core_db_postgres.sql
2026-09-24 08:01:45,731  [JISQL] /usr/lib/jvm/temurin-17-jdk-amd64/bin/java  -cp /tmp/dist-test-taskGoZl2g/build/debug/bin/postgresql.jar:/tmp/dist-test-taskGoZl2g/thirdparty/installed/common/opt/ranger/jisql/lib/* org.apache.util.sql.Jisql -driver postgresql -cstring jdbc:postgresql://127.12.95.84:38557/ranger -u miniranger -p '********' -noheader -trim -c \; -input /tmp/dist-test-taskGoZl2g/thirdparty/installed/common/opt/ranger/db/postgres/optimized/current/ranger_core_db_postgres.sql 
2026-09-24 08:01:46.826 UTC [13703] WARNING:  there is no transaction in progress
2026-09-24 08:01:46.840 UTC [13703] WARNING:  there is no transaction in progress
2026-09-24 08:01:46.853 UTC [13703] WARNING:  there is no transaction in progress
2026-09-24 08:01:46.866 UTC [13703] WARNING:  there is no transaction in progress
2026-09-24 08:01:46.884 UTC [13703] WARNING:  there is no transaction in progress
2026-09-24 08:01:46.900 UTC [13703] WARNING:  there is no transaction in progress
2026-09-24 08:01:46.961 UTC [13703] WARNING:  there is no transaction in progress
2026-09-24 08:01:46.972 UTC [13703] WARNING:  there is no transaction in progress
2026-09-24 08:01:46.987 UTC [13703] WARNING:  there is no transaction in progress
2026-09-24 08:01:47.000 UTC [13703] WARNING:  there is no transaction in progress
2026-09-24 08:01:47.009 UTC [13703] WARNING:  there is no transaction in progress
2026-09-24 08:01:47.019 UTC [13703] WARNING:  there is no transaction in progress
2026-09-24 08:01:47.028 UTC [13703] WARNING:  there is no transaction in progress
2026-09-24 08:01:47.038 UTC [13703] WARNING:  there is no transaction in progress
2026-09-24 08:01:47.044 UTC [13703] WARNING:  there is no transaction in progress
2026-09-24 08:01:47.053 UTC [13703] WARNING:  there is no transaction in progress
2026-09-24 08:01:47.060 UTC [13703] WARNING:  there is no transaction in progress
2026-09-24 08:01:47.067 UTC [13703] WARNING:  there is no transaction in progress
2026-09-24 08:01:47.072 UTC [13703] WARNING:  there is no transaction in progress
2026-09-24 08:01:47.078 UTC [13703] WARNING:  there is no transaction in progress
2026-09-24 08:01:47.082 UTC [13703] WARNING:  there is no transaction in progress
2026-09-24 08:01:47.086 UTC [13703] WARNING:  there is no transaction in progress
2026-09-24 08:01:47,568  [I] ranger_core_db_postgres.sql file imported successfully
2026-09-24 08:01:47,569  [JISQL] /usr/lib/jvm/temurin-17-jdk-amd64/bin/java  -cp /tmp/dist-test-taskGoZl2g/build/debug/bin/postgresql.jar:/tmp/dist-test-taskGoZl2g/thirdparty/installed/common/opt/ranger/jisql/lib/* org.apache.util.sql.Jisql -driver postgresql -cstring jdbc:postgresql://127.12.95.84:38557/ranger -u miniranger -p '********' -noheader -trim -c \;  -query "update x_db_version_h set inst_by='Ranger 2.6.0' where active='Y' and updated_by='localhost';"
2026-09-24 08:01:47,914  [I] Patches status entries updated from base ranger version to current installed ranger version:Ranger 2.6.0
2026-09-24 08:01:47,914  [JISQL] /usr/lib/jvm/temurin-17-jdk-amd64/bin/java  -cp /tmp/dist-test-taskGoZl2g/build/debug/bin/postgresql.jar:/tmp/dist-test-taskGoZl2g/thirdparty/installed/common/opt/ranger/jisql/lib/* org.apache.util.sql.Jisql -driver postgresql -cstring jdbc:postgresql://127.12.95.84:38557/ranger -u miniranger -p '********' -noheader -trim -c \;  -query "select * from (select table_name from information_schema.tables where table_catalog='ranger' and table_name = 'x_portal_user') as temp;"
2026-09-24 08:01:48,275  [I] Table x_portal_user already exists in database 'ranger'
2026-09-24 08:01:48,275  [JISQL] /usr/lib/jvm/temurin-17-jdk-amd64/bin/java  -cp /tmp/dist-test-taskGoZl2g/build/debug/bin/postgresql.jar:/tmp/dist-test-taskGoZl2g/thirdparty/installed/common/opt/ranger/jisql/lib/* org.apache.util.sql.Jisql -driver postgresql -cstring jdbc:postgresql://127.12.95.84:38557/ranger -u miniranger -p '********' -noheader -trim -c \;  -query "select * from (select table_name from information_schema.tables where table_catalog='ranger' and table_name = 'x_policy_ref_group') as temp;"
2026-09-24 08:01:48,619  [I] Table x_policy_ref_group already exists in database 'ranger'
2026-09-24 08:01:48,619  [JISQL] /usr/lib/jvm/temurin-17-jdk-amd64/bin/java  -cp /tmp/dist-test-taskGoZl2g/build/debug/bin/postgresql.jar:/tmp/dist-test-taskGoZl2g/thirdparty/installed/common/opt/ranger/jisql/lib/* org.apache.util.sql.Jisql -driver postgresql -cstring jdbc:postgresql://127.12.95.84:38557/ranger -u miniranger -p '********' -noheader -trim -c \;  -query "select version from x_db_version_h where version = 'DB_PATCHES' and active = 'Y';"
2026-09-24 08:01:48,918  [JISQL] /usr/lib/jvm/temurin-17-jdk-amd64/bin/java  -cp /tmp/dist-test-taskGoZl2g/build/debug/bin/postgresql.jar:/tmp/dist-test-taskGoZl2g/thirdparty/installed/common/opt/ranger/jisql/lib/* org.apache.util.sql.Jisql -driver postgresql -cstring jdbc:postgresql://127.12.95.84:38557/ranger -u miniranger -p '********' -noheader -trim -c \;  -query "select version from x_db_version_h where version = 'JAVA_PATCHES' and active = 'Y';"
2026-09-24 08:01:49,252  [JISQL] /usr/lib/jvm/temurin-17-jdk-amd64/bin/java  -cp /tmp/dist-test-taskGoZl2g/build/debug/bin/postgresql.jar:/tmp/dist-test-taskGoZl2g/thirdparty/installed/common/opt/ranger/jisql/lib/* org.apache.util.sql.Jisql -driver postgresql -cstring jdbc:postgresql://127.12.95.84:38557/ranger -u miniranger -p '********' -noheader -trim -c \;  -query "update x_db_version_h set active='Y' where version='CORE_DB_SCHEMA' and active='N' and updated_by='dist-test-slave-hwwr.c.gcp-upstream.internal';"
2026-09-24 08:01:49,574  [I] CORE_DB_SCHEMA import status has been updated
2026-09-24 08:01:49,574  [JISQL] /usr/lib/jvm/temurin-17-jdk-amd64/bin/java  -cp /tmp/dist-test-taskGoZl2g/build/debug/bin/postgresql.jar:/tmp/dist-test-taskGoZl2g/thirdparty/installed/common/opt/ranger/jisql/lib/* org.apache.util.sql.Jisql -driver postgresql -cstring jdbc:postgresql://127.12.95.84:38557/ranger -u miniranger -p '********' -noheader -trim -c \;  -query "select version from x_db_version_h where version = 'DB_PATCHES' and inst_by = 'Ranger 2.6.0' and active = 'Y';"
2026-09-24 08:01:49,870  [I] DB_PATCHES have already been applied
I20260924 08:01:49.877314 12669 mini_ranger.cc:192] Using Ranger class path: /tmp/dist-test-taskGoZl2g/test-tmp/ts_authz-itest.1.AuthzProviders_TSAuthzITest.TableScanCLI_Ranger.1790236757264992-12669-0/minicluster-data/ranger-admin:/tmp/dist-test-taskGoZl2g/thirdparty/installed/common/opt/ranger/ews/lib/*:/usr/lib/jvm/temurin-17-jdk-amd64/lib/*:/tmp/dist-test-taskGoZl2g/thirdparty/installed/common/opt/hadoop/*:/tmp/dist-test-taskGoZl2g/build/debug/bin/postgresql.jar:/tmp/dist-test-taskGoZl2g/thirdparty/installed/common/opt/ranger/ews/webapp
I20260924 08:01:49.877388 12669 mini_ranger.cc:194] Using host: 127.12.95.84
I20260924 08:01:49.880720 12669 mini_ranger.cc:240] Ranger admin URL: http://127.12.95.84:60429
Sep 24, 2026 8:01:50 AM org.apache.ranger.server.tomcat.EmbeddedServer getKeyManagers
WARNING: Config 'ranger.keystore.file' or 'ranger.service.https.attrib.keystore.file' is not found or contains blank value
Sep 24, 2026 8:01:50 AM org.apache.ranger.server.tomcat.EmbeddedServer getTrustManagers
WARNING: Config 'ranger.truststore.file' is not found or contains blank value!
Sep 24, 2026 8:01:50 AM org.apache.ranger.server.tomcat.EmbeddedServer start
INFO: Deriving webapp folder from catalina.base property. folder=/tmp/dist-test-taskGoZl2g/test-tmp/ts_authz-itest.1.AuthzProviders_TSAuthzITest.TableScanCLI_Ranger.1790236757264992-12669-0/minicluster-data/ranger-admin/ews/webapp
Sep 24, 2026 8:01:50 AM org.apache.ranger.server.tomcat.EmbeddedServer start
INFO: Webapp file =/tmp/dist-test-taskGoZl2g/test-tmp/ts_authz-itest.1.AuthzProviders_TSAuthzITest.TableScanCLI_Ranger.1790236757264992-12669-0/minicluster-data/ranger-admin/ews/webapp, webAppName = /
Sep 24, 2026 8:01:50 AM org.apache.ranger.server.tomcat.EmbeddedServer start
INFO: Adding webapp [/] = path [/tmp/dist-test-taskGoZl2g/test-tmp/ts_authz-itest.1.AuthzProviders_TSAuthzITest.TableScanCLI_Ranger.1790236757264992-12669-0/minicluster-data/ranger-admin/ews/webapp] .....
Sep 24, 2026 8:01:50 AM org.apache.catalina.core.StandardContext setPath
WARNING: A context path must either be an empty string or start with a '/' and do not end with a '/'. The path [/] does not meet these criteria and has been changed to []
Sep 24, 2026 8:01:51 AM org.apache.ranger.server.tomcat.EmbeddedServer start
INFO: Finished init of webapp [/] = path [/tmp/dist-test-taskGoZl2g/test-tmp/ts_authz-itest.1.AuthzProviders_TSAuthzITest.TableScanCLI_Ranger.1790236757264992-12669-0/minicluster-data/ranger-admin/ews/webapp].
Sep 24, 2026 8:01:51 AM org.apache.ranger.server.tomcat.EmbeddedServer startServer
INFO: Server Name : miniranger
Sep 24, 2026 8:01:51 AM org.apache.coyote.AbstractProtocol init
INFO: Initializing ProtocolHandler ["http-nio-60429"]
Sep 24, 2026 8:01:51 AM org.apache.catalina.core.StandardService startInternal
INFO: Starting service [Tomcat]
Sep 24, 2026 8:01:51 AM org.apache.catalina.core.StandardEngine startInternal
INFO: Starting Servlet engine: [Apache Tomcat/9.0.98]
Sep 24, 2026 8:01:51 AM org.apache.catalina.startup.ContextConfig getDefaultWebXmlFragment
INFO: No global web.xml found
I20260924 08:01:52.206462 12669 mini_ranger.cc:161] Time spent starting Ranger: real 11.439s	user 0.005s	sys 0.006s
Sep 24, 2026 8:01:55 AM org.apache.jasper.servlet.TldScanner scanJars
INFO: At least one JAR was scanned for TLDs yet contained no TLDs. Enable debug logging for this logger for a complete list of JARs that were scanned but no TLDs were found in them. Skipping unneeded JARs during scanning can improve startup time and JSP compilation time.
Sep 24, 2026 8:01:55 AM org.apache.catalina.core.ApplicationContext log
INFO: Initializing Spring root WebApplicationContext
[EL Warning]: metadata: 2026-09-24 08:01:59.523--ServerSession(1737916965)--You have specified multiple ids for the entity class [org.apache.ranger.entity.view.VXXPrincipal] without specifying an @IdClass. By doing this you may lose the ability to find by identity, distributed cache support etc. Note: You may however use EntityManager find operations by passing a list of primary key fields. Else, you will have to use JPQL queries to read your entities. For other id options see @PrimaryKey.
Sep 24, 2026 8:02:14 AM com.sun.jersey.api.core.PackagesResourceConfig init
INFO: Scanning for root resource and provider classes in the packages:
  org.apache.ranger.rest
  org.apache.ranger.common
  xa.rest
Sep 24, 2026 8:02:14 AM com.sun.jersey.api.core.ScanningResourceConfig logClasses
INFO: Root resource classes found:
  class org.apache.ranger.rest.MetricsREST
  class org.apache.ranger.rest.ServiceREST
  class org.apache.ranger.rest.UserREST
  class org.apache.ranger.rest.TagREST
  class org.apache.ranger.rest.PublicAPIsv2
  class org.apache.ranger.rest.XKeyREST
  class org.apache.ranger.rest.SecurityZoneREST
  class org.apache.ranger.rest.PublicAPIs
  class org.apache.ranger.rest.XAuditREST
  class org.apache.ranger.rest.AssetREST
  class org.apache.ranger.rest.RoleREST
  class org.apache.ranger.rest.XUserREST
Sep 24, 2026 8:02:14 AM com.sun.jersey.api.core.ScanningResourceConfig logClasses
INFO: Provider classes found:
  class org.apache.ranger.common.RangerJsonMappingExceptionMapper
  class org.apache.ranger.common.RangerJAXBContextResolver
  class org.apache.ranger.common.RangerJsonParserExceptionMapper
  class org.apache.ranger.common.RangerJsonProvider
Sep 24, 2026 8:02:14 AM com.sun.jersey.spi.spring.container.servlet.SpringServlet getContext
INFO: Using default applicationContext
Sep 24, 2026 8:02:14 AM com.sun.jersey.spi.spring.container.SpringComponentProviderFactory registerSpringBeans
INFO: Registering Spring bean, rangerJsonMappingExceptionMapper, of type org.apache.ranger.common.RangerJsonMappingExceptionMapper as a provider class
Sep 24, 2026 8:02:14 AM com.sun.jersey.spi.spring.container.SpringComponentProviderFactory registerSpringBeans
INFO: Registering Spring bean, rangerJsonParserExceptionMapper, of type org.apache.ranger.common.RangerJsonParserExceptionMapper as a provider class
Sep 24, 2026 8:02:14 AM com.sun.jersey.spi.spring.container.SpringComponentProviderFactory registerSpringBeans
INFO: Registering Spring bean, rangerJsonProvider, of type org.apache.ranger.common.RangerJsonProvider as a provider class
Sep 24, 2026 8:02:14 AM com.sun.jersey.spi.spring.container.SpringComponentProviderFactory registerSpringBeans
INFO: Registering Spring bean, assetREST, of type org.apache.ranger.rest.AssetREST as a root resource class
Sep 24, 2026 8:02:14 AM com.sun.jersey.spi.spring.container.SpringComponentProviderFactory registerSpringBeans
INFO: Registering Spring bean, metricsREST, of type org.apache.ranger.rest.MetricsREST as a root resource class
Sep 24, 2026 8:02:14 AM com.sun.jersey.spi.spring.container.SpringComponentProviderFactory registerSpringBeans
INFO: Registering Spring bean, publicAPIs, of type org.apache.ranger.rest.PublicAPIs as a root resource class
Sep 24, 2026 8:02:14 AM com.sun.jersey.spi.spring.container.SpringComponentProviderFactory registerSpringBeans
INFO: Registering Spring bean, publicAPIsv2, of type org.apache.ranger.rest.PublicAPIsv2 as a root resource class
Sep 24, 2026 8:02:14 AM com.sun.jersey.spi.spring.container.SpringComponentProviderFactory registerSpringBeans
INFO: Registering Spring bean, roleREST, of type org.apache.ranger.rest.RoleREST as a root resource class
Sep 24, 2026 8:02:14 AM com.sun.jersey.spi.spring.container.SpringComponentProviderFactory registerSpringBeans
INFO: Registering Spring bean, securityZoneREST, of type org.apache.ranger.rest.SecurityZoneREST as a root resource class
Sep 24, 2026 8:02:14 AM com.sun.jersey.spi.spring.container.SpringComponentProviderFactory registerSpringBeans
INFO: Registering Spring bean, serviceREST, of type org.apache.ranger.rest.ServiceREST as a root resource class
Sep 24, 2026 8:02:14 AM com.sun.jersey.spi.spring.container.SpringComponentProviderFactory registerSpringBeans
INFO: Registering Spring bean, tagREST, of type org.apache.ranger.rest.TagREST as a root resource class
Sep 24, 2026 8:02:14 AM com.sun.jersey.spi.spring.container.SpringComponentProviderFactory registerSpringBeans
INFO: Registering Spring bean, userREST, of type org.apache.ranger.rest.UserREST as a root resource class
Sep 24, 2026 8:02:14 AM com.sun.jersey.spi.spring.container.SpringComponentProviderFactory registerSpringBeans
INFO: Registering Spring bean, XAuditREST, of type org.apache.ranger.rest.XAuditREST as a root resource class
Sep 24, 2026 8:02:14 AM com.sun.jersey.spi.spring.container.SpringComponentProviderFactory registerSpringBeans
INFO: Registering Spring bean, XKeyREST, of type org.apache.ranger.rest.XKeyREST as a root resource class
Sep 24, 2026 8:02:14 AM com.sun.jersey.spi.spring.container.SpringComponentProviderFactory registerSpringBeans
INFO: Registering Spring bean, XUserREST, of type org.apache.ranger.rest.XUserREST as a root resource class
Sep 24, 2026 8:02:14 AM com.sun.jersey.server.impl.application.WebApplicationImpl _initiate
INFO: Initiating Jersey application, version 'Jersey: 1.19.4 05/24/2017 03:20 PM'
Sep 24, 2026 8:02:15 AM com.sun.jersey.spi.inject.Errors processErrorMessages
WARNING: The following warnings have been detected with resource and/or provider classes:
  WARNING: A HTTP GET method, public void org.apache.ranger.rest.RoleREST.getRolesInJson(javax.servlet.http.HttpServletRequest,javax.servlet.http.HttpServletResponse), MUST return a non-void type.
  WARNING: A HTTP GET method, public void org.apache.ranger.rest.ServiceREST.getPoliciesInExcel(javax.servlet.http.HttpServletRequest,javax.servlet.http.HttpServletResponse), MUST return a non-void type.
  WARNING: A HTTP GET method, public void org.apache.ranger.rest.ServiceREST.getPoliciesInCsv(javax.servlet.http.HttpServletRequest,javax.servlet.http.HttpServletResponse) throws java.io.IOException, MUST return a non-void type.
  WARNING: A HTTP GET method, public void org.apache.ranger.rest.ServiceREST.getPoliciesInJson(javax.servlet.http.HttpServletRequest,javax.servlet.http.HttpServletResponse,java.lang.Boolean), MUST return a non-void type.
Sep 24, 2026 8:02:15 AM org.apache.coyote.AbstractProtocol start
INFO: Starting ProtocolHandler ["http-nio-60429"]
I20260924 08:02:16.819252 12669 mini_ranger.cc:274] Created Kudu service
WARNING: no policy specified for kudu/127.12.95.126@KRBTEST.COM; defaulting to no policy
Authenticating as principal test-admin/admin@KRBTEST.COM with password.
Principal "kudu/127.12.95.126@KRBTEST.COM" created.
Authenticating as principal test-admin/admin@KRBTEST.COM with password.
Entry for principal kudu/127.12.95.126 with kvno 2, encryption type aes256-cts-hmac-sha1-96 added to keytab WRFILE:/tmp/dist-test-taskGoZl2g/test-tmp/ts_authz-itest.1.AuthzProviders_TSAuthzITest.TableScanCLI_Ranger.1790236757264992-12669-0/krb5kdc/kudu.keytab.
Entry for principal kudu/127.12.95.126 with kvno 2, encryption type aes128-cts-hmac-sha1-96 added to keytab WRFILE:/tmp/dist-test-taskGoZl2g/test-tmp/ts_authz-itest.1.AuthzProviders_TSAuthzITest.TableScanCLI_Ranger.1790236757264992-12669-0/krb5kdc/kudu.keytab.
WARNING: no policy specified for HTTP/127.12.95.126@KRBTEST.COM; defaulting to no policy
Authenticating as principal test-admin/admin@KRBTEST.COM with password.
Principal "HTTP/127.12.95.126@KRBTEST.COM" created.
Authenticating as principal test-admin/admin@KRBTEST.COM with password.
Entry for principal HTTP/127.12.95.126 with kvno 2, encryption type aes256-cts-hmac-sha1-96 added to keytab WRFILE:/tmp/dist-test-taskGoZl2g/test-tmp/ts_authz-itest.1.AuthzProviders_TSAuthzITest.TableScanCLI_Ranger.1790236757264992-12669-0/krb5kdc/kudu.keytab.
Entry for principal HTTP/127.12.95.126 with kvno 2, encryption type aes128-cts-hmac-sha1-96 added to keytab WRFILE:/tmp/dist-test-taskGoZl2g/test-tmp/ts_authz-itest.1.AuthzProviders_TSAuthzITest.TableScanCLI_Ranger.1790236757264992-12669-0/krb5kdc/kudu.keytab.
I20260924 08:02:16.878618 12669 external_mini_cluster.cc:1372] Running /tmp/dist-test-taskGoZl2g/build/debug/bin/kudu
/tmp/dist-test-taskGoZl2g/build/debug/bin/kudu
--fs_wal_dir=/tmp/dist-test-taskGoZl2g/test-tmp/ts_authz-itest.1.AuthzProviders_TSAuthzITest.TableScanCLI_Ranger.1790236757264992-12669-0/minicluster-data/master-0/wal
--fs_data_dirs=/tmp/dist-test-taskGoZl2g/test-tmp/ts_authz-itest.1.AuthzProviders_TSAuthzITest.TableScanCLI_Ranger.1790236757264992-12669-0/minicluster-data/master-0/data
--block_manager=log
--webserver_interface=localhost
--never_fsync
--enable_minidumps=false
--redact=none
--metrics_log_interval_ms=1000
--log_dir=/tmp/dist-test-taskGoZl2g/test-tmp/ts_authz-itest.1.AuthzProviders_TSAuthzITest.TableScanCLI_Ranger.1790236757264992-12669-0/minicluster-data/master-0/logs
--server_dump_info_path=/tmp/dist-test-taskGoZl2g/test-tmp/ts_authz-itest.1.AuthzProviders_TSAuthzITest.TableScanCLI_Ranger.1790236757264992-12669-0/minicluster-data/master-0/data/info.pb
--server_dump_info_format=pb
--rpc_server_allow_ephemeral_ports
--unlock_experimental_flags
--unlock_unsafe_flags
--logtostderr
--logbuflevel=-1
--ipki_server_key_size=768
--openssl_security_level_override=0
master
run
--ipki_ca_key_size=768
--tsk_num_rsa_bits=512
--rpc_bind_addresses=127.12.95.126:35855
--webserver_interface=127.12.95.126
--webserver_port=0
--keytab_file=/tmp/dist-test-taskGoZl2g/test-tmp/ts_authz-itest.1.AuthzProviders_TSAuthzITest.TableScanCLI_Ranger.1790236757264992-12669-0/krb5kdc/kudu.keytab
--principal=kudu/127.12.95.126
--rpc_authentication=required
--superuser_acl=test-admin
--user_acl=test-user
--webserver_require_spnego=true
--builtin_ntp_servers=127.12.95.84:42875
--builtin_ntp_poll_interval_ms=100
--ntp_initial_sync_wait_secs=10
--time_source=builtin
--rpc_reuseport=true
--master_addresses=127.12.95.126:35855
--ranger_config_path=/tmp/dist-test-taskGoZl2g/test-tmp/ts_authz-itest.1.AuthzProviders_TSAuthzITest.TableScanCLI_Ranger.1790236757264992-12669-0/minicluster-data/ranger-client
--trusted_user_acl=test-admin
--authz_token_validity_seconds=1
--user_acl=kudu,user0,user1,user2 with env {KRB5CCNAME=/tmp/dist-test-taskGoZl2g/test-tmp/ts_authz-itest.1.AuthzProviders_TSAuthzITest.TableScanCLI_Ranger.1790236757264992-12669-0/krb5kdc/krb5cc,KRB5_CONFIG=/tmp/dist-test-taskGoZl2g/test-tmp/ts_authz-itest.1.AuthzProviders_TSAuthzITest.TableScanCLI_Ranger.1790236757264992-12669-0/krb5kdc/krb5.conf,KRB5_KDC_PROFILE=/tmp/dist-test-taskGoZl2g/test-tmp/ts_authz-itest.1.AuthzProviders_TSAuthzITest.TableScanCLI_Ranger.1790236757264992-12669-0/krb5kdc/kdc.conf,KUDU_ENABLE_KRB5_REALM_FIX=yes}
W20260924 08:02:17.031148 13919 flags.cc:432] Enabled unsafe flag: --openssl_security_level_override=0
W20260924 08:02:17.031464 13919 flags.cc:432] Enabled unsafe flag: --rpc_server_allow_ephemeral_ports=true
W20260924 08:02:17.031533 13919 flags.cc:432] Enabled unsafe flag: --never_fsync=true
W20260924 08:02:17.036440 13919 flags.cc:432] Enabled experimental flag: --authz_token_validity_seconds=1
W20260924 08:02:17.036530 13919 flags.cc:432] Enabled experimental flag: --ipki_ca_key_size=768
W20260924 08:02:17.036571 13919 flags.cc:432] Enabled experimental flag: --ipki_server_key_size=768
W20260924 08:02:17.036641 13919 flags.cc:432] Enabled experimental flag: --tsk_num_rsa_bits=512
W20260924 08:02:17.036677 13919 flags.cc:432] Enabled experimental flag: --rpc_reuseport=true
I20260924 08:02:17.043099 13919 master_runner.cc:387] Master server non-default flags:
--log_dir=/tmp/dist-test-taskGoZl2g/test-tmp/ts_authz-itest.1.AuthzProviders_TSAuthzITest.TableScanCLI_Ranger.1790236757264992-12669-0/minicluster-data/master-0/logs
--logbuflevel=-1
--logtostderr=true
--builtin_ntp_poll_interval_ms=100
--builtin_ntp_servers=127.12.95.84:42875
--ntp_initial_sync_wait_secs=10
--time_source=builtin
--fs_data_dirs=/tmp/dist-test-taskGoZl2g/test-tmp/ts_authz-itest.1.AuthzProviders_TSAuthzITest.TableScanCLI_Ranger.1790236757264992-12669-0/minicluster-data/master-0/data
--fs_wal_dir=/tmp/dist-test-taskGoZl2g/test-tmp/ts_authz-itest.1.AuthzProviders_TSAuthzITest.TableScanCLI_Ranger.1790236757264992-12669-0/minicluster-data/master-0/wal
--trusted_user_acl=<redacted>
--authz_token_validity_seconds=1
--ipki_ca_key_size=768
--master_addresses=127.12.95.126:35855
--ranger_config_path=/tmp/dist-test-taskGoZl2g/test-tmp/ts_authz-itest.1.AuthzProviders_TSAuthzITest.TableScanCLI_Ranger.1790236757264992-12669-0/minicluster-data/ranger-client
--keytab_file=/tmp/dist-test-taskGoZl2g/test-tmp/ts_authz-itest.1.AuthzProviders_TSAuthzITest.TableScanCLI_Ranger.1790236757264992-12669-0/krb5kdc/kudu.keytab
--principal=kudu/127.12.95.126
--ipki_server_key_size=768
--openssl_security_level_override=0
--tsk_num_rsa_bits=512
--rpc_bind_addresses=127.12.95.126:35855
--rpc_reuseport=true
--rpc_server_allow_ephemeral_ports=true
--rpc_authentication=required
--superuser_acl=<redacted>
--user_acl=<redacted>
--metrics_log_interval_ms=1000
--server_dump_info_format=pb
--server_dump_info_path=/tmp/dist-test-taskGoZl2g/test-tmp/ts_authz-itest.1.AuthzProviders_TSAuthzITest.TableScanCLI_Ranger.1790236757264992-12669-0/minicluster-data/master-0/data/info.pb
--webserver_interface=127.12.95.126
--webserver_port=0
--webserver_require_spnego=true
--never_fsync=true
--heap_profile_path=/tmp/kudu.13919
--redact=none
--unlock_experimental_flags=true
--unlock_unsafe_flags=true
--enable_minidumps=false

Master server version:
kudu 1.19.0-SNAPSHOT
revision ee47a9ca1939200e227f9bf266c97a7c0eed3ccc
build type DEBUG
built by None at 24 Sep 2026 07:43:13 UTC on bdcb31816ec0
build id 13971
I20260924 08:02:17.044600 13919 env_posix.cc:2285] Not raising this process' open files per process limit of 1048576; it is already as high as it can go
I20260924 08:02:17.045744 13919 file_cache.cc:504] Constructed file cache file cache with capacity 419430
W20260924 08:02:17.052757 13927 instance_detector.cc:116] could not retrieve OpenStack instance metadata: Network error: curl error: HTTP response code said error: The requested URL returned error: 404
W20260924 08:02:17.052850 13924 instance_detector.cc:116] could not retrieve AWS instance metadata: Network error: curl error: HTTP response code said error: The requested URL returned error: 404
I20260924 08:02:17.053076 13919 server_base.cc:1061] running on GCE node
W20260924 08:02:17.053295 13925 instance_detector.cc:116] could not retrieve Azure instance metadata: Network error: curl error: HTTP response code said error: The requested URL returned error: 404
I20260924 08:02:17.053998 13919 hybrid_clock.cc:584] initializing the hybrid clock with 'builtin' time source
I20260924 08:02:17.055160 13919 hybrid_clock.cc:630] waiting up to --ntp_initial_sync_wait_secs=10 seconds for the clock to synchronize
I20260924 08:02:17.056347 13919 hybrid_clock.cc:648] HybridClock initialized: now 1790236937056313 us; error 51 us; skew 500 ppm
Sep 24 08:02:17 dist-test-slave-hwwr krb5kdc[13346](info): AS_REQ (2 etypes {17 16}) 127.0.0.1: ISSUE: authtime 1790236937, etypes {rep=17 tkt=17 ses=17}, kudu/127.12.95.126@KRBTEST.COM for krbtgt/KRBTEST.COM@KRBTEST.COM
I20260924 08:02:17.059952 13919 init.cc:377] Logged in from keytab as kudu/127.12.95.126@KRBTEST.COM (short username kudu)
I20260924 08:02:17.061298 13919 webserver.cc:533] Webserver started at http://127.12.95.126:41141/ using document root <none> and password file <none>
I20260924 08:02:17.062039 13919 fs_manager.cc:362] Metadata directory not provided
I20260924 08:02:17.062108 13919 fs_manager.cc:368] Using write-ahead log directory (fs_wal_dir) as metadata directory
I20260924 08:02:17.062325 13919 server_base.cc:909] This appears to be a new deployment of Kudu; creating new FS layout
I20260924 08:02:17.064327 13919 fs_manager.cc:1068] Generated new instance metadata in path /tmp/dist-test-taskGoZl2g/test-tmp/ts_authz-itest.1.AuthzProviders_TSAuthzITest.TableScanCLI_Ranger.1790236757264992-12669-0/minicluster-data/master-0/data/instance:
uuid: "51bfebb1ca3549fea0fb16c492fe62f8"
format_stamp: "Formatted at 2026-09-24 08:02:17 on dist-test-slave-hwwr"
I20260924 08:02:17.064882 13919 fs_manager.cc:1068] Generated new instance metadata in path /tmp/dist-test-taskGoZl2g/test-tmp/ts_authz-itest.1.AuthzProviders_TSAuthzITest.TableScanCLI_Ranger.1790236757264992-12669-0/minicluster-data/master-0/wal/instance:
uuid: "51bfebb1ca3549fea0fb16c492fe62f8"
format_stamp: "Formatted at 2026-09-24 08:02:17 on dist-test-slave-hwwr"
I20260924 08:02:17.069088 13919 fs_manager.cc:696] Time spent creating directory manager: real 0.004s	user 0.006s	sys 0.000s
I20260924 08:02:17.071774 13934 log_block_manager.cc:4127] Time spent loading block containers with low live blocks: real 0.000s	user 0.000s	sys 0.000s
I20260924 08:02:17.073030 13919 fs_manager.cc:730] Time spent opening block manager: real 0.002s	user 0.000s	sys 0.002s
I20260924 08:02:17.073143 13919 fs_manager.cc:647] Opened local filesystem: /tmp/dist-test-taskGoZl2g/test-tmp/ts_authz-itest.1.AuthzProviders_TSAuthzITest.TableScanCLI_Ranger.1790236757264992-12669-0/minicluster-data/master-0/data,/tmp/dist-test-taskGoZl2g/test-tmp/ts_authz-itest.1.AuthzProviders_TSAuthzITest.TableScanCLI_Ranger.1790236757264992-12669-0/minicluster-data/master-0/wal
uuid: "51bfebb1ca3549fea0fb16c492fe62f8"
format_stamp: "Formatted at 2026-09-24 08:02:17 on dist-test-slave-hwwr"
I20260924 08:02:17.073256 13919 fs_report.cc:389] FS layout report
--------------------
wal directory: /tmp/dist-test-taskGoZl2g/test-tmp/ts_authz-itest.1.AuthzProviders_TSAuthzITest.TableScanCLI_Ranger.1790236757264992-12669-0/minicluster-data/master-0/wal
metadata directory: /tmp/dist-test-taskGoZl2g/test-tmp/ts_authz-itest.1.AuthzProviders_TSAuthzITest.TableScanCLI_Ranger.1790236757264992-12669-0/minicluster-data/master-0/wal
1 data directories: /tmp/dist-test-taskGoZl2g/test-tmp/ts_authz-itest.1.AuthzProviders_TSAuthzITest.TableScanCLI_Ranger.1790236757264992-12669-0/minicluster-data/master-0/data/data
Total live blocks: 0
Total live bytes: 0
Total live bytes (after alignment): 0
Total number of LBM containers: 0 (0 full)
Did not check for missing blocks
Did not check for orphaned blocks
Total full LBM containers with extra space: 0 (0 repaired)
Total full LBM container extra space in bytes: 0 (0 repaired)
Total incomplete LBM containers: 0 (0 repaired)
Total LBM partial records: 0 (0 repaired)
Total corrupted LBM metadata records in RocksDB: 0 (0 repaired)
I20260924 08:02:17.105765 13919 rpc_server.cc:225] running with OpenSSL 1.1.1  11 Sep 2018
I20260924 08:02:17.109548 13919 env_posix.cc:2285] Not raising this process' running threads per effective uid limit of 18446744073709551615; it is already as high as it can go
I20260924 08:02:17.109754 13919 kserver.cc:163] Server-wide thread pool size limit: 3276
I20260924 08:02:17.118665 13919 rpc_server.cc:307] RPC server started. Bound to: 127.12.95.126:35855
I20260924 08:02:17.118836 13986 acceptor_pool.cc:272] collecting diagnostics on the listening RPC socket 127.12.95.126:35855 every 8 connection(s)
I20260924 08:02:17.120133 13919 server_base.cc:1193] Dumped server information to /tmp/dist-test-taskGoZl2g/test-tmp/ts_authz-itest.1.AuthzProviders_TSAuthzITest.TableScanCLI_Ranger.1790236757264992-12669-0/minicluster-data/master-0/data/info.pb
I20260924 08:02:17.123682 13987 data_dirs.cc:400] Could only allocate 1 dirs of requested 3 for tablet 00000000000000000000000000000000. 1 dirs total, 0 dirs full, 0 dirs failed
I20260924 08:02:17.128353 12669 external_mini_cluster.cc:1434] Started /tmp/dist-test-taskGoZl2g/build/debug/bin/kudu as pid 13919
I20260924 08:02:17.128510 12669 external_mini_cluster.cc:1448] Reading /tmp/dist-test-taskGoZl2g/test-tmp/ts_authz-itest.1.AuthzProviders_TSAuthzITest.TableScanCLI_Ranger.1790236757264992-12669-0/minicluster-data/master-0/wal/instance
I20260924 08:02:17.130303 13987 tablet_bootstrap.cc:492] T 00000000000000000000000000000000 P 51bfebb1ca3549fea0fb16c492fe62f8: Bootstrap starting.
I20260924 08:02:17.134097 13987 tablet_bootstrap.cc:654] T 00000000000000000000000000000000 P 51bfebb1ca3549fea0fb16c492fe62f8: Neither blocks nor log segments found. Creating new log.
I20260924 08:02:17.135039 13987 log.cc:826] T 00000000000000000000000000000000 P 51bfebb1ca3549fea0fb16c492fe62f8: Log is configured to *not* fsync() on all Append() calls
I20260924 08:02:17.137133 13987 tablet_bootstrap.cc:492] T 00000000000000000000000000000000 P 51bfebb1ca3549fea0fb16c492fe62f8: No bootstrap required, opened a new log
I20260924 08:02:17.140496 13987 raft_consensus.cc:359] T 00000000000000000000000000000000 P 51bfebb1ca3549fea0fb16c492fe62f8 [term 0 FOLLOWER]: Replica starting. Triggering 0 pending ops. Active config: opid_index: -1 OBSOLETE_local: true peers { permanent_uuid: "51bfebb1ca3549fea0fb16c492fe62f8" member_type: VOTER last_known_addr { host: "127.12.95.126" port: 35855 } }
I20260924 08:02:17.140717 13987 raft_consensus.cc:385] T 00000000000000000000000000000000 P 51bfebb1ca3549fea0fb16c492fe62f8 [term 0 FOLLOWER]: Consensus starting up: Expiring failure detector timer to make a prompt election more likely
I20260924 08:02:17.140780 13987 raft_consensus.cc:740] T 00000000000000000000000000000000 P 51bfebb1ca3549fea0fb16c492fe62f8 [term 0 FOLLOWER]: Becoming Follower/Learner. State: Replica: 51bfebb1ca3549fea0fb16c492fe62f8, State: Initialized, Role: FOLLOWER
I20260924 08:02:17.141569 13987 consensus_queue.cc:260] T 00000000000000000000000000000000 P 51bfebb1ca3549fea0fb16c492fe62f8 [NON_LEADER]: Queue going to NON_LEADER mode. State: All replicated index: 0, Majority replicated index: 0, Committed index: 0, Last appended: 0.0, Last appended by leader: 0, Current term: 0, Majority size: -1, State: 0, Mode: NON_LEADER, active raft config: opid_index: -1 OBSOLETE_local: true peers { permanent_uuid: "51bfebb1ca3549fea0fb16c492fe62f8" member_type: VOTER last_known_addr { host: "127.12.95.126" port: 35855 } }
I20260924 08:02:17.141844 13987 raft_consensus.cc:399] T 00000000000000000000000000000000 P 51bfebb1ca3549fea0fb16c492fe62f8 [term 0 FOLLOWER]: Only one voter in the Raft config. Triggering election immediately
I20260924 08:02:17.141964 13987 raft_consensus.cc:493] T 00000000000000000000000000000000 P 51bfebb1ca3549fea0fb16c492fe62f8 [term 0 FOLLOWER]: Starting leader election (initial election of a single-replica configuration)
I20260924 08:02:17.142109 13987 raft_consensus.cc:3060] T 00000000000000000000000000000000 P 51bfebb1ca3549fea0fb16c492fe62f8 [term 0 FOLLOWER]: Advancing to term 1
I20260924 08:02:17.143216 13987 raft_consensus.cc:515] T 00000000000000000000000000000000 P 51bfebb1ca3549fea0fb16c492fe62f8 [term 1 FOLLOWER]: Starting leader election with config: opid_index: -1 OBSOLETE_local: true peers { permanent_uuid: "51bfebb1ca3549fea0fb16c492fe62f8" member_type: VOTER last_known_addr { host: "127.12.95.126" port: 35855 } }
I20260924 08:02:17.143700 13987 leader_election.cc:304] T 00000000000000000000000000000000 P 51bfebb1ca3549fea0fb16c492fe62f8 [CANDIDATE]: Term 1 election: Election decided. Result: candidate won. Election summary: received 1 responses out of 1 voters: 1 yes votes; 0 no votes. yes voters: 51bfebb1ca3549fea0fb16c492fe62f8; no voters: 
I20260924 08:02:17.144093 13987 leader_election.cc:290] T 00000000000000000000000000000000 P 51bfebb1ca3549fea0fb16c492fe62f8 [CANDIDATE]: Term 1 election: Requested vote from peers 
I20260924 08:02:17.145401 13987 sys_catalog.cc:565] T 00000000000000000000000000000000 P 51bfebb1ca3549fea0fb16c492fe62f8 [sys.catalog]: configured and running, proceeding with master startup.
Sep 24 08:02:17 dist-test-slave-hwwr krb5kdc[13346](info): TGS_REQ (2 etypes {17 16}) 127.0.0.1: ISSUE: authtime 1790236896, etypes {rep=17 tkt=17 ses=17}, test-admin@KRBTEST.COM for kudu/127.12.95.126@KRBTEST.COM
I20260924 08:02:17.148432 13987 ranger_client.cc:318] Using new properties file: /tmp/dist-test-taskGoZl2g/test-tmp/ts_authz-itest.1.AuthzProviders_TSAuthzITest.TableScanCLI_Ranger.1790236757264992-12669-0/minicluster-data/master-0/logs/kudu-ranger-subprocess-log4j2.properties
I20260924 08:02:17.149940 13993 raft_consensus.cc:2804] T 00000000000000000000000000000000 P 51bfebb1ca3549fea0fb16c492fe62f8 [term 1 FOLLOWER]: Leader election won for term 1
I20260924 08:02:17.150187 13993 raft_consensus.cc:697] T 00000000000000000000000000000000 P 51bfebb1ca3549fea0fb16c492fe62f8 [term 1 LEADER]: Becoming Leader. State: Replica: 51bfebb1ca3549fea0fb16c492fe62f8, State: Running, Role: LEADER
I20260924 08:02:17.150566 13993 consensus_queue.cc:237] T 00000000000000000000000000000000 P 51bfebb1ca3549fea0fb16c492fe62f8 [LEADER]: Queue going to LEADER mode. State: All replicated index: 0, Majority replicated index: 0, Committed index: 0, Last appended: 0.0, Last appended by leader: 0, Current term: 1, Majority size: 1, State: 0, Mode: LEADER, active raft config: opid_index: -1 OBSOLETE_local: true peers { permanent_uuid: "51bfebb1ca3549fea0fb16c492fe62f8" member_type: VOTER last_known_addr { host: "127.12.95.126" port: 35855 } }
I20260924 08:02:17.151872 13993 sys_catalog.cc:455] T 00000000000000000000000000000000 P 51bfebb1ca3549fea0fb16c492fe62f8 [sys.catalog]: SysCatalogTable state changed. Reason: RaftConsensus started. Latest consensus state: current_term: 1 leader_uuid: "51bfebb1ca3549fea0fb16c492fe62f8" committed_config { opid_index: -1 OBSOLETE_local: true peers { permanent_uuid: "51bfebb1ca3549fea0fb16c492fe62f8" member_type: VOTER last_known_addr { host: "127.12.95.126" port: 35855 } } }
I20260924 08:02:17.152232 13993 sys_catalog.cc:458] T 00000000000000000000000000000000 P 51bfebb1ca3549fea0fb16c492fe62f8 [sys.catalog]: This master's current role is: LEADER
I20260924 08:02:17.152137 13992 sys_catalog.cc:455] T 00000000000000000000000000000000 P 51bfebb1ca3549fea0fb16c492fe62f8 [sys.catalog]: SysCatalogTable state changed. Reason: New leader 51bfebb1ca3549fea0fb16c492fe62f8. Latest consensus state: current_term: 1 leader_uuid: "51bfebb1ca3549fea0fb16c492fe62f8" committed_config { opid_index: -1 OBSOLETE_local: true peers { permanent_uuid: "51bfebb1ca3549fea0fb16c492fe62f8" member_type: VOTER last_known_addr { host: "127.12.95.126" port: 35855 } } }
I20260924 08:02:17.152534 13992 sys_catalog.cc:458] T 00000000000000000000000000000000 P 51bfebb1ca3549fea0fb16c492fe62f8 [sys.catalog]: This master's current role is: LEADER
I20260924 08:02:17.152827 14007 catalog_manager.cc:1524] Loading table and tablet metadata into memory...
I20260924 08:02:17.159157 14007 catalog_manager.cc:1533] Initializing Kudu cluster ID...
I20260924 08:02:17.171248 14007 catalog_manager.cc:1396] Generated new cluster ID: 9655b5588f1b4474a6c87cb6c6ccd14a
I20260924 08:02:17.171329 14007 catalog_manager.cc:1544] Initializing Kudu internal certificate authority...
I20260924 08:02:17.194155 14007 catalog_manager.cc:1419] Generated new certificate authority record
I20260924 08:02:17.195426 14007 catalog_manager.cc:1553] Loading token signing keys...
I20260924 08:02:17.210961 14007 catalog_manager.cc:6219] T 00000000000000000000000000000000 P 51bfebb1ca3549fea0fb16c492fe62f8: Generated new TSK 0
I20260924 08:02:17.211844 14007 catalog_manager.cc:1563] Initializing in-progress tserver states...
WARNING: no policy specified for kudu/127.12.95.65@KRBTEST.COM; defaulting to no policy
Authenticating as principal test-admin/admin@KRBTEST.COM with password.
Principal "kudu/127.12.95.65@KRBTEST.COM" created.
Authenticating as principal test-admin/admin@KRBTEST.COM with password.
Entry for principal kudu/127.12.95.65 with kvno 2, encryption type aes256-cts-hmac-sha1-96 added to keytab WRFILE:/tmp/dist-test-taskGoZl2g/test-tmp/ts_authz-itest.1.AuthzProviders_TSAuthzITest.TableScanCLI_Ranger.1790236757264992-12669-0/krb5kdc/kudu.keytab.
Entry for principal kudu/127.12.95.65 with kvno 2, encryption type aes128-cts-hmac-sha1-96 added to keytab WRFILE:/tmp/dist-test-taskGoZl2g/test-tmp/ts_authz-itest.1.AuthzProviders_TSAuthzITest.TableScanCLI_Ranger.1790236757264992-12669-0/krb5kdc/kudu.keytab.
WARNING: no policy specified for HTTP/127.12.95.65@KRBTEST.COM; defaulting to no policy
Authenticating as principal test-admin/admin@KRBTEST.COM with password.
Principal "HTTP/127.12.95.65@KRBTEST.COM" created.
Authenticating as principal test-admin/admin@KRBTEST.COM with password.
Entry for principal HTTP/127.12.95.65 with kvno 2, encryption type aes256-cts-hmac-sha1-96 added to keytab WRFILE:/tmp/dist-test-taskGoZl2g/test-tmp/ts_authz-itest.1.AuthzProviders_TSAuthzITest.TableScanCLI_Ranger.1790236757264992-12669-0/krb5kdc/kudu.keytab.
Entry for principal HTTP/127.12.95.65 with kvno 2, encryption type aes128-cts-hmac-sha1-96 added to keytab WRFILE:/tmp/dist-test-taskGoZl2g/test-tmp/ts_authz-itest.1.AuthzProviders_TSAuthzITest.TableScanCLI_Ranger.1790236757264992-12669-0/krb5kdc/kudu.keytab.
I20260924 08:02:18.049306 12669 external_mini_cluster.cc:1372] Running /tmp/dist-test-taskGoZl2g/build/debug/bin/kudu
/tmp/dist-test-taskGoZl2g/build/debug/bin/kudu
--fs_wal_dir=/tmp/dist-test-taskGoZl2g/test-tmp/ts_authz-itest.1.AuthzProviders_TSAuthzITest.TableScanCLI_Ranger.1790236757264992-12669-0/minicluster-data/ts-0/wal
--fs_data_dirs=/tmp/dist-test-taskGoZl2g/test-tmp/ts_authz-itest.1.AuthzProviders_TSAuthzITest.TableScanCLI_Ranger.1790236757264992-12669-0/minicluster-data/ts-0/data
--block_manager=log
--webserver_interface=localhost
--never_fsync
--enable_minidumps=false
--redact=none
--metrics_log_interval_ms=1000
--log_dir=/tmp/dist-test-taskGoZl2g/test-tmp/ts_authz-itest.1.AuthzProviders_TSAuthzITest.TableScanCLI_Ranger.1790236757264992-12669-0/minicluster-data/ts-0/logs
--server_dump_info_path=/tmp/dist-test-taskGoZl2g/test-tmp/ts_authz-itest.1.AuthzProviders_TSAuthzITest.TableScanCLI_Ranger.1790236757264992-12669-0/minicluster-data/ts-0/data/info.pb
--server_dump_info_format=pb
--rpc_server_allow_ephemeral_ports
--unlock_experimental_flags
--unlock_unsafe_flags
--logtostderr
--logbuflevel=-1
--ipki_server_key_size=768
--openssl_security_level_override=0
tserver
run
--rpc_bind_addresses=127.12.95.65:0
--local_ip_for_outbound_sockets=127.12.95.65
--webserver_interface=127.12.95.65
--webserver_port=0
--tserver_master_addrs=127.12.95.126:35855
--keytab_file=/tmp/dist-test-taskGoZl2g/test-tmp/ts_authz-itest.1.AuthzProviders_TSAuthzITest.TableScanCLI_Ranger.1790236757264992-12669-0/krb5kdc/kudu.keytab
--principal=kudu/127.12.95.65
--rpc_authentication=required
--superuser_acl=test-admin
--user_acl=test-user
--webserver_require_spnego=true
--builtin_ntp_servers=127.12.95.84:42875
--builtin_ntp_poll_interval_ms=100
--ntp_initial_sync_wait_secs=10
--time_source=builtin
--user_acl=user0,user1,user2
--tserver_enforce_access_control=true with env {KRB5CCNAME=/tmp/dist-test-taskGoZl2g/test-tmp/ts_authz-itest.1.AuthzProviders_TSAuthzITest.TableScanCLI_Ranger.1790236757264992-12669-0/krb5kdc/krb5cc,KRB5_CONFIG=/tmp/dist-test-taskGoZl2g/test-tmp/ts_authz-itest.1.AuthzProviders_TSAuthzITest.TableScanCLI_Ranger.1790236757264992-12669-0/krb5kdc/krb5.conf,KRB5_KDC_PROFILE=/tmp/dist-test-taskGoZl2g/test-tmp/ts_authz-itest.1.AuthzProviders_TSAuthzITest.TableScanCLI_Ranger.1790236757264992-12669-0/krb5kdc/kdc.conf,KUDU_ENABLE_KRB5_REALM_FIX=yes}
W20260924 08:02:18.184041 14046 flags.cc:432] Enabled unsafe flag: --openssl_security_level_override=0
W20260924 08:02:18.184324 14046 flags.cc:432] Enabled unsafe flag: --rpc_server_allow_ephemeral_ports=true
W20260924 08:02:18.184422 14046 flags.cc:432] Enabled unsafe flag: --never_fsync=true
W20260924 08:02:18.188769 14046 flags.cc:432] Enabled experimental flag: --ipki_server_key_size=768
W20260924 08:02:18.188982 14046 flags.cc:432] Enabled experimental flag: --local_ip_for_outbound_sockets=127.12.95.65
I20260924 08:02:18.194875 14046 tablet_server_runner.cc:78] Tablet server non-default flags:
--log_dir=/tmp/dist-test-taskGoZl2g/test-tmp/ts_authz-itest.1.AuthzProviders_TSAuthzITest.TableScanCLI_Ranger.1790236757264992-12669-0/minicluster-data/ts-0/logs
--logbuflevel=-1
--logtostderr=true
--builtin_ntp_poll_interval_ms=100
--builtin_ntp_servers=127.12.95.84:42875
--ntp_initial_sync_wait_secs=10
--time_source=builtin
--fs_data_dirs=/tmp/dist-test-taskGoZl2g/test-tmp/ts_authz-itest.1.AuthzProviders_TSAuthzITest.TableScanCLI_Ranger.1790236757264992-12669-0/minicluster-data/ts-0/data
--fs_wal_dir=/tmp/dist-test-taskGoZl2g/test-tmp/ts_authz-itest.1.AuthzProviders_TSAuthzITest.TableScanCLI_Ranger.1790236757264992-12669-0/minicluster-data/ts-0/wal
--keytab_file=/tmp/dist-test-taskGoZl2g/test-tmp/ts_authz-itest.1.AuthzProviders_TSAuthzITest.TableScanCLI_Ranger.1790236757264992-12669-0/krb5kdc/kudu.keytab
--principal=kudu/127.12.95.65
--ipki_server_key_size=768
--openssl_security_level_override=0
--rpc_bind_addresses=127.12.95.65:0
--rpc_server_allow_ephemeral_ports=true
--rpc_authentication=required
--superuser_acl=<redacted>
--user_acl=<redacted>
--metrics_log_interval_ms=1000
--server_dump_info_format=pb
--server_dump_info_path=/tmp/dist-test-taskGoZl2g/test-tmp/ts_authz-itest.1.AuthzProviders_TSAuthzITest.TableScanCLI_Ranger.1790236757264992-12669-0/minicluster-data/ts-0/data/info.pb
--webserver_interface=127.12.95.65
--webserver_port=0
--webserver_require_spnego=true
--tserver_master_addrs=127.12.95.126:35855
--tserver_enforce_access_control=true
--never_fsync=true
--heap_profile_path=/tmp/kudu.14046
--redact=none
--unlock_experimental_flags=true
--unlock_unsafe_flags=true
--enable_minidumps=false
--local_ip_for_outbound_sockets=127.12.95.65

Tablet server version:
kudu 1.19.0-SNAPSHOT
revision ee47a9ca1939200e227f9bf266c97a7c0eed3ccc
build type DEBUG
built by None at 24 Sep 2026 07:43:13 UTC on bdcb31816ec0
build id 13971
I20260924 08:02:18.196558 14046 env_posix.cc:2285] Not raising this process' open files per process limit of 1048576; it is already as high as it can go
I20260924 08:02:18.197732 14046 file_cache.cc:504] Constructed file cache file cache with capacity 419430
W20260924 08:02:18.205919 14056 instance_detector.cc:116] could not retrieve OpenStack instance metadata: Network error: curl error: HTTP response code said error: The requested URL returned error: 404
W20260924 08:02:18.206274 14054 instance_detector.cc:116] could not retrieve Azure instance metadata: Network error: curl error: HTTP response code said error: The requested URL returned error: 404
I20260924 08:02:18.206527 14046 server_base.cc:1061] running on GCE node
W20260924 08:02:18.206893 14053 instance_detector.cc:116] could not retrieve AWS instance metadata: Network error: curl error: HTTP response code said error: The requested URL returned error: 404
I20260924 08:02:18.207346 14046 hybrid_clock.cc:584] initializing the hybrid clock with 'builtin' time source
I20260924 08:02:18.208020 14046 hybrid_clock.cc:630] waiting up to --ntp_initial_sync_wait_secs=10 seconds for the clock to synchronize
I20260924 08:02:18.209182 14046 hybrid_clock.cc:648] HybridClock initialized: now 1790236938209125 us; error 71 us; skew 500 ppm
Sep 24 08:02:18 dist-test-slave-hwwr krb5kdc[13346](info): AS_REQ (2 etypes {17 16}) 127.0.0.1: ISSUE: authtime 1790236938, etypes {rep=17 tkt=17 ses=17}, kudu/127.12.95.65@KRBTEST.COM for krbtgt/KRBTEST.COM@KRBTEST.COM
I20260924 08:02:18.212764 14046 init.cc:377] Logged in from keytab as kudu/127.12.95.65@KRBTEST.COM (short username kudu)
I20260924 08:02:18.214211 14046 webserver.cc:533] Webserver started at http://127.12.95.65:39957/ using document root <none> and password file <none>
I20260924 08:02:18.215013 14046 fs_manager.cc:362] Metadata directory not provided
I20260924 08:02:18.215137 14046 fs_manager.cc:368] Using write-ahead log directory (fs_wal_dir) as metadata directory
I20260924 08:02:18.215417 14046 server_base.cc:909] This appears to be a new deployment of Kudu; creating new FS layout
I20260924 08:02:18.217093 14046 fs_manager.cc:1068] Generated new instance metadata in path /tmp/dist-test-taskGoZl2g/test-tmp/ts_authz-itest.1.AuthzProviders_TSAuthzITest.TableScanCLI_Ranger.1790236757264992-12669-0/minicluster-data/ts-0/data/instance:
uuid: "17a96ae8b6b44a0485a5132472fe539d"
format_stamp: "Formatted at 2026-09-24 08:02:18 on dist-test-slave-hwwr"
I20260924 08:02:18.217759 14046 fs_manager.cc:1068] Generated new instance metadata in path /tmp/dist-test-taskGoZl2g/test-tmp/ts_authz-itest.1.AuthzProviders_TSAuthzITest.TableScanCLI_Ranger.1790236757264992-12669-0/minicluster-data/ts-0/wal/instance:
uuid: "17a96ae8b6b44a0485a5132472fe539d"
format_stamp: "Formatted at 2026-09-24 08:02:18 on dist-test-slave-hwwr"
I20260924 08:02:18.222282 14046 fs_manager.cc:696] Time spent creating directory manager: real 0.004s	user 0.003s	sys 0.000s
I20260924 08:02:18.227247 14063 log_block_manager.cc:4127] Time spent loading block containers with low live blocks: real 0.000s	user 0.000s	sys 0.000s
I20260924 08:02:18.229017 14046 fs_manager.cc:730] Time spent opening block manager: real 0.005s	user 0.003s	sys 0.000s
I20260924 08:02:18.229179 14046 fs_manager.cc:647] Opened local filesystem: /tmp/dist-test-taskGoZl2g/test-tmp/ts_authz-itest.1.AuthzProviders_TSAuthzITest.TableScanCLI_Ranger.1790236757264992-12669-0/minicluster-data/ts-0/data,/tmp/dist-test-taskGoZl2g/test-tmp/ts_authz-itest.1.AuthzProviders_TSAuthzITest.TableScanCLI_Ranger.1790236757264992-12669-0/minicluster-data/ts-0/wal
uuid: "17a96ae8b6b44a0485a5132472fe539d"
format_stamp: "Formatted at 2026-09-24 08:02:18 on dist-test-slave-hwwr"
I20260924 08:02:18.229333 14046 fs_report.cc:389] FS layout report
--------------------
wal directory: /tmp/dist-test-taskGoZl2g/test-tmp/ts_authz-itest.1.AuthzProviders_TSAuthzITest.TableScanCLI_Ranger.1790236757264992-12669-0/minicluster-data/ts-0/wal
metadata directory: /tmp/dist-test-taskGoZl2g/test-tmp/ts_authz-itest.1.AuthzProviders_TSAuthzITest.TableScanCLI_Ranger.1790236757264992-12669-0/minicluster-data/ts-0/wal
1 data directories: /tmp/dist-test-taskGoZl2g/test-tmp/ts_authz-itest.1.AuthzProviders_TSAuthzITest.TableScanCLI_Ranger.1790236757264992-12669-0/minicluster-data/ts-0/data/data
Total live blocks: 0
Total live bytes: 0
Total live bytes (after alignment): 0
Total number of LBM containers: 0 (0 full)
Did not check for missing blocks
Did not check for orphaned blocks
Total full LBM containers with extra space: 0 (0 repaired)
Total full LBM container extra space in bytes: 0 (0 repaired)
Total incomplete LBM containers: 0 (0 repaired)
Total LBM partial records: 0 (0 repaired)
Total corrupted LBM metadata records in RocksDB: 0 (0 repaired)
I20260924 08:02:18.246182 14046 rpc_server.cc:225] running with OpenSSL 1.1.1  11 Sep 2018
I20260924 08:02:18.249887 14046 env_posix.cc:2285] Not raising this process' running threads per effective uid limit of 18446744073709551615; it is already as high as it can go
I20260924 08:02:18.250142 14046 kserver.cc:163] Server-wide thread pool size limit: 3276
I20260924 08:02:18.250842 14046 txn_system_client.cc:432] TxnSystemClient initialization is disabled...
I20260924 08:02:18.252041 14046 ts_tablet_manager.cc:585] Loaded tablet metadata (0 total tablets, 0 live tablets)
I20260924 08:02:18.252138 14046 ts_tablet_manager.cc:531] Time spent load tablet metadata: real 0.000s	user 0.000s	sys 0.000s
I20260924 08:02:18.252221 14046 ts_tablet_manager.cc:616] Registered 0 tablets
I20260924 08:02:18.252270 14046 ts_tablet_manager.cc:595] Time spent register tablets: real 0.000s	user 0.000s	sys 0.000s
I20260924 08:02:18.264426 14046 rpc_server.cc:307] RPC server started. Bound to: 127.12.95.65:42733
I20260924 08:02:18.266702 14046 server_base.cc:1193] Dumped server information to /tmp/dist-test-taskGoZl2g/test-tmp/ts_authz-itest.1.AuthzProviders_TSAuthzITest.TableScanCLI_Ranger.1790236757264992-12669-0/minicluster-data/ts-0/data/info.pb
I20260924 08:02:18.266906 14177 acceptor_pool.cc:272] collecting diagnostics on the listening RPC socket 127.12.95.65:42733 every 8 connection(s)
I20260924 08:02:18.270537 12669 external_mini_cluster.cc:1434] Started /tmp/dist-test-taskGoZl2g/build/debug/bin/kudu as pid 14046
I20260924 08:02:18.270655 12669 external_mini_cluster.cc:1448] Reading /tmp/dist-test-taskGoZl2g/test-tmp/ts_authz-itest.1.AuthzProviders_TSAuthzITest.TableScanCLI_Ranger.1790236757264992-12669-0/minicluster-data/ts-0/wal/instance
Sep 24 08:02:18 dist-test-slave-hwwr krb5kdc[13346](info): TGS_REQ (2 etypes {17 16}) 127.0.0.1: ISSUE: authtime 1790236938, etypes {rep=17 tkt=17 ses=17}, kudu/127.12.95.65@KRBTEST.COM for kudu/127.12.95.126@KRBTEST.COM
I20260924 08:02:18.295011 14179 heartbeater.cc:344] Connected to a master server at 127.12.95.126:35855
I20260924 08:02:18.295300 14179 heartbeater.cc:461] Registering TS with master...
I20260924 08:02:18.295951 14179 heartbeater.cc:507] Master 127.12.95.126:35855 requested a full tablet report, sending...
I20260924 08:02:18.297816 13943 ts_manager.cc:194] Registered new tserver with Master: 17a96ae8b6b44a0485a5132472fe539d (127.12.95.65:42733)
I20260924 08:02:18.299350 13943 master_service.cc:502] Signed X509 certificate for tserver {username='kudu', principal='kudu/127.12.95.65@KRBTEST.COM'} at 127.12.95.65:49519
I20260924 08:02:18.310158 12669 external_mini_cluster.cc:955] 1 TS(s) registered with all masters
WARNING: no policy specified for kudu@KRBTEST.COM; defaulting to no policy
Authenticating as principal test-admin/admin@KRBTEST.COM with password.
Principal "kudu@KRBTEST.COM" created.
Sep 24 08:02:18 dist-test-slave-hwwr krb5kdc[13346](info): AS_REQ (2 etypes {17 16}) 127.0.0.1: ISSUE: authtime 1790236938, etypes {rep=17 tkt=17 ses=17}, kudu@KRBTEST.COM for krbtgt/KRBTEST.COM@KRBTEST.COM
Password for kudu@KRBTEST.COM: 
Sep 24 08:02:18 dist-test-slave-hwwr krb5kdc[13346](info): AS_REQ (1 etypes {17}) 127.0.0.1: ISSUE: authtime 1790236938, etypes {rep=17 tkt=17 ses=17}, kudu/127.12.95.126@KRBTEST.COM for krbtgt/KRBTEST.COM@KRBTEST.COM
Sep 24 08:02:18 dist-test-slave-hwwr krb5kdc[13346](info): TGS_REQ (1 etypes {17}) 127.0.0.1: ISSUE: authtime 1790236938, etypes {rep=17 tkt=17 ses=17}, kudu/127.12.95.126@KRBTEST.COM for HTTP/127.12.95.84@KRBTEST.COM
I20260924 08:02:18.972677 12669 mini_ranger.cc:389] Successfully created Ranger user: test-admin
I20260924 08:02:19.302246 14179 heartbeater.cc:499] Master 127.12.95.126:35855 was elected leader, sending a full tablet report...
I20260924 08:02:19.413415 13943 master_service.cc:977] request to refresh authz privileges cache from {username='test-admin', principal='test-admin@KRBTEST.COM'} at 127.0.0.1:38110
Sep 24 08:02:19 dist-test-slave-hwwr krb5kdc[13346](info): TGS_REQ (1 etypes {17}) 127.0.0.1: ISSUE: authtime 1790236938, etypes {rep=17 tkt=17 ses=17}, kudu/127.12.95.126@KRBTEST.COM for HTTP/127.12.95.84@KRBTEST.COM
WARNING: no policy specified for test-admin@KRBTEST.COM; defaulting to no policy
add_principal: Principal or policy already exists while creating "test-admin@KRBTEST.COM".
Authenticating as principal kudu/admin@KRBTEST.COM with password.
Sep 24 08:02:20 dist-test-slave-hwwr krb5kdc[13346](info): AS_REQ (2 etypes {17 16}) 127.0.0.1: ISSUE: authtime 1790236940, etypes {rep=17 tkt=17 ses=17}, test-admin@KRBTEST.COM for krbtgt/KRBTEST.COM@KRBTEST.COM
Password for test-admin@KRBTEST.COM: 
Sep 24 08:02:20 dist-test-slave-hwwr krb5kdc[13346](info): TGS_REQ (2 etypes {17 16}) 127.0.0.1: ISSUE: authtime 1790236940, etypes {rep=17 tkt=17 ses=17}, test-admin@KRBTEST.COM for kudu/127.12.95.126@KRBTEST.COM
WARNING: no policy specified for user0@KRBTEST.COM; defaulting to no policy
Authenticating as principal test-admin/admin@KRBTEST.COM with password.
Principal "user0@KRBTEST.COM" created.
Sep 24 08:02:20 dist-test-slave-hwwr krb5kdc[13346](info): AS_REQ (2 etypes {17 16}) 127.0.0.1: ISSUE: authtime 1790236940, etypes {rep=17 tkt=17 ses=17}, user0@KRBTEST.COM for krbtgt/KRBTEST.COM@KRBTEST.COM
Password for user0@KRBTEST.COM: 
I20260924 08:02:20.446295 13943 catalog_manager.cc:2296] Servicing CreateTable request from {username='test-admin', principal='test-admin@KRBTEST.COM'} at 127.0.0.1:38128:
name: "db.table"
schema {
  columns {
    name: "col0"
    type: INT32
    is_key: true
    is_nullable: false
    encoding: AUTO_ENCODING
    compression: DEFAULT_COMPRESSION
    cfile_block_size: 0
    immutable: false
  }
  columns {
    name: "col1"
    type: INT32
    is_key: false
    is_nullable: true
    encoding: AUTO_ENCODING
    compression: DEFAULT_COMPRESSION
    cfile_block_size: 0
    immutable: false
  }
  columns {
    name: "col2"
    type: INT32
    is_key: false
    is_nullable: true
    encoding: AUTO_ENCODING
    compression: DEFAULT_COMPRESSION
    cfile_block_size: 0
    immutable: false
  }
}
num_replicas: 1
split_rows_range_bounds {
}
partition_schema {
  range_schema {
    columns {
      name: "col0"
    }
  }
}
owner: "user0"
I20260924 08:02:20.463074 14112 tablet_service.cc:1511] Processing CreateTablet for tablet aed06ee539d74b7c89c4bcd20fea8dc3 (DEFAULT_TABLE table=db.table [id=2872dbd7565f428891420519286c6a09]), partition=RANGE (col0) PARTITION UNBOUNDED
I20260924 08:02:20.463967 14112 data_dirs.cc:400] Could only allocate 1 dirs of requested 3 for tablet aed06ee539d74b7c89c4bcd20fea8dc3. 1 dirs total, 0 dirs full, 0 dirs failed
I20260924 08:02:20.468693 14229 tablet_bootstrap.cc:492] T aed06ee539d74b7c89c4bcd20fea8dc3 P 17a96ae8b6b44a0485a5132472fe539d: Bootstrap starting.
I20260924 08:02:20.470701 14229 tablet_bootstrap.cc:654] T aed06ee539d74b7c89c4bcd20fea8dc3 P 17a96ae8b6b44a0485a5132472fe539d: Neither blocks nor log segments found. Creating new log.
I20260924 08:02:20.471484 14229 log.cc:826] T aed06ee539d74b7c89c4bcd20fea8dc3 P 17a96ae8b6b44a0485a5132472fe539d: Log is configured to *not* fsync() on all Append() calls
I20260924 08:02:20.473039 14229 tablet_bootstrap.cc:492] T aed06ee539d74b7c89c4bcd20fea8dc3 P 17a96ae8b6b44a0485a5132472fe539d: No bootstrap required, opened a new log
I20260924 08:02:20.473255 14229 ts_tablet_manager.cc:1403] T aed06ee539d74b7c89c4bcd20fea8dc3 P 17a96ae8b6b44a0485a5132472fe539d: Time spent bootstrapping tablet: real 0.005s	user 0.000s	sys 0.003s
I20260924 08:02:20.475999 14229 raft_consensus.cc:359] T aed06ee539d74b7c89c4bcd20fea8dc3 P 17a96ae8b6b44a0485a5132472fe539d [term 0 FOLLOWER]: Replica starting. Triggering 0 pending ops. Active config: opid_index: -1 OBSOLETE_local: true peers { permanent_uuid: "17a96ae8b6b44a0485a5132472fe539d" member_type: VOTER last_known_addr { host: "127.12.95.65" port: 42733 } }
I20260924 08:02:20.476192 14229 raft_consensus.cc:385] T aed06ee539d74b7c89c4bcd20fea8dc3 P 17a96ae8b6b44a0485a5132472fe539d [term 0 FOLLOWER]: Consensus starting up: Expiring failure detector timer to make a prompt election more likely
I20260924 08:02:20.476256 14229 raft_consensus.cc:740] T aed06ee539d74b7c89c4bcd20fea8dc3 P 17a96ae8b6b44a0485a5132472fe539d [term 0 FOLLOWER]: Becoming Follower/Learner. State: Replica: 17a96ae8b6b44a0485a5132472fe539d, State: Initialized, Role: FOLLOWER
I20260924 08:02:20.476619 14229 consensus_queue.cc:260] T aed06ee539d74b7c89c4bcd20fea8dc3 P 17a96ae8b6b44a0485a5132472fe539d [NON_LEADER]: Queue going to NON_LEADER mode. State: All replicated index: 0, Majority replicated index: 0, Committed index: 0, Last appended: 0.0, Last appended by leader: 0, Current term: 0, Majority size: -1, State: 0, Mode: NON_LEADER, active raft config: opid_index: -1 OBSOLETE_local: true peers { permanent_uuid: "17a96ae8b6b44a0485a5132472fe539d" member_type: VOTER last_known_addr { host: "127.12.95.65" port: 42733 } }
I20260924 08:02:20.476755 14229 raft_consensus.cc:399] T aed06ee539d74b7c89c4bcd20fea8dc3 P 17a96ae8b6b44a0485a5132472fe539d [term 0 FOLLOWER]: Only one voter in the Raft config. Triggering election immediately
I20260924 08:02:20.476832 14229 raft_consensus.cc:493] T aed06ee539d74b7c89c4bcd20fea8dc3 P 17a96ae8b6b44a0485a5132472fe539d [term 0 FOLLOWER]: Starting leader election (initial election of a single-replica configuration)
I20260924 08:02:20.476925 14229 raft_consensus.cc:3060] T aed06ee539d74b7c89c4bcd20fea8dc3 P 17a96ae8b6b44a0485a5132472fe539d [term 0 FOLLOWER]: Advancing to term 1
I20260924 08:02:20.477761 14229 raft_consensus.cc:515] T aed06ee539d74b7c89c4bcd20fea8dc3 P 17a96ae8b6b44a0485a5132472fe539d [term 1 FOLLOWER]: Starting leader election with config: opid_index: -1 OBSOLETE_local: true peers { permanent_uuid: "17a96ae8b6b44a0485a5132472fe539d" member_type: VOTER last_known_addr { host: "127.12.95.65" port: 42733 } }
I20260924 08:02:20.478104 14229 leader_election.cc:304] T aed06ee539d74b7c89c4bcd20fea8dc3 P 17a96ae8b6b44a0485a5132472fe539d [CANDIDATE]: Term 1 election: Election decided. Result: candidate won. Election summary: received 1 responses out of 1 voters: 1 yes votes; 0 no votes. yes voters: 17a96ae8b6b44a0485a5132472fe539d; no voters: 
I20260924 08:02:20.478399 14229 leader_election.cc:290] T aed06ee539d74b7c89c4bcd20fea8dc3 P 17a96ae8b6b44a0485a5132472fe539d [CANDIDATE]: Term 1 election: Requested vote from peers 
I20260924 08:02:20.478523 14231 raft_consensus.cc:2804] T aed06ee539d74b7c89c4bcd20fea8dc3 P 17a96ae8b6b44a0485a5132472fe539d [term 1 FOLLOWER]: Leader election won for term 1
I20260924 08:02:20.478811 14231 raft_consensus.cc:697] T aed06ee539d74b7c89c4bcd20fea8dc3 P 17a96ae8b6b44a0485a5132472fe539d [term 1 LEADER]: Becoming Leader. State: Replica: 17a96ae8b6b44a0485a5132472fe539d, State: Running, Role: LEADER
I20260924 08:02:20.479372 14231 consensus_queue.cc:237] T aed06ee539d74b7c89c4bcd20fea8dc3 P 17a96ae8b6b44a0485a5132472fe539d [LEADER]: Queue going to LEADER mode. State: All replicated index: 0, Majority replicated index: 0, Committed index: 0, Last appended: 0.0, Last appended by leader: 0, Current term: 1, Majority size: 1, State: 0, Mode: LEADER, active raft config: opid_index: -1 OBSOLETE_local: true peers { permanent_uuid: "17a96ae8b6b44a0485a5132472fe539d" member_type: VOTER last_known_addr { host: "127.12.95.65" port: 42733 } }
I20260924 08:02:20.479388 14229 ts_tablet_manager.cc:1434] T aed06ee539d74b7c89c4bcd20fea8dc3 P 17a96ae8b6b44a0485a5132472fe539d: Time spent starting tablet: real 0.006s	user 0.003s	sys 0.004s
I20260924 08:02:20.482753 13943 catalog_manager.cc:5838] T aed06ee539d74b7c89c4bcd20fea8dc3 P 17a96ae8b6b44a0485a5132472fe539d reported cstate change: term changed from 0 to 1, leader changed from <none> to 17a96ae8b6b44a0485a5132472fe539d (127.12.95.65). New cstate: current_term: 1 leader_uuid: "17a96ae8b6b44a0485a5132472fe539d" committed_config { opid_index: -1 OBSOLETE_local: true peers { permanent_uuid: "17a96ae8b6b44a0485a5132472fe539d" member_type: VOTER last_known_addr { host: "127.12.95.65" port: 42733 } health_report { overall_health: HEALTHY } } }
I20260924 08:02:20.562918 12669 mini_ranger.cc:389] Successfully created Ranger user: user0
I20260924 08:02:20.672353 13944 master_service.cc:977] request to refresh authz privileges cache from {username='test-admin', principal='test-admin@KRBTEST.COM'} at 127.0.0.1:38110
I20260924 08:02:20.949978 12669 mini_ranger.cc:375] User user0 already exists in Ranger, moving on.
I20260924 08:02:21.115478 13944 master_service.cc:977] request to refresh authz privileges cache from {username='test-admin', principal='test-admin@KRBTEST.COM'} at 127.0.0.1:38110
Sep 24 08:02:21 dist-test-slave-hwwr krb5kdc[13346](info): TGS_REQ (2 etypes {17 16}) 127.0.0.1: ISSUE: authtime 1790236940, etypes {rep=17 tkt=17 ses=17}, user0@KRBTEST.COM for kudu/127.12.95.126@KRBTEST.COM
W20260924 08:02:21.677639 14091 tablet_service.cc:593] rejecting Scan request from {username='user0'} at 127.0.0.1:40412: authz token doesn't authorize column ID 11
W20260924 08:02:21.887463 14091 tablet_service.cc:593] rejecting Scan request from {username='user0'} at 127.0.0.1:40426: authz token doesn't authorize column ID 11
W20260924 08:02:22.093101 14091 tablet_service.cc:593] rejecting Scan request from {username='user0'} at 127.0.0.1:40434: authz token doesn't authorize column ID 11
W20260924 08:02:22.300474 14091 tablet_service.cc:593] rejecting Scan request from {username='user0'} at 127.0.0.1:40436: authz token doesn't authorize column ID 12
W20260924 08:02:22.514029 14091 tablet_service.cc:593] rejecting Scan request from {username='user0'} at 127.0.0.1:40444: authz token doesn't authorize column ID 12
W20260924 08:02:22.722182 14091 tablet_service.cc:593] rejecting Scan request from {username='user0'} at 127.0.0.1:40448: authz token doesn't authorize column ID 12
W20260924 08:02:22.883751 14091 tablet_service.cc:593] rejecting Scan request from {username='user0'} at 127.0.0.1:40456: authz token doesn't authorize column ID 12
W20260924 08:02:23.041597 14091 tablet_service.cc:593] rejecting Scan request from {username='user0'} at 127.0.0.1:40470: authz token doesn't authorize column ID 12
W20260924 08:02:23.196382 14091 tablet_service.cc:593] rejecting Scan request from {username='user0'} at 127.0.0.1:40480: authz token doesn't authorize column ID 12
W20260924 08:02:23.404220 14091 tablet_service.cc:593] rejecting Scan request from {username='user0'} at 127.0.0.1:40482: authz token doesn't authorize column ID 12
I20260924 08:02:23.463789 12669 external_mini_cluster.cc:1664] Killing /tmp/dist-test-taskGoZl2g/build/debug/bin/kudu with pid 14046
I20260924 08:02:23.470489 12669 external_mini_cluster.cc:1664] Killing /tmp/dist-test-taskGoZl2g/build/debug/bin/kudu with pid 13919
I20260924 08:02:23.480962 12669 mini_ranger.cc:67] Stopping Ranger...
I20260924 08:02:23.846576 12669 mini_ranger.cc:69] Stopped Ranger
2026-09-24 08:02:23.846 UTC [13377] LOG:  received smart shutdown request
2026-09-24 08:02:23.850 UTC [13377] LOG:  background worker "logical replication launcher" (PID 13385) exited with exit code 1
2026-09-24 08:02:23.850 UTC [13380] LOG:  shutting down
2026-09-24 08:02:23.852 UTC [13380] LOG:  checkpoint starting: shutdown immediate
2026-09-24 08:02:24.410 UTC [13380] LOG:  checkpoint complete: wrote 1556 buffers (9.5%); 0 WAL file(s) added, 0 removed, 0 recycled; write=0.026 s, sync=0.526 s, total=0.560 s; sync files=832, longest=0.005 s, average=0.001 s; distance=8470 kB, estimate=8470 kB; lsn=0/1CC0420, redo lsn=0/1CC0420
2026-09-24 08:02:24.417 UTC [13377] LOG:  database system is shut down
2026-09-24T08:02:24Z chronyd exiting
[       OK ] AuthzProviders/TSAuthzITest.TableScanCLI/Ranger (50519 ms)
[----------] 2 tests from AuthzProviders/TSAuthzITest (187239 ms total)

[----------] 1 test from AuthzProviders/TSAuthzTxnOpsITest
[ RUN      ] AuthzProviders/TSAuthzTxnOpsITest.BasicOperationsForAuthorizedUsers/Ranger
Loading random data
Initializing database '/tmp/dist-test-taskGoZl2g/test-tmp/ts_authz-itest.1.AuthzProviders_TSAuthzTxnOpsITest.BasicOperationsForAuthorizedUsers_Ranger.1790236757264992-12669-0/krb5kdc/principal' for realm 'KRBTEST.COM',
master key name 'K/M@KRBTEST.COM'
Sep 24 08:02:24 dist-test-slave-hwwr krb5kdc[14396](info): setting up network...
krb5kdc: setsockopt(10,IPV6_V6ONLY,1) worked
Sep 24 08:02:24 dist-test-slave-hwwr krb5kdc[14396](info): set up 2 sockets
Sep 24 08:02:24 dist-test-slave-hwwr krb5kdc[14396](info): commencing operation
krb5kdc: starting...
W20260924 08:02:26.513929 12669 mini_kdc.cc:121] Time spent starting KDC: real 1.998s	user 0.002s	sys 0.005s
WARNING: no policy specified for test-admin@KRBTEST.COM; defaulting to no policy
Authenticating as principal slave/admin@KRBTEST.COM with password.
Principal "test-admin@KRBTEST.COM" created.
WARNING: no policy specified for test-user@KRBTEST.COM; defaulting to no policy
Authenticating as principal slave/admin@KRBTEST.COM with password.
Principal "test-user@KRBTEST.COM" created.
WARNING: no policy specified for joe-interloper@KRBTEST.COM; defaulting to no policy
Authenticating as principal slave/admin@KRBTEST.COM with password.
Principal "joe-interloper@KRBTEST.COM" created.
Authenticating as principal slave/admin@KRBTEST.COM with password.
Entry for principal test-user with kvno 1, encryption type aes256-cts-hmac-sha1-96 added to keytab WRFILE:/tmp/dist-test-taskGoZl2g/test-tmp/ts_authz-itest.1.AuthzProviders_TSAuthzTxnOpsITest.BasicOperationsForAuthorizedUsers_Ranger.1790236757264992-12669-0/krb5kdc/test-user.keytab.
Entry for principal test-user with kvno 1, encryption type aes128-cts-hmac-sha1-96 added to keytab WRFILE:/tmp/dist-test-taskGoZl2g/test-tmp/ts_authz-itest.1.AuthzProviders_TSAuthzTxnOpsITest.BasicOperationsForAuthorizedUsers_Ranger.1790236757264992-12669-0/krb5kdc/test-user.keytab.
Sep 24 08:02:26 dist-test-slave-hwwr krb5kdc[14396](info): AS_REQ (2 etypes {17 16}) 127.0.0.1: ISSUE: authtime 1790236946, etypes {rep=17 tkt=17 ses=17}, test-admin@KRBTEST.COM for krbtgt/KRBTEST.COM@KRBTEST.COM
Password for test-admin@KRBTEST.COM: 
2026-09-24T08:02:26Z chronyd version 4.6.1 starting (+CMDMON +NTP +REFCLOCK +RTC -PRIVDROP -SCFILTER -SIGND +ASYNCDNS -NTS -SECHASH -IPV6 +DEBUG)
2026-09-24T08:02:26Z Disabled control of system clock
WARNING: no policy specified for rangeradmin/127.12.95.84@KRBTEST.COM; defaulting to no policy
Authenticating as principal test-admin/admin@KRBTEST.COM with password.
Principal "rangeradmin/127.12.95.84@KRBTEST.COM" created.
Authenticating as principal test-admin/admin@KRBTEST.COM with password.
Entry for principal rangeradmin/127.12.95.84@KRBTEST.COM with kvno 2, encryption type aes256-cts-hmac-sha1-96 added to keytab WRFILE:/tmp/dist-test-taskGoZl2g/test-tmp/ts_authz-itest.1.AuthzProviders_TSAuthzTxnOpsITest.BasicOperationsForAuthorizedUsers_Ranger.1790236757264992-12669-0/krb5kdc/rangeradmin_127.12.95.84@KRBTEST.COM.keytab.
Entry for principal rangeradmin/127.12.95.84@KRBTEST.COM with kvno 2, encryption type aes128-cts-hmac-sha1-96 added to keytab WRFILE:/tmp/dist-test-taskGoZl2g/test-tmp/ts_authz-itest.1.AuthzProviders_TSAuthzTxnOpsITest.BasicOperationsForAuthorizedUsers_Ranger.1790236757264992-12669-0/krb5kdc/rangeradmin_127.12.95.84@KRBTEST.COM.keytab.
WARNING: no policy specified for rangerlookup/127.12.95.84@KRBTEST.COM; defaulting to no policy
Authenticating as principal test-admin/admin@KRBTEST.COM with password.
Principal "rangerlookup/127.12.95.84@KRBTEST.COM" created.
Authenticating as principal test-admin/admin@KRBTEST.COM with password.
Entry for principal rangerlookup/127.12.95.84@KRBTEST.COM with kvno 2, encryption type aes256-cts-hmac-sha1-96 added to keytab WRFILE:/tmp/dist-test-taskGoZl2g/test-tmp/ts_authz-itest.1.AuthzProviders_TSAuthzTxnOpsITest.BasicOperationsForAuthorizedUsers_Ranger.1790236757264992-12669-0/krb5kdc/rangerlookup_127.12.95.84@KRBTEST.COM.keytab.
Entry for principal rangerlookup/127.12.95.84@KRBTEST.COM with kvno 2, encryption type aes128-cts-hmac-sha1-96 added to keytab WRFILE:/tmp/dist-test-taskGoZl2g/test-tmp/ts_authz-itest.1.AuthzProviders_TSAuthzTxnOpsITest.BasicOperationsForAuthorizedUsers_Ranger.1790236757264992-12669-0/krb5kdc/rangerlookup_127.12.95.84@KRBTEST.COM.keytab.
WARNING: no policy specified for HTTP/127.12.95.84@KRBTEST.COM; defaulting to no policy
Authenticating as principal test-admin/admin@KRBTEST.COM with password.
Principal "HTTP/127.12.95.84@KRBTEST.COM" created.
Authenticating as principal test-admin/admin@KRBTEST.COM with password.
Entry for principal HTTP/127.12.95.84@KRBTEST.COM with kvno 2, encryption type aes256-cts-hmac-sha1-96 added to keytab WRFILE:/tmp/dist-test-taskGoZl2g/test-tmp/ts_authz-itest.1.AuthzProviders_TSAuthzTxnOpsITest.BasicOperationsForAuthorizedUsers_Ranger.1790236757264992-12669-0/krb5kdc/HTTP_127.12.95.84@KRBTEST.COM.keytab.
Entry for principal HTTP/127.12.95.84@KRBTEST.COM with kvno 2, encryption type aes128-cts-hmac-sha1-96 added to keytab WRFILE:/tmp/dist-test-taskGoZl2g/test-tmp/ts_authz-itest.1.AuthzProviders_TSAuthzTxnOpsITest.BasicOperationsForAuthorizedUsers_Ranger.1790236757264992-12669-0/krb5kdc/HTTP_127.12.95.84@KRBTEST.COM.keytab.
I20260924 08:02:26.675683 12669 mini_postgres.cc:62] Running initdb...
The files belonging to this database system will be owned by user "slave".
This user must also own the server process.

The database cluster will be initialized with locale "C".
The default database encoding has accordingly been set to "SQL_ASCII".
The default text search configuration will be set to "english".

Data page checksums are disabled.

creating directory /tmp/dist-test-taskGoZl2g/test-tmp/ts_authz-itest.1.AuthzProviders_TSAuthzTxnOpsITest.BasicOperationsForAuthorizedUsers_Ranger.1790236757264992-12669-0/minicluster-data/postgres ... ok
creating subdirectories ... ok
selecting dynamic shared memory implementation ... posix
selecting default "max_connections" ... 100
selecting default "shared_buffers" ... 128MB
selecting default time zone ... Etc/UTC
creating configuration files ... ok
running bootstrap script ... ok
performing post-bootstrap initialization ... ok
syncing data to disk ... ok

initdb: warning: enabling "trust" authentication for local connections
initdb: hint: You can change this by editing pg_hba.conf or using the option -A, or --auth-local and --auth-host, the next time you run initdb.

Success. You can now start the database server using:

    /tmp/dist-test-taskGoZl2g/build/debug/bin/postgres/pg_ctl -D /tmp/dist-test-taskGoZl2g/test-tmp/ts_authz-itest.1.AuthzProviders_TSAuthzTxnOpsITest.BasicOperationsForAuthorizedUsers_Ranger.1790236757264992-12669-0/minicluster-data/postgres -l logfile start

2026-09-24 08:02:29.310 UTC [14427] LOG:  starting PostgreSQL 17.2 on x86_64-pc-linux-gnu, compiled by gcc (Ubuntu 7.5.0-3ubuntu1~18.04) 7.5.0, 64-bit
2026-09-24 08:02:29.310 UTC [14427] LOG:  listening on IPv4 address "127.12.95.84", port 40259
2026-09-24 08:02:29.314 UTC [14427] LOG:  listening on Unix socket "/tmp/.s.PGSQL.40259"
2026-09-24 08:02:29.319 UTC [14432] LOG:  database system was shut down at 2026-09-24 08:02:27 UTC
2026-09-24 08:02:29.324 UTC [14427] LOG:  database system is ready to accept connections
I20260924 08:02:31.249848 12669 mini_postgres.cc:96] Postgres bound to 40259
2026-09-24 08:02:31.255 UTC [14438] FATAL:  database "slave" does not exist
127.12.95.84:40259 - accepting connections
I20260924 08:02:31.256211 12669 mini_ranger.cc:162] Starting Ranger...
I20260924 08:02:31.274287 12669 mini_ranger.cc:85] Created miniranger Postgres user
I20260924 08:02:31.342505 12669 mini_ranger.cc:88] Created ranger Postgres database
I20260924 08:02:31.342581 12669 mini_ranger.cc:179] Starting Ranger out of /tmp/dist-test-taskGoZl2g/test-tmp/ts_authz-itest.1.AuthzProviders_TSAuthzTxnOpsITest.BasicOperationsForAuthorizedUsers_Ranger.1790236757264992-12669-0/minicluster-data/ranger-admin
2026-09-24 08:02:31,742  [I] DB FLAVOR :POSTGRES
2026-09-24 08:02:31,742  [I] --------- Verifying Ranger DB connection ---------
2026-09-24 08:02:31,742  [I] Checking connection..
2026-09-24 08:02:31,742  [JISQL] /usr/lib/jvm/temurin-17-jdk-amd64/bin/java  -cp /tmp/dist-test-taskGoZl2g/build/debug/bin/postgresql.jar:/tmp/dist-test-taskGoZl2g/thirdparty/installed/common/opt/ranger/jisql/lib/* org.apache.util.sql.Jisql -driver postgresql -cstring jdbc:postgresql://127.12.95.84:40259/ranger -u miniranger -p '********' -noheader -trim -c \;  -query "select 1;"
2026-09-24 08:02:32,067  [I] Checking connection passed.
2026-09-24 08:02:32,067  [I] --------- Verifying version history table ---------
2026-09-24 08:02:32,067  [JISQL] /usr/lib/jvm/temurin-17-jdk-amd64/bin/java  -cp /tmp/dist-test-taskGoZl2g/build/debug/bin/postgresql.jar:/tmp/dist-test-taskGoZl2g/thirdparty/installed/common/opt/ranger/jisql/lib/* org.apache.util.sql.Jisql -driver postgresql -cstring jdbc:postgresql://127.12.95.84:40259/ranger -u miniranger -p '********' -noheader -trim -c \;  -query "select * from (select table_name from information_schema.tables where table_catalog='ranger' and table_name = 'x_db_version_h') as temp;"
2026-09-24 08:02:32,392  [I] Table x_db_version_h does not exist in database ranger
2026-09-24 08:02:32,393  [JISQL] /usr/lib/jvm/temurin-17-jdk-amd64/bin/java  -cp /tmp/dist-test-taskGoZl2g/build/debug/bin/postgresql.jar:/tmp/dist-test-taskGoZl2g/thirdparty/installed/common/opt/ranger/jisql/lib/* org.apache.util.sql.Jisql -driver postgresql -cstring jdbc:postgresql://127.12.95.84:40259/ranger -u miniranger -p '********' -noheader -trim -c \;  -query "select * from (select table_name from information_schema.tables where table_catalog='ranger' and table_name = 'x_db_version_h') as temp;"
2026-09-24 08:02:32,747  [I] Table x_db_version_h does not exist in database ranger
2026-09-24 08:02:32,748  [I] Importing x_db_version_h table schema to database ranger from file: create_dbversion_catalog.sql
2026-09-24 08:02:32,748  [JISQL] /usr/lib/jvm/temurin-17-jdk-amd64/bin/java  -cp /tmp/dist-test-taskGoZl2g/build/debug/bin/postgresql.jar:/tmp/dist-test-taskGoZl2g/thirdparty/installed/common/opt/ranger/jisql/lib/* org.apache.util.sql.Jisql -driver postgresql -cstring jdbc:postgresql://127.12.95.84:40259/ranger -u miniranger -p '********' -noheader -trim -c \; -input /tmp/dist-test-taskGoZl2g/thirdparty/installed/common/opt/ranger/db/postgres/create_dbversion_catalog.sql 
2026-09-24 08:02:33.062 UTC [14553] WARNING:  there is no transaction in progress
2026-09-24 08:02:33,078  [I] create_dbversion_catalog.sql file imported successfully
2026-09-24 08:02:33,078  [JISQL] /usr/lib/jvm/temurin-17-jdk-amd64/bin/java  -cp /tmp/dist-test-taskGoZl2g/build/debug/bin/postgresql.jar:/tmp/dist-test-taskGoZl2g/thirdparty/installed/common/opt/ranger/jisql/lib/* org.apache.util.sql.Jisql -driver postgresql -cstring jdbc:postgresql://127.12.95.84:40259/ranger -u miniranger -p '********' -noheader -trim -c \;  -query "select * from (select table_name from information_schema.tables where table_catalog='ranger' and table_name = 'x_db_version_h') as temp;"
2026-09-24 08:02:33,376  [I] Table x_db_version_h already exists in database 'ranger'
2026-09-24 08:02:33,377  [I] --------- Importing Ranger Core DB Schema ---------
2026-09-24 08:02:33,377  [JISQL] /usr/lib/jvm/temurin-17-jdk-amd64/bin/java  -cp /tmp/dist-test-taskGoZl2g/build/debug/bin/postgresql.jar:/tmp/dist-test-taskGoZl2g/thirdparty/installed/common/opt/ranger/jisql/lib/* org.apache.util.sql.Jisql -driver postgresql -cstring jdbc:postgresql://127.12.95.84:40259/ranger -u miniranger -p '********' -noheader -trim -c \;  -query "select version from x_db_version_h where version = 'CORE_DB_SCHEMA' and active = 'Y';"
2026-09-24 08:02:33,680  [JISQL] /usr/lib/jvm/temurin-17-jdk-amd64/bin/java  -cp /tmp/dist-test-taskGoZl2g/build/debug/bin/postgresql.jar:/tmp/dist-test-taskGoZl2g/thirdparty/installed/common/opt/ranger/jisql/lib/* org.apache.util.sql.Jisql -driver postgresql -cstring jdbc:postgresql://127.12.95.84:40259/ranger -u miniranger -p '********' -noheader -trim -c \;  -query "select version from x_db_version_h where version = 'CORE_DB_SCHEMA' and active = 'N';"
2026-09-24 08:02:33,992  [JISQL] /usr/lib/jvm/temurin-17-jdk-amd64/bin/java  -cp /tmp/dist-test-taskGoZl2g/build/debug/bin/postgresql.jar:/tmp/dist-test-taskGoZl2g/thirdparty/installed/common/opt/ranger/jisql/lib/* org.apache.util.sql.Jisql -driver postgresql -cstring jdbc:postgresql://127.12.95.84:40259/ranger -u miniranger -p '********' -noheader -trim -c \;  -query "insert into x_db_version_h (version, inst_at, inst_by, updated_at, updated_by,active) values ('CORE_DB_SCHEMA', current_timestamp, 'Ranger 2.6.0', current_timestamp, 'dist-test-slave-hwwr.c.gcp-upstream.internal','N') ;"
2026-09-24 08:02:34,286  [JISQL] /usr/lib/jvm/temurin-17-jdk-amd64/bin/java  -cp /tmp/dist-test-taskGoZl2g/build/debug/bin/postgresql.jar:/tmp/dist-test-taskGoZl2g/thirdparty/installed/common/opt/ranger/jisql/lib/* org.apache.util.sql.Jisql -driver postgresql -cstring jdbc:postgresql://127.12.95.84:40259/ranger -u miniranger -p '********' -noheader -trim -c \;  -query "select * from (select table_name from information_schema.tables where table_catalog='ranger' and table_name = 'x_portal_user') as temp;"
2026-09-24 08:02:34,655  [I] Table x_portal_user does not exist in database ranger
2026-09-24 08:02:34,655  [JISQL] /usr/lib/jvm/temurin-17-jdk-amd64/bin/java  -cp /tmp/dist-test-taskGoZl2g/build/debug/bin/postgresql.jar:/tmp/dist-test-taskGoZl2g/thirdparty/installed/common/opt/ranger/jisql/lib/* org.apache.util.sql.Jisql -driver postgresql -cstring jdbc:postgresql://127.12.95.84:40259/ranger -u miniranger -p '********' -noheader -trim -c \;  -query "select * from (select table_name from information_schema.tables where table_catalog='ranger' and table_name = 'x_policy_ref_group') as temp;"
2026-09-24 08:02:34,982  [I] Table x_policy_ref_group does not exist in database ranger
2026-09-24 08:02:34,983  [JISQL] /usr/lib/jvm/temurin-17-jdk-amd64/bin/java  -cp /tmp/dist-test-taskGoZl2g/build/debug/bin/postgresql.jar:/tmp/dist-test-taskGoZl2g/thirdparty/installed/common/opt/ranger/jisql/lib/* org.apache.util.sql.Jisql -driver postgresql -cstring jdbc:postgresql://127.12.95.84:40259/ranger -u miniranger -p '********' -noheader -trim -c \;  -query "select version from x_db_version_h where version = 'DB_PATCHES' and active = 'Y';"
2026-09-24 08:02:35,336  [JISQL] /usr/lib/jvm/temurin-17-jdk-amd64/bin/java  -cp /tmp/dist-test-taskGoZl2g/build/debug/bin/postgresql.jar:/tmp/dist-test-taskGoZl2g/thirdparty/installed/common/opt/ranger/jisql/lib/* org.apache.util.sql.Jisql -driver postgresql -cstring jdbc:postgresql://127.12.95.84:40259/ranger -u miniranger -p '********' -noheader -trim -c \;  -query "select version from x_db_version_h where version = 'JAVA_PATCHES' and active = 'Y';"
2026-09-24 08:02:35,617  [I] Importing DB schema to database ranger from file: ranger_core_db_postgres.sql
2026-09-24 08:02:35,618  [JISQL] /usr/lib/jvm/temurin-17-jdk-amd64/bin/java  -cp /tmp/dist-test-taskGoZl2g/build/debug/bin/postgresql.jar:/tmp/dist-test-taskGoZl2g/thirdparty/installed/common/opt/ranger/jisql/lib/* org.apache.util.sql.Jisql -driver postgresql -cstring jdbc:postgresql://127.12.95.84:40259/ranger -u miniranger -p '********' -noheader -trim -c \; -input /tmp/dist-test-taskGoZl2g/thirdparty/installed/common/opt/ranger/db/postgres/optimized/current/ranger_core_db_postgres.sql 
2026-09-24 08:02:36.449 UTC [14751] WARNING:  there is no transaction in progress
2026-09-24 08:02:36.461 UTC [14751] WARNING:  there is no transaction in progress
2026-09-24 08:02:36.472 UTC [14751] WARNING:  there is no transaction in progress
2026-09-24 08:02:36.483 UTC [14751] WARNING:  there is no transaction in progress
2026-09-24 08:02:36.494 UTC [14751] WARNING:  there is no transaction in progress
2026-09-24 08:02:36.505 UTC [14751] WARNING:  there is no transaction in progress
2026-09-24 08:02:36.558 UTC [14751] WARNING:  there is no transaction in progress
2026-09-24 08:02:36.565 UTC [14751] WARNING:  there is no transaction in progress
2026-09-24 08:02:36.578 UTC [14751] WARNING:  there is no transaction in progress
2026-09-24 08:02:36.587 UTC [14751] WARNING:  there is no transaction in progress
2026-09-24 08:02:36.596 UTC [14751] WARNING:  there is no transaction in progress
2026-09-24 08:02:36.606 UTC [14751] WARNING:  there is no transaction in progress
2026-09-24 08:02:36.613 UTC [14751] WARNING:  there is no transaction in progress
2026-09-24 08:02:36.621 UTC [14751] WARNING:  there is no transaction in progress
2026-09-24 08:02:36.627 UTC [14751] WARNING:  there is no transaction in progress
2026-09-24 08:02:36.634 UTC [14751] WARNING:  there is no transaction in progress
2026-09-24 08:02:36.641 UTC [14751] WARNING:  there is no transaction in progress
2026-09-24 08:02:36.647 UTC [14751] WARNING:  there is no transaction in progress
2026-09-24 08:02:36.652 UTC [14751] WARNING:  there is no transaction in progress
2026-09-24 08:02:36.657 UTC [14751] WARNING:  there is no transaction in progress
2026-09-24 08:02:36.661 UTC [14751] WARNING:  there is no transaction in progress
2026-09-24 08:02:36.664 UTC [14751] WARNING:  there is no transaction in progress
2026-09-24 08:02:37,103  [I] ranger_core_db_postgres.sql file imported successfully
2026-09-24 08:02:37,103  [JISQL] /usr/lib/jvm/temurin-17-jdk-amd64/bin/java  -cp /tmp/dist-test-taskGoZl2g/build/debug/bin/postgresql.jar:/tmp/dist-test-taskGoZl2g/thirdparty/installed/common/opt/ranger/jisql/lib/* org.apache.util.sql.Jisql -driver postgresql -cstring jdbc:postgresql://127.12.95.84:40259/ranger -u miniranger -p '********' -noheader -trim -c \;  -query "update x_db_version_h set inst_by='Ranger 2.6.0' where active='Y' and updated_by='localhost';"
2026-09-24 08:02:37,425  [I] Patches status entries updated from base ranger version to current installed ranger version:Ranger 2.6.0
2026-09-24 08:02:37,425  [JISQL] /usr/lib/jvm/temurin-17-jdk-amd64/bin/java  -cp /tmp/dist-test-taskGoZl2g/build/debug/bin/postgresql.jar:/tmp/dist-test-taskGoZl2g/thirdparty/installed/common/opt/ranger/jisql/lib/* org.apache.util.sql.Jisql -driver postgresql -cstring jdbc:postgresql://127.12.95.84:40259/ranger -u miniranger -p '********' -noheader -trim -c \;  -query "select * from (select table_name from information_schema.tables where table_catalog='ranger' and table_name = 'x_portal_user') as temp;"
2026-09-24 08:02:37,753  [I] Table x_portal_user already exists in database 'ranger'
2026-09-24 08:02:37,754  [JISQL] /usr/lib/jvm/temurin-17-jdk-amd64/bin/java  -cp /tmp/dist-test-taskGoZl2g/build/debug/bin/postgresql.jar:/tmp/dist-test-taskGoZl2g/thirdparty/installed/common/opt/ranger/jisql/lib/* org.apache.util.sql.Jisql -driver postgresql -cstring jdbc:postgresql://127.12.95.84:40259/ranger -u miniranger -p '********' -noheader -trim -c \;  -query "select * from (select table_name from information_schema.tables where table_catalog='ranger' and table_name = 'x_policy_ref_group') as temp;"
2026-09-24 08:02:38,055  [I] Table x_policy_ref_group already exists in database 'ranger'
2026-09-24 08:02:38,056  [JISQL] /usr/lib/jvm/temurin-17-jdk-amd64/bin/java  -cp /tmp/dist-test-taskGoZl2g/build/debug/bin/postgresql.jar:/tmp/dist-test-taskGoZl2g/thirdparty/installed/common/opt/ranger/jisql/lib/* org.apache.util.sql.Jisql -driver postgresql -cstring jdbc:postgresql://127.12.95.84:40259/ranger -u miniranger -p '********' -noheader -trim -c \;  -query "select version from x_db_version_h where version = 'DB_PATCHES' and active = 'Y';"
2026-09-24 08:02:38,372  [JISQL] /usr/lib/jvm/temurin-17-jdk-amd64/bin/java  -cp /tmp/dist-test-taskGoZl2g/build/debug/bin/postgresql.jar:/tmp/dist-test-taskGoZl2g/thirdparty/installed/common/opt/ranger/jisql/lib/* org.apache.util.sql.Jisql -driver postgresql -cstring jdbc:postgresql://127.12.95.84:40259/ranger -u miniranger -p '********' -noheader -trim -c \;  -query "select version from x_db_version_h where version = 'JAVA_PATCHES' and active = 'Y';"
2026-09-24 08:02:38,689  [JISQL] /usr/lib/jvm/temurin-17-jdk-amd64/bin/java  -cp /tmp/dist-test-taskGoZl2g/build/debug/bin/postgresql.jar:/tmp/dist-test-taskGoZl2g/thirdparty/installed/common/opt/ranger/jisql/lib/* org.apache.util.sql.Jisql -driver postgresql -cstring jdbc:postgresql://127.12.95.84:40259/ranger -u miniranger -p '********' -noheader -trim -c \;  -query "update x_db_version_h set active='Y' where version='CORE_DB_SCHEMA' and active='N' and updated_by='dist-test-slave-hwwr.c.gcp-upstream.internal';"
2026-09-24 08:02:38,971  [I] CORE_DB_SCHEMA import status has been updated
2026-09-24 08:02:38,972  [JISQL] /usr/lib/jvm/temurin-17-jdk-amd64/bin/java  -cp /tmp/dist-test-taskGoZl2g/build/debug/bin/postgresql.jar:/tmp/dist-test-taskGoZl2g/thirdparty/installed/common/opt/ranger/jisql/lib/* org.apache.util.sql.Jisql -driver postgresql -cstring jdbc:postgresql://127.12.95.84:40259/ranger -u miniranger -p '********' -noheader -trim -c \;  -query "select version from x_db_version_h where version = 'DB_PATCHES' and inst_by = 'Ranger 2.6.0' and active = 'Y';"
2026-09-24 08:02:39,332  [I] DB_PATCHES have already been applied
I20260924 08:02:39.338622 12669 mini_ranger.cc:192] Using Ranger class path: /tmp/dist-test-taskGoZl2g/test-tmp/ts_authz-itest.1.AuthzProviders_TSAuthzTxnOpsITest.BasicOperationsForAuthorizedUsers_Ranger.1790236757264992-12669-0/minicluster-data/ranger-admin:/tmp/dist-test-taskGoZl2g/thirdparty/installed/common/opt/ranger/ews/lib/*:/usr/lib/jvm/temurin-17-jdk-amd64/lib/*:/tmp/dist-test-taskGoZl2g/thirdparty/installed/common/opt/hadoop/*:/tmp/dist-test-taskGoZl2g/build/debug/bin/postgresql.jar:/tmp/dist-test-taskGoZl2g/thirdparty/installed/common/opt/ranger/ews/webapp
I20260924 08:02:39.338685 12669 mini_ranger.cc:194] Using host: 127.12.95.84
I20260924 08:02:39.341475 12669 mini_ranger.cc:240] Ranger admin URL: http://127.12.95.84:56355
Sep 24, 2026 8:02:39 AM org.apache.ranger.server.tomcat.EmbeddedServer getKeyManagers
WARNING: Config 'ranger.keystore.file' or 'ranger.service.https.attrib.keystore.file' is not found or contains blank value
Sep 24, 2026 8:02:39 AM org.apache.ranger.server.tomcat.EmbeddedServer getTrustManagers
WARNING: Config 'ranger.truststore.file' is not found or contains blank value!
Sep 24, 2026 8:02:40 AM org.apache.ranger.server.tomcat.EmbeddedServer start
INFO: Deriving webapp folder from catalina.base property. folder=/tmp/dist-test-taskGoZl2g/test-tmp/ts_authz-itest.1.AuthzProviders_TSAuthzTxnOpsITest.BasicOperationsForAuthorizedUsers_Ranger.1790236757264992-12669-0/minicluster-data/ranger-admin/ews/webapp
Sep 24, 2026 8:02:40 AM org.apache.ranger.server.tomcat.EmbeddedServer start
INFO: Webapp file =/tmp/dist-test-taskGoZl2g/test-tmp/ts_authz-itest.1.AuthzProviders_TSAuthzTxnOpsITest.BasicOperationsForAuthorizedUsers_Ranger.1790236757264992-12669-0/minicluster-data/ranger-admin/ews/webapp, webAppName = /
Sep 24, 2026 8:02:40 AM org.apache.ranger.server.tomcat.EmbeddedServer start
INFO: Adding webapp [/] = path [/tmp/dist-test-taskGoZl2g/test-tmp/ts_authz-itest.1.AuthzProviders_TSAuthzTxnOpsITest.BasicOperationsForAuthorizedUsers_Ranger.1790236757264992-12669-0/minicluster-data/ranger-admin/ews/webapp] .....
Sep 24, 2026 8:02:40 AM org.apache.catalina.core.StandardContext setPath
WARNING: A context path must either be an empty string or start with a '/' and do not end with a '/'. The path [/] does not meet these criteria and has been changed to []
Sep 24, 2026 8:02:40 AM org.apache.ranger.server.tomcat.EmbeddedServer start
INFO: Finished init of webapp [/] = path [/tmp/dist-test-taskGoZl2g/test-tmp/ts_authz-itest.1.AuthzProviders_TSAuthzTxnOpsITest.BasicOperationsForAuthorizedUsers_Ranger.1790236757264992-12669-0/minicluster-data/ranger-admin/ews/webapp].
Sep 24, 2026 8:02:40 AM org.apache.ranger.server.tomcat.EmbeddedServer startServer
INFO: Server Name : miniranger
Sep 24, 2026 8:02:40 AM org.apache.coyote.AbstractProtocol init
INFO: Initializing ProtocolHandler ["http-nio-56355"]
Sep 24, 2026 8:02:40 AM org.apache.catalina.core.StandardService startInternal
INFO: Starting service [Tomcat]
Sep 24, 2026 8:02:40 AM org.apache.catalina.core.StandardEngine startInternal
INFO: Starting Servlet engine: [Apache Tomcat/9.0.98]
Sep 24, 2026 8:02:41 AM org.apache.catalina.startup.ContextConfig getDefaultWebXmlFragment
INFO: No global web.xml found
I20260924 08:02:41.616595 12669 mini_ranger.cc:161] Time spent starting Ranger: real 10.360s	user 0.005s	sys 0.005s
Sep 24, 2026 8:02:45 AM org.apache.jasper.servlet.TldScanner scanJars
INFO: At least one JAR was scanned for TLDs yet contained no TLDs. Enable debug logging for this logger for a complete list of JARs that were scanned but no TLDs were found in them. Skipping unneeded JARs during scanning can improve startup time and JSP compilation time.
Sep 24, 2026 8:02:45 AM org.apache.catalina.core.ApplicationContext log
INFO: Initializing Spring root WebApplicationContext
[EL Warning]: metadata: 2026-09-24 08:02:49.003--ServerSession(1737916965)--You have specified multiple ids for the entity class [org.apache.ranger.entity.view.VXXPrincipal] without specifying an @IdClass. By doing this you may lose the ability to find by identity, distributed cache support etc. Note: You may however use EntityManager find operations by passing a list of primary key fields. Else, you will have to use JPQL queries to read your entities. For other id options see @PrimaryKey.
Sep 24, 2026 8:03:03 AM com.sun.jersey.api.core.PackagesResourceConfig init
INFO: Scanning for root resource and provider classes in the packages:
  org.apache.ranger.rest
  org.apache.ranger.common
  xa.rest
Sep 24, 2026 8:03:03 AM com.sun.jersey.api.core.ScanningResourceConfig logClasses
INFO: Root resource classes found:
  class org.apache.ranger.rest.MetricsREST
  class org.apache.ranger.rest.ServiceREST
  class org.apache.ranger.rest.UserREST
  class org.apache.ranger.rest.TagREST
  class org.apache.ranger.rest.PublicAPIsv2
  class org.apache.ranger.rest.XKeyREST
  class org.apache.ranger.rest.SecurityZoneREST
  class org.apache.ranger.rest.PublicAPIs
  class org.apache.ranger.rest.XAuditREST
  class org.apache.ranger.rest.AssetREST
  class org.apache.ranger.rest.RoleREST
  class org.apache.ranger.rest.XUserREST
Sep 24, 2026 8:03:03 AM com.sun.jersey.api.core.ScanningResourceConfig logClasses
INFO: Provider classes found:
  class org.apache.ranger.common.RangerJsonMappingExceptionMapper
  class org.apache.ranger.common.RangerJAXBContextResolver
  class org.apache.ranger.common.RangerJsonParserExceptionMapper
  class org.apache.ranger.common.RangerJsonProvider
Sep 24, 2026 8:03:03 AM com.sun.jersey.spi.spring.container.servlet.SpringServlet getContext
INFO: Using default applicationContext
Sep 24, 2026 8:03:03 AM com.sun.jersey.spi.spring.container.SpringComponentProviderFactory registerSpringBeans
INFO: Registering Spring bean, rangerJsonMappingExceptionMapper, of type org.apache.ranger.common.RangerJsonMappingExceptionMapper as a provider class
Sep 24, 2026 8:03:03 AM com.sun.jersey.spi.spring.container.SpringComponentProviderFactory registerSpringBeans
INFO: Registering Spring bean, rangerJsonParserExceptionMapper, of type org.apache.ranger.common.RangerJsonParserExceptionMapper as a provider class
Sep 24, 2026 8:03:03 AM com.sun.jersey.spi.spring.container.SpringComponentProviderFactory registerSpringBeans
INFO: Registering Spring bean, rangerJsonProvider, of type org.apache.ranger.common.RangerJsonProvider as a provider class
Sep 24, 2026 8:03:03 AM com.sun.jersey.spi.spring.container.SpringComponentProviderFactory registerSpringBeans
INFO: Registering Spring bean, assetREST, of type org.apache.ranger.rest.AssetREST as a root resource class
Sep 24, 2026 8:03:03 AM com.sun.jersey.spi.spring.container.SpringComponentProviderFactory registerSpringBeans
INFO: Registering Spring bean, metricsREST, of type org.apache.ranger.rest.MetricsREST as a root resource class
Sep 24, 2026 8:03:03 AM com.sun.jersey.spi.spring.container.SpringComponentProviderFactory registerSpringBeans
INFO: Registering Spring bean, publicAPIs, of type org.apache.ranger.rest.PublicAPIs as a root resource class
Sep 24, 2026 8:03:03 AM com.sun.jersey.spi.spring.container.SpringComponentProviderFactory registerSpringBeans
INFO: Registering Spring bean, publicAPIsv2, of type org.apache.ranger.rest.PublicAPIsv2 as a root resource class
Sep 24, 2026 8:03:03 AM com.sun.jersey.spi.spring.container.SpringComponentProviderFactory registerSpringBeans
INFO: Registering Spring bean, roleREST, of type org.apache.ranger.rest.RoleREST as a root resource class
Sep 24, 2026 8:03:03 AM com.sun.jersey.spi.spring.container.SpringComponentProviderFactory registerSpringBeans
INFO: Registering Spring bean, securityZoneREST, of type org.apache.ranger.rest.SecurityZoneREST as a root resource class
Sep 24, 2026 8:03:03 AM com.sun.jersey.spi.spring.container.SpringComponentProviderFactory registerSpringBeans
INFO: Registering Spring bean, serviceREST, of type org.apache.ranger.rest.ServiceREST as a root resource class
Sep 24, 2026 8:03:03 AM com.sun.jersey.spi.spring.container.SpringComponentProviderFactory registerSpringBeans
INFO: Registering Spring bean, tagREST, of type org.apache.ranger.rest.TagREST as a root resource class
Sep 24, 2026 8:03:03 AM com.sun.jersey.spi.spring.container.SpringComponentProviderFactory registerSpringBeans
INFO: Registering Spring bean, userREST, of type org.apache.ranger.rest.UserREST as a root resource class
Sep 24, 2026 8:03:03 AM com.sun.jersey.spi.spring.container.SpringComponentProviderFactory registerSpringBeans
INFO: Registering Spring bean, XAuditREST, of type org.apache.ranger.rest.XAuditREST as a root resource class
Sep 24, 2026 8:03:03 AM com.sun.jersey.spi.spring.container.SpringComponentProviderFactory registerSpringBeans
INFO: Registering Spring bean, XKeyREST, of type org.apache.ranger.rest.XKeyREST as a root resource class
Sep 24, 2026 8:03:03 AM com.sun.jersey.spi.spring.container.SpringComponentProviderFactory registerSpringBeans
INFO: Registering Spring bean, XUserREST, of type org.apache.ranger.rest.XUserREST as a root resource class
Sep 24, 2026 8:03:03 AM com.sun.jersey.server.impl.application.WebApplicationImpl _initiate
INFO: Initiating Jersey application, version 'Jersey: 1.19.4 05/24/2017 03:20 PM'
Sep 24, 2026 8:03:04 AM com.sun.jersey.spi.inject.Errors processErrorMessages
WARNING: The following warnings have been detected with resource and/or provider classes:
  WARNING: A HTTP GET method, public void org.apache.ranger.rest.RoleREST.getRolesInJson(javax.servlet.http.HttpServletRequest,javax.servlet.http.HttpServletResponse), MUST return a non-void type.
  WARNING: A HTTP GET method, public void org.apache.ranger.rest.ServiceREST.getPoliciesInExcel(javax.servlet.http.HttpServletRequest,javax.servlet.http.HttpServletResponse), MUST return a non-void type.
  WARNING: A HTTP GET method, public void org.apache.ranger.rest.ServiceREST.getPoliciesInCsv(javax.servlet.http.HttpServletRequest,javax.servlet.http.HttpServletResponse) throws java.io.IOException, MUST return a non-void type.
  WARNING: A HTTP GET method, public void org.apache.ranger.rest.ServiceREST.getPoliciesInJson(javax.servlet.http.HttpServletRequest,javax.servlet.http.HttpServletResponse,java.lang.Boolean), MUST return a non-void type.
Sep 24, 2026 8:03:04 AM org.apache.coyote.AbstractProtocol start
INFO: Starting ProtocolHandler ["http-nio-56355"]
I20260924 08:03:05.845474 12669 mini_ranger.cc:274] Created Kudu service
WARNING: no policy specified for kudu/127.12.95.126@KRBTEST.COM; defaulting to no policy
Authenticating as principal test-admin/admin@KRBTEST.COM with password.
Principal "kudu/127.12.95.126@KRBTEST.COM" created.
Authenticating as principal test-admin/admin@KRBTEST.COM with password.
Entry for principal kudu/127.12.95.126 with kvno 2, encryption type aes256-cts-hmac-sha1-96 added to keytab WRFILE:/tmp/dist-test-taskGoZl2g/test-tmp/ts_authz-itest.1.AuthzProviders_TSAuthzTxnOpsITest.BasicOperationsForAuthorizedUsers_Ranger.1790236757264992-12669-0/krb5kdc/kudu.keytab.
Entry for principal kudu/127.12.95.126 with kvno 2, encryption type aes128-cts-hmac-sha1-96 added to keytab WRFILE:/tmp/dist-test-taskGoZl2g/test-tmp/ts_authz-itest.1.AuthzProviders_TSAuthzTxnOpsITest.BasicOperationsForAuthorizedUsers_Ranger.1790236757264992-12669-0/krb5kdc/kudu.keytab.
WARNING: no policy specified for HTTP/127.12.95.126@KRBTEST.COM; defaulting to no policy
Authenticating as principal test-admin/admin@KRBTEST.COM with password.
Principal "HTTP/127.12.95.126@KRBTEST.COM" created.
Authenticating as principal test-admin/admin@KRBTEST.COM with password.
Entry for principal HTTP/127.12.95.126 with kvno 2, encryption type aes256-cts-hmac-sha1-96 added to keytab WRFILE:/tmp/dist-test-taskGoZl2g/test-tmp/ts_authz-itest.1.AuthzProviders_TSAuthzTxnOpsITest.BasicOperationsForAuthorizedUsers_Ranger.1790236757264992-12669-0/krb5kdc/kudu.keytab.
Entry for principal HTTP/127.12.95.126 with kvno 2, encryption type aes128-cts-hmac-sha1-96 added to keytab WRFILE:/tmp/dist-test-taskGoZl2g/test-tmp/ts_authz-itest.1.AuthzProviders_TSAuthzTxnOpsITest.BasicOperationsForAuthorizedUsers_Ranger.1790236757264992-12669-0/krb5kdc/kudu.keytab.
I20260924 08:03:05.895066 12669 external_mini_cluster.cc:1372] Running /tmp/dist-test-taskGoZl2g/build/debug/bin/kudu
/tmp/dist-test-taskGoZl2g/build/debug/bin/kudu
--fs_wal_dir=/tmp/dist-test-taskGoZl2g/test-tmp/ts_authz-itest.1.AuthzProviders_TSAuthzTxnOpsITest.BasicOperationsForAuthorizedUsers_Ranger.1790236757264992-12669-0/minicluster-data/master-0/wal
--fs_data_dirs=/tmp/dist-test-taskGoZl2g/test-tmp/ts_authz-itest.1.AuthzProviders_TSAuthzTxnOpsITest.BasicOperationsForAuthorizedUsers_Ranger.1790236757264992-12669-0/minicluster-data/master-0/data
--block_manager=log
--webserver_interface=localhost
--never_fsync
--enable_minidumps=false
--redact=none
--metrics_log_interval_ms=1000
--log_dir=/tmp/dist-test-taskGoZl2g/test-tmp/ts_authz-itest.1.AuthzProviders_TSAuthzTxnOpsITest.BasicOperationsForAuthorizedUsers_Ranger.1790236757264992-12669-0/minicluster-data/master-0/logs
--server_dump_info_path=/tmp/dist-test-taskGoZl2g/test-tmp/ts_authz-itest.1.AuthzProviders_TSAuthzTxnOpsITest.BasicOperationsForAuthorizedUsers_Ranger.1790236757264992-12669-0/minicluster-data/master-0/data/info.pb
--server_dump_info_format=pb
--rpc_server_allow_ephemeral_ports
--unlock_experimental_flags
--unlock_unsafe_flags
--logtostderr
--logbuflevel=-1
--ipki_server_key_size=768
--openssl_security_level_override=0
master
run
--ipki_ca_key_size=768
--tsk_num_rsa_bits=512
--rpc_bind_addresses=127.12.95.126:39495
--webserver_interface=127.12.95.126
--webserver_port=0
--keytab_file=/tmp/dist-test-taskGoZl2g/test-tmp/ts_authz-itest.1.AuthzProviders_TSAuthzTxnOpsITest.BasicOperationsForAuthorizedUsers_Ranger.1790236757264992-12669-0/krb5kdc/kudu.keytab
--principal=kudu/127.12.95.126
--rpc_authentication=required
--superuser_acl=test-admin
--user_acl=test-user
--webserver_require_spnego=true
--builtin_ntp_servers=127.12.95.84:35553
--builtin_ntp_poll_interval_ms=100
--ntp_initial_sync_wait_secs=10
--time_source=builtin
--rpc_reuseport=true
--master_addresses=127.12.95.126:39495
--ranger_config_path=/tmp/dist-test-taskGoZl2g/test-tmp/ts_authz-itest.1.AuthzProviders_TSAuthzTxnOpsITest.BasicOperationsForAuthorizedUsers_Ranger.1790236757264992-12669-0/minicluster-data/ranger-client
--trusted_user_acl=test-admin
--authz_token_validity_seconds=1
--user_acl=kudu,user0,user1,user2
--txn_manager_enabled
--txn_manager_status_table_num_replicas=1 with env {KRB5CCNAME=/tmp/dist-test-taskGoZl2g/test-tmp/ts_authz-itest.1.AuthzProviders_TSAuthzTxnOpsITest.BasicOperationsForAuthorizedUsers_Ranger.1790236757264992-12669-0/krb5kdc/krb5cc,KRB5_CONFIG=/tmp/dist-test-taskGoZl2g/test-tmp/ts_authz-itest.1.AuthzProviders_TSAuthzTxnOpsITest.BasicOperationsForAuthorizedUsers_Ranger.1790236757264992-12669-0/krb5kdc/krb5.conf,KRB5_KDC_PROFILE=/tmp/dist-test-taskGoZl2g/test-tmp/ts_authz-itest.1.AuthzProviders_TSAuthzTxnOpsITest.BasicOperationsForAuthorizedUsers_Ranger.1790236757264992-12669-0/krb5kdc/kdc.conf,KUDU_ENABLE_KRB5_REALM_FIX=yes}
W20260924 08:03:05.995811 14969 flags.cc:432] Enabled unsafe flag: --openssl_security_level_override=0
W20260924 08:03:05.996102 14969 flags.cc:432] Enabled unsafe flag: --rpc_server_allow_ephemeral_ports=true
W20260924 08:03:05.996203 14969 flags.cc:432] Enabled unsafe flag: --never_fsync=true
W20260924 08:03:05.999643 14969 flags.cc:432] Enabled experimental flag: --authz_token_validity_seconds=1
W20260924 08:03:05.999728 14969 flags.cc:432] Enabled experimental flag: --ipki_ca_key_size=768
W20260924 08:03:05.999765 14969 flags.cc:432] Enabled experimental flag: --txn_manager_enabled=true
W20260924 08:03:05.999802 14969 flags.cc:432] Enabled experimental flag: --txn_manager_status_table_num_replicas=1
W20260924 08:03:05.999848 14969 flags.cc:432] Enabled experimental flag: --ipki_server_key_size=768
W20260924 08:03:05.999909 14969 flags.cc:432] Enabled experimental flag: --tsk_num_rsa_bits=512
W20260924 08:03:05.999959 14969 flags.cc:432] Enabled experimental flag: --rpc_reuseport=true
I20260924 08:03:06.004361 14969 master_runner.cc:387] Master server non-default flags:
--log_dir=/tmp/dist-test-taskGoZl2g/test-tmp/ts_authz-itest.1.AuthzProviders_TSAuthzTxnOpsITest.BasicOperationsForAuthorizedUsers_Ranger.1790236757264992-12669-0/minicluster-data/master-0/logs
--logbuflevel=-1
--logtostderr=true
--builtin_ntp_poll_interval_ms=100
--builtin_ntp_servers=127.12.95.84:35553
--ntp_initial_sync_wait_secs=10
--time_source=builtin
--fs_data_dirs=/tmp/dist-test-taskGoZl2g/test-tmp/ts_authz-itest.1.AuthzProviders_TSAuthzTxnOpsITest.BasicOperationsForAuthorizedUsers_Ranger.1790236757264992-12669-0/minicluster-data/master-0/data
--fs_wal_dir=/tmp/dist-test-taskGoZl2g/test-tmp/ts_authz-itest.1.AuthzProviders_TSAuthzTxnOpsITest.BasicOperationsForAuthorizedUsers_Ranger.1790236757264992-12669-0/minicluster-data/master-0/wal
--trusted_user_acl=<redacted>
--authz_token_validity_seconds=1
--ipki_ca_key_size=768
--master_addresses=127.12.95.126:39495
--txn_manager_enabled=true
--txn_manager_status_table_num_replicas=1
--ranger_config_path=/tmp/dist-test-taskGoZl2g/test-tmp/ts_authz-itest.1.AuthzProviders_TSAuthzTxnOpsITest.BasicOperationsForAuthorizedUsers_Ranger.1790236757264992-12669-0/minicluster-data/ranger-client
--keytab_file=/tmp/dist-test-taskGoZl2g/test-tmp/ts_authz-itest.1.AuthzProviders_TSAuthzTxnOpsITest.BasicOperationsForAuthorizedUsers_Ranger.1790236757264992-12669-0/krb5kdc/kudu.keytab
--principal=kudu/127.12.95.126
--ipki_server_key_size=768
--openssl_security_level_override=0
--tsk_num_rsa_bits=512
--rpc_bind_addresses=127.12.95.126:39495
--rpc_reuseport=true
--rpc_server_allow_ephemeral_ports=true
--rpc_authentication=required
--superuser_acl=<redacted>
--user_acl=<redacted>
--metrics_log_interval_ms=1000
--server_dump_info_format=pb
--server_dump_info_path=/tmp/dist-test-taskGoZl2g/test-tmp/ts_authz-itest.1.AuthzProviders_TSAuthzTxnOpsITest.BasicOperationsForAuthorizedUsers_Ranger.1790236757264992-12669-0/minicluster-data/master-0/data/info.pb
--webserver_interface=127.12.95.126
--webserver_port=0
--webserver_require_spnego=true
--never_fsync=true
--heap_profile_path=/tmp/kudu.14969
--redact=none
--unlock_experimental_flags=true
--unlock_unsafe_flags=true
--enable_minidumps=false

Master server version:
kudu 1.19.0-SNAPSHOT
revision ee47a9ca1939200e227f9bf266c97a7c0eed3ccc
build type DEBUG
built by None at 24 Sep 2026 07:43:13 UTC on bdcb31816ec0
build id 13971
I20260924 08:03:06.005429 14969 env_posix.cc:2285] Not raising this process' open files per process limit of 1048576; it is already as high as it can go
I20260924 08:03:06.006327 14969 file_cache.cc:504] Constructed file cache file cache with capacity 419430
W20260924 08:03:06.012058 14974 instance_detector.cc:116] could not retrieve AWS instance metadata: Network error: curl error: HTTP response code said error: The requested URL returned error: 404
I20260924 08:03:06.012161 14969 server_base.cc:1061] running on GCE node
W20260924 08:03:06.012279 14975 instance_detector.cc:116] could not retrieve Azure instance metadata: Network error: curl error: HTTP response code said error: The requested URL returned error: 404
W20260924 08:03:06.012068 14977 instance_detector.cc:116] could not retrieve OpenStack instance metadata: Network error: curl error: HTTP response code said error: The requested URL returned error: 404
I20260924 08:03:06.012948 14969 hybrid_clock.cc:584] initializing the hybrid clock with 'builtin' time source
I20260924 08:03:06.013948 14969 hybrid_clock.cc:630] waiting up to --ntp_initial_sync_wait_secs=10 seconds for the clock to synchronize
I20260924 08:03:06.015128 14969 hybrid_clock.cc:648] HybridClock initialized: now 1790236986015112 us; error 31 us; skew 500 ppm
Sep 24 08:03:06 dist-test-slave-hwwr krb5kdc[14396](info): AS_REQ (2 etypes {17 16}) 127.0.0.1: ISSUE: authtime 1790236986, etypes {rep=17 tkt=17 ses=17}, kudu/127.12.95.126@KRBTEST.COM for krbtgt/KRBTEST.COM@KRBTEST.COM
I20260924 08:03:06.017833 14969 init.cc:377] Logged in from keytab as kudu/127.12.95.126@KRBTEST.COM (short username kudu)
I20260924 08:03:06.019058 14969 webserver.cc:533] Webserver started at http://127.12.95.126:42263/ using document root <none> and password file <none>
I20260924 08:03:06.019618 14969 fs_manager.cc:362] Metadata directory not provided
I20260924 08:03:06.019690 14969 fs_manager.cc:368] Using write-ahead log directory (fs_wal_dir) as metadata directory
I20260924 08:03:06.019910 14969 server_base.cc:909] This appears to be a new deployment of Kudu; creating new FS layout
I20260924 08:03:06.021409 14969 fs_manager.cc:1068] Generated new instance metadata in path /tmp/dist-test-taskGoZl2g/test-tmp/ts_authz-itest.1.AuthzProviders_TSAuthzTxnOpsITest.BasicOperationsForAuthorizedUsers_Ranger.1790236757264992-12669-0/minicluster-data/master-0/data/instance:
uuid: "ade8ffdcc1d2463da8686750252e1753"
format_stamp: "Formatted at 2026-09-24 08:03:06 on dist-test-slave-hwwr"
I20260924 08:03:06.021957 14969 fs_manager.cc:1068] Generated new instance metadata in path /tmp/dist-test-taskGoZl2g/test-tmp/ts_authz-itest.1.AuthzProviders_TSAuthzTxnOpsITest.BasicOperationsForAuthorizedUsers_Ranger.1790236757264992-12669-0/minicluster-data/master-0/wal/instance:
uuid: "ade8ffdcc1d2463da8686750252e1753"
format_stamp: "Formatted at 2026-09-24 08:03:06 on dist-test-slave-hwwr"
I20260924 08:03:06.025293 14969 fs_manager.cc:696] Time spent creating directory manager: real 0.003s	user 0.003s	sys 0.000s
I20260924 08:03:06.027449 14984 log_block_manager.cc:4127] Time spent loading block containers with low live blocks: real 0.000s	user 0.000s	sys 0.000s
I20260924 08:03:06.028458 14969 fs_manager.cc:730] Time spent opening block manager: real 0.002s	user 0.002s	sys 0.000s
I20260924 08:03:06.028550 14969 fs_manager.cc:647] Opened local filesystem: /tmp/dist-test-taskGoZl2g/test-tmp/ts_authz-itest.1.AuthzProviders_TSAuthzTxnOpsITest.BasicOperationsForAuthorizedUsers_Ranger.1790236757264992-12669-0/minicluster-data/master-0/data,/tmp/dist-test-taskGoZl2g/test-tmp/ts_authz-itest.1.AuthzProviders_TSAuthzTxnOpsITest.BasicOperationsForAuthorizedUsers_Ranger.1790236757264992-12669-0/minicluster-data/master-0/wal
uuid: "ade8ffdcc1d2463da8686750252e1753"
format_stamp: "Formatted at 2026-09-24 08:03:06 on dist-test-slave-hwwr"
I20260924 08:03:06.028664 14969 fs_report.cc:389] FS layout report
--------------------
wal directory: /tmp/dist-test-taskGoZl2g/test-tmp/ts_authz-itest.1.AuthzProviders_TSAuthzTxnOpsITest.BasicOperationsForAuthorizedUsers_Ranger.1790236757264992-12669-0/minicluster-data/master-0/wal
metadata directory: /tmp/dist-test-taskGoZl2g/test-tmp/ts_authz-itest.1.AuthzProviders_TSAuthzTxnOpsITest.BasicOperationsForAuthorizedUsers_Ranger.1790236757264992-12669-0/minicluster-data/master-0/wal
1 data directories: /tmp/dist-test-taskGoZl2g/test-tmp/ts_authz-itest.1.AuthzProviders_TSAuthzTxnOpsITest.BasicOperationsForAuthorizedUsers_Ranger.1790236757264992-12669-0/minicluster-data/master-0/data/data
Total live blocks: 0
Total live bytes: 0
Total live bytes (after alignment): 0
Total number of LBM containers: 0 (0 full)
Did not check for missing blocks
Did not check for orphaned blocks
Total full LBM containers with extra space: 0 (0 repaired)
Total full LBM container extra space in bytes: 0 (0 repaired)
Total incomplete LBM containers: 0 (0 repaired)
Total LBM partial records: 0 (0 repaired)
Total corrupted LBM metadata records in RocksDB: 0 (0 repaired)
I20260924 08:03:06.045818 14969 rpc_server.cc:225] running with OpenSSL 1.1.1  11 Sep 2018
I20260924 08:03:06.048646 14969 env_posix.cc:2285] Not raising this process' running threads per effective uid limit of 18446744073709551615; it is already as high as it can go
I20260924 08:03:06.048837 14969 kserver.cc:163] Server-wide thread pool size limit: 3276
I20260924 08:03:06.058101 14969 rpc_server.cc:307] RPC server started. Bound to: 127.12.95.126:39495
I20260924 08:03:06.058342 15046 acceptor_pool.cc:272] collecting diagnostics on the listening RPC socket 127.12.95.126:39495 every 8 connection(s)
I20260924 08:03:06.059219 14969 server_base.cc:1193] Dumped server information to /tmp/dist-test-taskGoZl2g/test-tmp/ts_authz-itest.1.AuthzProviders_TSAuthzTxnOpsITest.BasicOperationsForAuthorizedUsers_Ranger.1790236757264992-12669-0/minicluster-data/master-0/data/info.pb
I20260924 08:03:06.060722 12669 external_mini_cluster.cc:1434] Started /tmp/dist-test-taskGoZl2g/build/debug/bin/kudu as pid 14969
I20260924 08:03:06.060832 12669 external_mini_cluster.cc:1448] Reading /tmp/dist-test-taskGoZl2g/test-tmp/ts_authz-itest.1.AuthzProviders_TSAuthzTxnOpsITest.BasicOperationsForAuthorizedUsers_Ranger.1790236757264992-12669-0/minicluster-data/master-0/wal/instance
I20260924 08:03:06.062209 15047 data_dirs.cc:400] Could only allocate 1 dirs of requested 3 for tablet 00000000000000000000000000000000. 1 dirs total, 0 dirs full, 0 dirs failed
I20260924 08:03:06.067487 15047 tablet_bootstrap.cc:492] T 00000000000000000000000000000000 P ade8ffdcc1d2463da8686750252e1753: Bootstrap starting.
I20260924 08:03:06.069664 15047 tablet_bootstrap.cc:654] T 00000000000000000000000000000000 P ade8ffdcc1d2463da8686750252e1753: Neither blocks nor log segments found. Creating new log.
Sep 24 08:03:06 dist-test-slave-hwwr krb5kdc[14396](info): TGS_REQ (2 etypes {17 16}) 127.0.0.1: ISSUE: authtime 1790236946, etypes {rep=17 tkt=17 ses=17}, test-admin@KRBTEST.COM for kudu/127.12.95.126@KRBTEST.COM
I20260924 08:03:06.070503 15047 log.cc:826] T 00000000000000000000000000000000 P ade8ffdcc1d2463da8686750252e1753: Log is configured to *not* fsync() on all Append() calls
I20260924 08:03:06.072477 15047 tablet_bootstrap.cc:492] T 00000000000000000000000000000000 P ade8ffdcc1d2463da8686750252e1753: No bootstrap required, opened a new log
I20260924 08:03:06.076134 15047 raft_consensus.cc:359] T 00000000000000000000000000000000 P ade8ffdcc1d2463da8686750252e1753 [term 0 FOLLOWER]: Replica starting. Triggering 0 pending ops. Active config: opid_index: -1 OBSOLETE_local: true peers { permanent_uuid: "ade8ffdcc1d2463da8686750252e1753" member_type: VOTER last_known_addr { host: "127.12.95.126" port: 39495 } }
I20260924 08:03:06.076351 15047 raft_consensus.cc:385] T 00000000000000000000000000000000 P ade8ffdcc1d2463da8686750252e1753 [term 0 FOLLOWER]: Consensus starting up: Expiring failure detector timer to make a prompt election more likely
I20260924 08:03:06.076436 15047 raft_consensus.cc:740] T 00000000000000000000000000000000 P ade8ffdcc1d2463da8686750252e1753 [term 0 FOLLOWER]: Becoming Follower/Learner. State: Replica: ade8ffdcc1d2463da8686750252e1753, State: Initialized, Role: FOLLOWER
I20260924 08:03:06.076892 15047 consensus_queue.cc:260] T 00000000000000000000000000000000 P ade8ffdcc1d2463da8686750252e1753 [NON_LEADER]: Queue going to NON_LEADER mode. State: All replicated index: 0, Majority replicated index: 0, Committed index: 0, Last appended: 0.0, Last appended by leader: 0, Current term: 0, Majority size: -1, State: 0, Mode: NON_LEADER, active raft config: opid_index: -1 OBSOLETE_local: true peers { permanent_uuid: "ade8ffdcc1d2463da8686750252e1753" member_type: VOTER last_known_addr { host: "127.12.95.126" port: 39495 } }
I20260924 08:03:06.077045 15047 raft_consensus.cc:399] T 00000000000000000000000000000000 P ade8ffdcc1d2463da8686750252e1753 [term 0 FOLLOWER]: Only one voter in the Raft config. Triggering election immediately
I20260924 08:03:06.077103 15047 raft_consensus.cc:493] T 00000000000000000000000000000000 P ade8ffdcc1d2463da8686750252e1753 [term 0 FOLLOWER]: Starting leader election (initial election of a single-replica configuration)
I20260924 08:03:06.077183 15047 raft_consensus.cc:3060] T 00000000000000000000000000000000 P ade8ffdcc1d2463da8686750252e1753 [term 0 FOLLOWER]: Advancing to term 1
I20260924 08:03:06.078156 15047 raft_consensus.cc:515] T 00000000000000000000000000000000 P ade8ffdcc1d2463da8686750252e1753 [term 1 FOLLOWER]: Starting leader election with config: opid_index: -1 OBSOLETE_local: true peers { permanent_uuid: "ade8ffdcc1d2463da8686750252e1753" member_type: VOTER last_known_addr { host: "127.12.95.126" port: 39495 } }
I20260924 08:03:06.078504 15047 leader_election.cc:304] T 00000000000000000000000000000000 P ade8ffdcc1d2463da8686750252e1753 [CANDIDATE]: Term 1 election: Election decided. Result: candidate won. Election summary: received 1 responses out of 1 voters: 1 yes votes; 0 no votes. yes voters: ade8ffdcc1d2463da8686750252e1753; no voters: 
I20260924 08:03:06.078789 15047 leader_election.cc:290] T 00000000000000000000000000000000 P ade8ffdcc1d2463da8686750252e1753 [CANDIDATE]: Term 1 election: Requested vote from peers 
I20260924 08:03:06.078940 15052 raft_consensus.cc:2804] T 00000000000000000000000000000000 P ade8ffdcc1d2463da8686750252e1753 [term 1 FOLLOWER]: Leader election won for term 1
I20260924 08:03:06.079216 15052 raft_consensus.cc:697] T 00000000000000000000000000000000 P ade8ffdcc1d2463da8686750252e1753 [term 1 LEADER]: Becoming Leader. State: Replica: ade8ffdcc1d2463da8686750252e1753, State: Running, Role: LEADER
I20260924 08:03:06.079845 15047 sys_catalog.cc:565] T 00000000000000000000000000000000 P ade8ffdcc1d2463da8686750252e1753 [sys.catalog]: configured and running, proceeding with master startup.
I20260924 08:03:06.079957 15052 consensus_queue.cc:237] T 00000000000000000000000000000000 P ade8ffdcc1d2463da8686750252e1753 [LEADER]: Queue going to LEADER mode. State: All replicated index: 0, Majority replicated index: 0, Committed index: 0, Last appended: 0.0, Last appended by leader: 0, Current term: 1, Majority size: 1, State: 0, Mode: LEADER, active raft config: opid_index: -1 OBSOLETE_local: true peers { permanent_uuid: "ade8ffdcc1d2463da8686750252e1753" member_type: VOTER last_known_addr { host: "127.12.95.126" port: 39495 } }
I20260924 08:03:06.080947 15052 sys_catalog.cc:455] T 00000000000000000000000000000000 P ade8ffdcc1d2463da8686750252e1753 [sys.catalog]: SysCatalogTable state changed. Reason: New leader ade8ffdcc1d2463da8686750252e1753. Latest consensus state: current_term: 1 leader_uuid: "ade8ffdcc1d2463da8686750252e1753" committed_config { opid_index: -1 OBSOLETE_local: true peers { permanent_uuid: "ade8ffdcc1d2463da8686750252e1753" member_type: VOTER last_known_addr { host: "127.12.95.126" port: 39495 } } }
I20260924 08:03:06.081053 15052 sys_catalog.cc:458] T 00000000000000000000000000000000 P ade8ffdcc1d2463da8686750252e1753 [sys.catalog]: This master's current role is: LEADER
I20260924 08:03:06.081313 15053 sys_catalog.cc:455] T 00000000000000000000000000000000 P ade8ffdcc1d2463da8686750252e1753 [sys.catalog]: SysCatalogTable state changed. Reason: RaftConsensus started. Latest consensus state: current_term: 1 leader_uuid: "ade8ffdcc1d2463da8686750252e1753" committed_config { opid_index: -1 OBSOLETE_local: true peers { permanent_uuid: "ade8ffdcc1d2463da8686750252e1753" member_type: VOTER last_known_addr { host: "127.12.95.126" port: 39495 } } }
I20260924 08:03:06.081386 15053 sys_catalog.cc:458] T 00000000000000000000000000000000 P ade8ffdcc1d2463da8686750252e1753 [sys.catalog]: This master's current role is: LEADER
I20260924 08:03:06.082278 15047 ranger_client.cc:318] Using new properties file: /tmp/dist-test-taskGoZl2g/test-tmp/ts_authz-itest.1.AuthzProviders_TSAuthzTxnOpsITest.BasicOperationsForAuthorizedUsers_Ranger.1790236757264992-12669-0/minicluster-data/master-0/logs/kudu-ranger-subprocess-log4j2.properties
I20260924 08:03:06.083465 15061 catalog_manager.cc:1524] Loading table and tablet metadata into memory...
I20260924 08:03:06.086390 15061 catalog_manager.cc:1533] Initializing Kudu cluster ID...
I20260924 08:03:06.098956 15061 catalog_manager.cc:1396] Generated new cluster ID: bd22d3ad3856488bae170700dd02d670
I20260924 08:03:06.099035 15061 catalog_manager.cc:1544] Initializing Kudu internal certificate authority...
I20260924 08:03:06.130474 15061 catalog_manager.cc:1419] Generated new certificate authority record
I20260924 08:03:06.132691 15061 catalog_manager.cc:1553] Loading token signing keys...
I20260924 08:03:06.148487 15061 catalog_manager.cc:6219] T 00000000000000000000000000000000 P ade8ffdcc1d2463da8686750252e1753: Generated new TSK 0
I20260924 08:03:06.149252 15061 catalog_manager.cc:1563] Initializing in-progress tserver states...
WARNING: no policy specified for kudu/127.12.95.65@KRBTEST.COM; defaulting to no policy
Authenticating as principal test-admin/admin@KRBTEST.COM with password.
Principal "kudu/127.12.95.65@KRBTEST.COM" created.
Authenticating as principal test-admin/admin@KRBTEST.COM with password.
Entry for principal kudu/127.12.95.65 with kvno 2, encryption type aes256-cts-hmac-sha1-96 added to keytab WRFILE:/tmp/dist-test-taskGoZl2g/test-tmp/ts_authz-itest.1.AuthzProviders_TSAuthzTxnOpsITest.BasicOperationsForAuthorizedUsers_Ranger.1790236757264992-12669-0/krb5kdc/kudu.keytab.
Entry for principal kudu/127.12.95.65 with kvno 2, encryption type aes128-cts-hmac-sha1-96 added to keytab WRFILE:/tmp/dist-test-taskGoZl2g/test-tmp/ts_authz-itest.1.AuthzProviders_TSAuthzTxnOpsITest.BasicOperationsForAuthorizedUsers_Ranger.1790236757264992-12669-0/krb5kdc/kudu.keytab.
WARNING: no policy specified for HTTP/127.12.95.65@KRBTEST.COM; defaulting to no policy
Authenticating as principal test-admin/admin@KRBTEST.COM with password.
Principal "HTTP/127.12.95.65@KRBTEST.COM" created.
Authenticating as principal test-admin/admin@KRBTEST.COM with password.
Entry for principal HTTP/127.12.95.65 with kvno 2, encryption type aes256-cts-hmac-sha1-96 added to keytab WRFILE:/tmp/dist-test-taskGoZl2g/test-tmp/ts_authz-itest.1.AuthzProviders_TSAuthzTxnOpsITest.BasicOperationsForAuthorizedUsers_Ranger.1790236757264992-12669-0/krb5kdc/kudu.keytab.
Entry for principal HTTP/127.12.95.65 with kvno 2, encryption type aes128-cts-hmac-sha1-96 added to keytab WRFILE:/tmp/dist-test-taskGoZl2g/test-tmp/ts_authz-itest.1.AuthzProviders_TSAuthzTxnOpsITest.BasicOperationsForAuthorizedUsers_Ranger.1790236757264992-12669-0/krb5kdc/kudu.keytab.
I20260924 08:03:06.910609 12669 external_mini_cluster.cc:1372] Running /tmp/dist-test-taskGoZl2g/build/debug/bin/kudu
/tmp/dist-test-taskGoZl2g/build/debug/bin/kudu
--fs_wal_dir=/tmp/dist-test-taskGoZl2g/test-tmp/ts_authz-itest.1.AuthzProviders_TSAuthzTxnOpsITest.BasicOperationsForAuthorizedUsers_Ranger.1790236757264992-12669-0/minicluster-data/ts-0/wal
--fs_data_dirs=/tmp/dist-test-taskGoZl2g/test-tmp/ts_authz-itest.1.AuthzProviders_TSAuthzTxnOpsITest.BasicOperationsForAuthorizedUsers_Ranger.1790236757264992-12669-0/minicluster-data/ts-0/data
--block_manager=log
--webserver_interface=localhost
--never_fsync
--enable_minidumps=false
--redact=none
--metrics_log_interval_ms=1000
--log_dir=/tmp/dist-test-taskGoZl2g/test-tmp/ts_authz-itest.1.AuthzProviders_TSAuthzTxnOpsITest.BasicOperationsForAuthorizedUsers_Ranger.1790236757264992-12669-0/minicluster-data/ts-0/logs
--server_dump_info_path=/tmp/dist-test-taskGoZl2g/test-tmp/ts_authz-itest.1.AuthzProviders_TSAuthzTxnOpsITest.BasicOperationsForAuthorizedUsers_Ranger.1790236757264992-12669-0/minicluster-data/ts-0/data/info.pb
--server_dump_info_format=pb
--rpc_server_allow_ephemeral_ports
--unlock_experimental_flags
--unlock_unsafe_flags
--logtostderr
--logbuflevel=-1
--ipki_server_key_size=768
--openssl_security_level_override=0
tserver
run
--rpc_bind_addresses=127.12.95.65:0
--local_ip_for_outbound_sockets=127.12.95.65
--webserver_interface=127.12.95.65
--webserver_port=0
--tserver_master_addrs=127.12.95.126:39495
--keytab_file=/tmp/dist-test-taskGoZl2g/test-tmp/ts_authz-itest.1.AuthzProviders_TSAuthzTxnOpsITest.BasicOperationsForAuthorizedUsers_Ranger.1790236757264992-12669-0/krb5kdc/kudu.keytab
--principal=kudu/127.12.95.65
--rpc_authentication=required
--superuser_acl=test-admin
--user_acl=test-user
--webserver_require_spnego=true
--builtin_ntp_servers=127.12.95.84:35553
--builtin_ntp_poll_interval_ms=100
--ntp_initial_sync_wait_secs=10
--time_source=builtin
--user_acl=user0,user1,user2
--tserver_enforce_access_control=true
--enable_txn_system_client_init with env {KRB5CCNAME=/tmp/dist-test-taskGoZl2g/test-tmp/ts_authz-itest.1.AuthzProviders_TSAuthzTxnOpsITest.BasicOperationsForAuthorizedUsers_Ranger.1790236757264992-12669-0/krb5kdc/krb5cc,KRB5_CONFIG=/tmp/dist-test-taskGoZl2g/test-tmp/ts_authz-itest.1.AuthzProviders_TSAuthzTxnOpsITest.BasicOperationsForAuthorizedUsers_Ranger.1790236757264992-12669-0/krb5kdc/krb5.conf,KRB5_KDC_PROFILE=/tmp/dist-test-taskGoZl2g/test-tmp/ts_authz-itest.1.AuthzProviders_TSAuthzTxnOpsITest.BasicOperationsForAuthorizedUsers_Ranger.1790236757264992-12669-0/krb5kdc/kdc.conf,KUDU_ENABLE_KRB5_REALM_FIX=yes}
W20260924 08:03:07.038002 15106 flags.cc:432] Enabled unsafe flag: --openssl_security_level_override=0
W20260924 08:03:07.038388 15106 flags.cc:432] Enabled unsafe flag: --rpc_server_allow_ephemeral_ports=true
W20260924 08:03:07.038533 15106 flags.cc:432] Enabled unsafe flag: --never_fsync=true
W20260924 08:03:07.043367 15106 flags.cc:432] Enabled experimental flag: --ipki_server_key_size=768
W20260924 08:03:07.043517 15106 flags.cc:432] Enabled experimental flag: --enable_txn_system_client_init=true
W20260924 08:03:07.043577 15106 flags.cc:432] Enabled experimental flag: --local_ip_for_outbound_sockets=127.12.95.65
I20260924 08:03:07.048059 15106 tablet_server_runner.cc:78] Tablet server non-default flags:
--log_dir=/tmp/dist-test-taskGoZl2g/test-tmp/ts_authz-itest.1.AuthzProviders_TSAuthzTxnOpsITest.BasicOperationsForAuthorizedUsers_Ranger.1790236757264992-12669-0/minicluster-data/ts-0/logs
--logbuflevel=-1
--logtostderr=true
--builtin_ntp_poll_interval_ms=100
--builtin_ntp_servers=127.12.95.84:35553
--ntp_initial_sync_wait_secs=10
--time_source=builtin
--fs_data_dirs=/tmp/dist-test-taskGoZl2g/test-tmp/ts_authz-itest.1.AuthzProviders_TSAuthzTxnOpsITest.BasicOperationsForAuthorizedUsers_Ranger.1790236757264992-12669-0/minicluster-data/ts-0/data
--fs_wal_dir=/tmp/dist-test-taskGoZl2g/test-tmp/ts_authz-itest.1.AuthzProviders_TSAuthzTxnOpsITest.BasicOperationsForAuthorizedUsers_Ranger.1790236757264992-12669-0/minicluster-data/ts-0/wal
--keytab_file=/tmp/dist-test-taskGoZl2g/test-tmp/ts_authz-itest.1.AuthzProviders_TSAuthzTxnOpsITest.BasicOperationsForAuthorizedUsers_Ranger.1790236757264992-12669-0/krb5kdc/kudu.keytab
--principal=kudu/127.12.95.65
--ipki_server_key_size=768
--openssl_security_level_override=0
--rpc_bind_addresses=127.12.95.65:0
--rpc_server_allow_ephemeral_ports=true
--rpc_authentication=required
--superuser_acl=<redacted>
--user_acl=<redacted>
--metrics_log_interval_ms=1000
--server_dump_info_format=pb
--server_dump_info_path=/tmp/dist-test-taskGoZl2g/test-tmp/ts_authz-itest.1.AuthzProviders_TSAuthzTxnOpsITest.BasicOperationsForAuthorizedUsers_Ranger.1790236757264992-12669-0/minicluster-data/ts-0/data/info.pb
--webserver_interface=127.12.95.65
--webserver_port=0
--webserver_require_spnego=true
--enable_txn_system_client_init=true
--tserver_master_addrs=127.12.95.126:39495
--tserver_enforce_access_control=true
--never_fsync=true
--heap_profile_path=/tmp/kudu.15106
--redact=none
--unlock_experimental_flags=true
--unlock_unsafe_flags=true
--enable_minidumps=false
--local_ip_for_outbound_sockets=127.12.95.65

Tablet server version:
kudu 1.19.0-SNAPSHOT
revision ee47a9ca1939200e227f9bf266c97a7c0eed3ccc
build type DEBUG
built by None at 24 Sep 2026 07:43:13 UTC on bdcb31816ec0
build id 13971
I20260924 08:03:07.049188 15106 env_posix.cc:2285] Not raising this process' open files per process limit of 1048576; it is already as high as it can go
I20260924 08:03:07.050348 15106 file_cache.cc:504] Constructed file cache file cache with capacity 419430
W20260924 08:03:07.057540 15113 instance_detector.cc:116] could not retrieve AWS instance metadata: Network error: curl error: HTTP response code said error: The requested URL returned error: 404
W20260924 08:03:07.057550 15116 instance_detector.cc:116] could not retrieve OpenStack instance metadata: Network error: curl error: HTTP response code said error: The requested URL returned error: 404
W20260924 08:03:07.057587 15114 instance_detector.cc:116] could not retrieve Azure instance metadata: Network error: curl error: HTTP response code said error: The requested URL returned error: 404
I20260924 08:03:07.059021 15106 server_base.cc:1061] running on GCE node
I20260924 08:03:07.061888 15106 hybrid_clock.cc:584] initializing the hybrid clock with 'builtin' time source
I20260924 08:03:07.062422 15106 hybrid_clock.cc:630] waiting up to --ntp_initial_sync_wait_secs=10 seconds for the clock to synchronize
I20260924 08:03:07.063594 15106 hybrid_clock.cc:648] HybridClock initialized: now 1790236987063576 us; error 30 us; skew 500 ppm
Sep 24 08:03:07 dist-test-slave-hwwr krb5kdc[14396](info): AS_REQ (2 etypes {17 16}) 127.0.0.1: ISSUE: authtime 1790236987, etypes {rep=17 tkt=17 ses=17}, kudu/127.12.95.65@KRBTEST.COM for krbtgt/KRBTEST.COM@KRBTEST.COM
I20260924 08:03:07.066515 15106 init.cc:377] Logged in from keytab as kudu/127.12.95.65@KRBTEST.COM (short username kudu)
I20260924 08:03:07.067700 15106 webserver.cc:533] Webserver started at http://127.12.95.65:36671/ using document root <none> and password file <none>
I20260924 08:03:07.068364 15106 fs_manager.cc:362] Metadata directory not provided
I20260924 08:03:07.068423 15106 fs_manager.cc:368] Using write-ahead log directory (fs_wal_dir) as metadata directory
I20260924 08:03:07.068630 15106 server_base.cc:909] This appears to be a new deployment of Kudu; creating new FS layout
I20260924 08:03:07.070595 15106 fs_manager.cc:1068] Generated new instance metadata in path /tmp/dist-test-taskGoZl2g/test-tmp/ts_authz-itest.1.AuthzProviders_TSAuthzTxnOpsITest.BasicOperationsForAuthorizedUsers_Ranger.1790236757264992-12669-0/minicluster-data/ts-0/data/instance:
uuid: "f4ca9de34c04483d80815fccb5714828"
format_stamp: "Formatted at 2026-09-24 08:03:07 on dist-test-slave-hwwr"
I20260924 08:03:07.071136 15106 fs_manager.cc:1068] Generated new instance metadata in path /tmp/dist-test-taskGoZl2g/test-tmp/ts_authz-itest.1.AuthzProviders_TSAuthzTxnOpsITest.BasicOperationsForAuthorizedUsers_Ranger.1790236757264992-12669-0/minicluster-data/ts-0/wal/instance:
uuid: "f4ca9de34c04483d80815fccb5714828"
format_stamp: "Formatted at 2026-09-24 08:03:07 on dist-test-slave-hwwr"
I20260924 08:03:07.075263 15106 fs_manager.cc:696] Time spent creating directory manager: real 0.004s	user 0.005s	sys 0.000s
I20260924 08:03:07.077674 15123 log_block_manager.cc:4127] Time spent loading block containers with low live blocks: real 0.000s	user 0.000s	sys 0.000s
I20260924 08:03:07.078756 15106 fs_manager.cc:730] Time spent opening block manager: real 0.002s	user 0.002s	sys 0.001s
I20260924 08:03:07.078886 15106 fs_manager.cc:647] Opened local filesystem: /tmp/dist-test-taskGoZl2g/test-tmp/ts_authz-itest.1.AuthzProviders_TSAuthzTxnOpsITest.BasicOperationsForAuthorizedUsers_Ranger.1790236757264992-12669-0/minicluster-data/ts-0/data,/tmp/dist-test-taskGoZl2g/test-tmp/ts_authz-itest.1.AuthzProviders_TSAuthzTxnOpsITest.BasicOperationsForAuthorizedUsers_Ranger.1790236757264992-12669-0/minicluster-data/ts-0/wal
uuid: "f4ca9de34c04483d80815fccb5714828"
format_stamp: "Formatted at 2026-09-24 08:03:07 on dist-test-slave-hwwr"
I20260924 08:03:07.078956 15106 fs_report.cc:389] FS layout report
--------------------
wal directory: /tmp/dist-test-taskGoZl2g/test-tmp/ts_authz-itest.1.AuthzProviders_TSAuthzTxnOpsITest.BasicOperationsForAuthorizedUsers_Ranger.1790236757264992-12669-0/minicluster-data/ts-0/wal
metadata directory: /tmp/dist-test-taskGoZl2g/test-tmp/ts_authz-itest.1.AuthzProviders_TSAuthzTxnOpsITest.BasicOperationsForAuthorizedUsers_Ranger.1790236757264992-12669-0/minicluster-data/ts-0/wal
1 data directories: /tmp/dist-test-taskGoZl2g/test-tmp/ts_authz-itest.1.AuthzProviders_TSAuthzTxnOpsITest.BasicOperationsForAuthorizedUsers_Ranger.1790236757264992-12669-0/minicluster-data/ts-0/data/data
Total live blocks: 0
Total live bytes: 0
Total live bytes (after alignment): 0
Total number of LBM containers: 0 (0 full)
Did not check for missing blocks
Did not check for orphaned blocks
Total full LBM containers with extra space: 0 (0 repaired)
Total full LBM container extra space in bytes: 0 (0 repaired)
Total incomplete LBM containers: 0 (0 repaired)
Total LBM partial records: 0 (0 repaired)
Total corrupted LBM metadata records in RocksDB: 0 (0 repaired)
I20260924 08:03:07.105185 15106 rpc_server.cc:225] running with OpenSSL 1.1.1  11 Sep 2018
I20260924 08:03:07.108596 15106 env_posix.cc:2285] Not raising this process' running threads per effective uid limit of 18446744073709551615; it is already as high as it can go
I20260924 08:03:07.108870 15106 kserver.cc:163] Server-wide thread pool size limit: 3276
I20260924 08:03:07.110730 15106 ts_tablet_manager.cc:585] Loaded tablet metadata (0 total tablets, 0 live tablets)
I20260924 08:03:07.110862 15106 ts_tablet_manager.cc:531] Time spent load tablet metadata: real 0.000s	user 0.000s	sys 0.000s
I20260924 08:03:07.110963 15106 ts_tablet_manager.cc:616] Registered 0 tablets
I20260924 08:03:07.110999 15106 ts_tablet_manager.cc:595] Time spent register tablets: real 0.000s	user 0.000s	sys 0.000s
I20260924 08:03:07.121421 15106 rpc_server.cc:307] RPC server started. Bound to: 127.12.95.65:44043
I20260924 08:03:07.123908 15106 server_base.cc:1193] Dumped server information to /tmp/dist-test-taskGoZl2g/test-tmp/ts_authz-itest.1.AuthzProviders_TSAuthzTxnOpsITest.BasicOperationsForAuthorizedUsers_Ranger.1790236757264992-12669-0/minicluster-data/ts-0/data/info.pb
I20260924 08:03:07.129118 12669 external_mini_cluster.cc:1434] Started /tmp/dist-test-taskGoZl2g/build/debug/bin/kudu as pid 15106
I20260924 08:03:07.129230 12669 external_mini_cluster.cc:1448] Reading /tmp/dist-test-taskGoZl2g/test-tmp/ts_authz-itest.1.AuthzProviders_TSAuthzTxnOpsITest.BasicOperationsForAuthorizedUsers_Ranger.1790236757264992-12669-0/minicluster-data/ts-0/wal/instance
I20260924 08:03:07.127272 15241 acceptor_pool.cc:272] collecting diagnostics on the listening RPC socket 127.12.95.65:44043 every 8 connection(s)
Sep 24 08:03:07 dist-test-slave-hwwr krb5kdc[14396](info): TGS_REQ (2 etypes {17 16}) 127.0.0.1: ISSUE: authtime 1790236987, etypes {rep=17 tkt=17 ses=17}, kudu/127.12.95.65@KRBTEST.COM for kudu/127.12.95.126@KRBTEST.COM
I20260924 08:03:07.145835 15242 heartbeater.cc:344] Connected to a master server at 127.12.95.126:39495
I20260924 08:03:07.146008 15242 heartbeater.cc:461] Registering TS with master...
I20260924 08:03:07.146507 15242 heartbeater.cc:507] Master 127.12.95.126:39495 requested a full tablet report, sending...
I20260924 08:03:07.148164 15000 ts_manager.cc:194] Registered new tserver with Master: f4ca9de34c04483d80815fccb5714828 (127.12.95.65:44043)
I20260924 08:03:07.149725 15000 master_service.cc:502] Signed X509 certificate for tserver {username='kudu', principal='kudu/127.12.95.65@KRBTEST.COM'} at 127.12.95.65:59729
WARNING: no policy specified for kudu/127.12.95.66@KRBTEST.COM; defaulting to no policy
Authenticating as principal test-admin/admin@KRBTEST.COM with password.
Principal "kudu/127.12.95.66@KRBTEST.COM" created.
Authenticating as principal test-admin/admin@KRBTEST.COM with password.
Entry for principal kudu/127.12.95.66 with kvno 2, encryption type aes256-cts-hmac-sha1-96 added to keytab WRFILE:/tmp/dist-test-taskGoZl2g/test-tmp/ts_authz-itest.1.AuthzProviders_TSAuthzTxnOpsITest.BasicOperationsForAuthorizedUsers_Ranger.1790236757264992-12669-0/krb5kdc/kudu.keytab.
Entry for principal kudu/127.12.95.66 with kvno 2, encryption type aes128-cts-hmac-sha1-96 added to keytab WRFILE:/tmp/dist-test-taskGoZl2g/test-tmp/ts_authz-itest.1.AuthzProviders_TSAuthzTxnOpsITest.BasicOperationsForAuthorizedUsers_Ranger.1790236757264992-12669-0/krb5kdc/kudu.keytab.
WARNING: no policy specified for HTTP/127.12.95.66@KRBTEST.COM; defaulting to no policy
Authenticating as principal test-admin/admin@KRBTEST.COM with password.
Principal "HTTP/127.12.95.66@KRBTEST.COM" created.
Authenticating as principal test-admin/admin@KRBTEST.COM with password.
Entry for principal HTTP/127.12.95.66 with kvno 2, encryption type aes256-cts-hmac-sha1-96 added to keytab WRFILE:/tmp/dist-test-taskGoZl2g/test-tmp/ts_authz-itest.1.AuthzProviders_TSAuthzTxnOpsITest.BasicOperationsForAuthorizedUsers_Ranger.1790236757264992-12669-0/krb5kdc/kudu.keytab.
Entry for principal HTTP/127.12.95.66 with kvno 2, encryption type aes128-cts-hmac-sha1-96 added to keytab WRFILE:/tmp/dist-test-taskGoZl2g/test-tmp/ts_authz-itest.1.AuthzProviders_TSAuthzTxnOpsITest.BasicOperationsForAuthorizedUsers_Ranger.1790236757264992-12669-0/krb5kdc/kudu.keytab.
I20260924 08:03:07.219187 12669 external_mini_cluster.cc:1372] Running /tmp/dist-test-taskGoZl2g/build/debug/bin/kudu
/tmp/dist-test-taskGoZl2g/build/debug/bin/kudu
--fs_wal_dir=/tmp/dist-test-taskGoZl2g/test-tmp/ts_authz-itest.1.AuthzProviders_TSAuthzTxnOpsITest.BasicOperationsForAuthorizedUsers_Ranger.1790236757264992-12669-0/minicluster-data/ts-1/wal
--fs_data_dirs=/tmp/dist-test-taskGoZl2g/test-tmp/ts_authz-itest.1.AuthzProviders_TSAuthzTxnOpsITest.BasicOperationsForAuthorizedUsers_Ranger.1790236757264992-12669-0/minicluster-data/ts-1/data
--block_manager=log
--webserver_interface=localhost
--never_fsync
--enable_minidumps=false
--redact=none
--metrics_log_interval_ms=1000
--log_dir=/tmp/dist-test-taskGoZl2g/test-tmp/ts_authz-itest.1.AuthzProviders_TSAuthzTxnOpsITest.BasicOperationsForAuthorizedUsers_Ranger.1790236757264992-12669-0/minicluster-data/ts-1/logs
--server_dump_info_path=/tmp/dist-test-taskGoZl2g/test-tmp/ts_authz-itest.1.AuthzProviders_TSAuthzTxnOpsITest.BasicOperationsForAuthorizedUsers_Ranger.1790236757264992-12669-0/minicluster-data/ts-1/data/info.pb
--server_dump_info_format=pb
--rpc_server_allow_ephemeral_ports
--unlock_experimental_flags
--unlock_unsafe_flags
--logtostderr
--logbuflevel=-1
--ipki_server_key_size=768
--openssl_security_level_override=0
tserver
run
--rpc_bind_addresses=127.12.95.66:0
--local_ip_for_outbound_sockets=127.12.95.66
--webserver_interface=127.12.95.66
--webserver_port=0
--tserver_master_addrs=127.12.95.126:39495
--keytab_file=/tmp/dist-test-taskGoZl2g/test-tmp/ts_authz-itest.1.AuthzProviders_TSAuthzTxnOpsITest.BasicOperationsForAuthorizedUsers_Ranger.1790236757264992-12669-0/krb5kdc/kudu.keytab
--principal=kudu/127.12.95.66
--rpc_authentication=required
--superuser_acl=test-admin
--user_acl=test-user
--webserver_require_spnego=true
--builtin_ntp_servers=127.12.95.84:35553
--builtin_ntp_poll_interval_ms=100
--ntp_initial_sync_wait_secs=10
--time_source=builtin
--user_acl=user0,user1,user2
--tserver_enforce_access_control=true
--enable_txn_system_client_init with env {KRB5CCNAME=/tmp/dist-test-taskGoZl2g/test-tmp/ts_authz-itest.1.AuthzProviders_TSAuthzTxnOpsITest.BasicOperationsForAuthorizedUsers_Ranger.1790236757264992-12669-0/krb5kdc/krb5cc,KRB5_CONFIG=/tmp/dist-test-taskGoZl2g/test-tmp/ts_authz-itest.1.AuthzProviders_TSAuthzTxnOpsITest.BasicOperationsForAuthorizedUsers_Ranger.1790236757264992-12669-0/krb5kdc/krb5.conf,KRB5_KDC_PROFILE=/tmp/dist-test-taskGoZl2g/test-tmp/ts_authz-itest.1.AuthzProviders_TSAuthzTxnOpsITest.BasicOperationsForAuthorizedUsers_Ranger.1790236757264992-12669-0/krb5kdc/kdc.conf,KUDU_ENABLE_KRB5_REALM_FIX=yes}
Sep 24 08:03:07 dist-test-slave-hwwr krb5kdc[14396](info): AS_REQ (1 etypes {17}) 127.0.0.1: ISSUE: authtime 1790236987, etypes {rep=17 tkt=17 ses=17}, kudu/127.12.95.126@KRBTEST.COM for krbtgt/KRBTEST.COM@KRBTEST.COM
W20260924 08:03:07.355805 15253 flags.cc:432] Enabled unsafe flag: --openssl_security_level_override=0
W20260924 08:03:07.356069 15253 flags.cc:432] Enabled unsafe flag: --rpc_server_allow_ephemeral_ports=true
W20260924 08:03:07.356215 15253 flags.cc:432] Enabled unsafe flag: --never_fsync=true
W20260924 08:03:07.359899 15253 flags.cc:432] Enabled experimental flag: --ipki_server_key_size=768
W20260924 08:03:07.360037 15253 flags.cc:432] Enabled experimental flag: --enable_txn_system_client_init=true
W20260924 08:03:07.360150 15253 flags.cc:432] Enabled experimental flag: --local_ip_for_outbound_sockets=127.12.95.66
I20260924 08:03:07.365762 15253 tablet_server_runner.cc:78] Tablet server non-default flags:
--log_dir=/tmp/dist-test-taskGoZl2g/test-tmp/ts_authz-itest.1.AuthzProviders_TSAuthzTxnOpsITest.BasicOperationsForAuthorizedUsers_Ranger.1790236757264992-12669-0/minicluster-data/ts-1/logs
--logbuflevel=-1
--logtostderr=true
--builtin_ntp_poll_interval_ms=100
--builtin_ntp_servers=127.12.95.84:35553
--ntp_initial_sync_wait_secs=10
--time_source=builtin
--fs_data_dirs=/tmp/dist-test-taskGoZl2g/test-tmp/ts_authz-itest.1.AuthzProviders_TSAuthzTxnOpsITest.BasicOperationsForAuthorizedUsers_Ranger.1790236757264992-12669-0/minicluster-data/ts-1/data
--fs_wal_dir=/tmp/dist-test-taskGoZl2g/test-tmp/ts_authz-itest.1.AuthzProviders_TSAuthzTxnOpsITest.BasicOperationsForAuthorizedUsers_Ranger.1790236757264992-12669-0/minicluster-data/ts-1/wal
--keytab_file=/tmp/dist-test-taskGoZl2g/test-tmp/ts_authz-itest.1.AuthzProviders_TSAuthzTxnOpsITest.BasicOperationsForAuthorizedUsers_Ranger.1790236757264992-12669-0/krb5kdc/kudu.keytab
--principal=kudu/127.12.95.66
--ipki_server_key_size=768
--openssl_security_level_override=0
--rpc_bind_addresses=127.12.95.66:0
--rpc_server_allow_ephemeral_ports=true
--rpc_authentication=required
--superuser_acl=<redacted>
--user_acl=<redacted>
--metrics_log_interval_ms=1000
--server_dump_info_format=pb
--server_dump_info_path=/tmp/dist-test-taskGoZl2g/test-tmp/ts_authz-itest.1.AuthzProviders_TSAuthzTxnOpsITest.BasicOperationsForAuthorizedUsers_Ranger.1790236757264992-12669-0/minicluster-data/ts-1/data/info.pb
--webserver_interface=127.12.95.66
--webserver_port=0
--webserver_require_spnego=true
--enable_txn_system_client_init=true
--tserver_master_addrs=127.12.95.126:39495
--tserver_enforce_access_control=true
--never_fsync=true
--heap_profile_path=/tmp/kudu.15253
--redact=none
--unlock_experimental_flags=true
--unlock_unsafe_flags=true
--enable_minidumps=false
--local_ip_for_outbound_sockets=127.12.95.66

Tablet server version:
kudu 1.19.0-SNAPSHOT
revision ee47a9ca1939200e227f9bf266c97a7c0eed3ccc
build type DEBUG
built by None at 24 Sep 2026 07:43:13 UTC on bdcb31816ec0
build id 13971
I20260924 08:03:07.366990 15253 env_posix.cc:2285] Not raising this process' open files per process limit of 1048576; it is already as high as it can go
I20260924 08:03:07.367848 15253 file_cache.cc:504] Constructed file cache file cache with capacity 419430
W20260924 08:03:07.374526 15260 instance_detector.cc:116] could not retrieve Azure instance metadata: Network error: curl error: HTTP response code said error: The requested URL returned error: 404
W20260924 08:03:07.374538 15259 instance_detector.cc:116] could not retrieve AWS instance metadata: Network error: curl error: HTTP response code said error: The requested URL returned error: 404
W20260924 08:03:07.374533 15262 instance_detector.cc:116] could not retrieve OpenStack instance metadata: Network error: curl error: HTTP response code said error: The requested URL returned error: 404
I20260924 08:03:07.374830 15253 server_base.cc:1061] running on GCE node
I20260924 08:03:07.375260 15253 hybrid_clock.cc:584] initializing the hybrid clock with 'builtin' time source
I20260924 08:03:07.375835 15253 hybrid_clock.cc:630] waiting up to --ntp_initial_sync_wait_secs=10 seconds for the clock to synchronize
I20260924 08:03:07.377012 15253 hybrid_clock.cc:648] HybridClock initialized: now 1790236987376996 us; error 37 us; skew 500 ppm
Sep 24 08:03:07 dist-test-slave-hwwr krb5kdc[14396](info): AS_REQ (2 etypes {17 16}) 127.0.0.1: ISSUE: authtime 1790236987, etypes {rep=17 tkt=17 ses=17}, kudu/127.12.95.66@KRBTEST.COM for krbtgt/KRBTEST.COM@KRBTEST.COM
I20260924 08:03:07.380338 15253 init.cc:377] Logged in from keytab as kudu/127.12.95.66@KRBTEST.COM (short username kudu)
I20260924 08:03:07.381910 15253 webserver.cc:533] Webserver started at http://127.12.95.66:45963/ using document root <none> and password file <none>
I20260924 08:03:07.382656 15253 fs_manager.cc:362] Metadata directory not provided
I20260924 08:03:07.382738 15253 fs_manager.cc:368] Using write-ahead log directory (fs_wal_dir) as metadata directory
I20260924 08:03:07.382972 15253 server_base.cc:909] This appears to be a new deployment of Kudu; creating new FS layout
I20260924 08:03:07.384642 15253 fs_manager.cc:1068] Generated new instance metadata in path /tmp/dist-test-taskGoZl2g/test-tmp/ts_authz-itest.1.AuthzProviders_TSAuthzTxnOpsITest.BasicOperationsForAuthorizedUsers_Ranger.1790236757264992-12669-0/minicluster-data/ts-1/data/instance:
uuid: "b7966cba6ae04b6eab79454d42cadefe"
format_stamp: "Formatted at 2026-09-24 08:03:07 on dist-test-slave-hwwr"
I20260924 08:03:07.385331 15253 fs_manager.cc:1068] Generated new instance metadata in path /tmp/dist-test-taskGoZl2g/test-tmp/ts_authz-itest.1.AuthzProviders_TSAuthzTxnOpsITest.BasicOperationsForAuthorizedUsers_Ranger.1790236757264992-12669-0/minicluster-data/ts-1/wal/instance:
uuid: "b7966cba6ae04b6eab79454d42cadefe"
format_stamp: "Formatted at 2026-09-24 08:03:07 on dist-test-slave-hwwr"
I20260924 08:03:07.389725 15253 fs_manager.cc:696] Time spent creating directory manager: real 0.004s	user 0.003s	sys 0.000s
I20260924 08:03:07.395336 15269 log_block_manager.cc:4127] Time spent loading block containers with low live blocks: real 0.000s	user 0.000s	sys 0.000s
I20260924 08:03:07.396746 15253 fs_manager.cc:730] Time spent opening block manager: real 0.005s	user 0.003s	sys 0.000s
I20260924 08:03:07.396869 15253 fs_manager.cc:647] Opened local filesystem: /tmp/dist-test-taskGoZl2g/test-tmp/ts_authz-itest.1.AuthzProviders_TSAuthzTxnOpsITest.BasicOperationsForAuthorizedUsers_Ranger.1790236757264992-12669-0/minicluster-data/ts-1/data,/tmp/dist-test-taskGoZl2g/test-tmp/ts_authz-itest.1.AuthzProviders_TSAuthzTxnOpsITest.BasicOperationsForAuthorizedUsers_Ranger.1790236757264992-12669-0/minicluster-data/ts-1/wal
uuid: "b7966cba6ae04b6eab79454d42cadefe"
format_stamp: "Formatted at 2026-09-24 08:03:07 on dist-test-slave-hwwr"
I20260924 08:03:07.396988 15253 fs_report.cc:389] FS layout report
--------------------
wal directory: /tmp/dist-test-taskGoZl2g/test-tmp/ts_authz-itest.1.AuthzProviders_TSAuthzTxnOpsITest.BasicOperationsForAuthorizedUsers_Ranger.1790236757264992-12669-0/minicluster-data/ts-1/wal
metadata directory: /tmp/dist-test-taskGoZl2g/test-tmp/ts_authz-itest.1.AuthzProviders_TSAuthzTxnOpsITest.BasicOperationsForAuthorizedUsers_Ranger.1790236757264992-12669-0/minicluster-data/ts-1/wal
1 data directories: /tmp/dist-test-taskGoZl2g/test-tmp/ts_authz-itest.1.AuthzProviders_TSAuthzTxnOpsITest.BasicOperationsForAuthorizedUsers_Ranger.1790236757264992-12669-0/minicluster-data/ts-1/data/data
Total live blocks: 0
Total live bytes: 0
Total live bytes (after alignment): 0
Total number of LBM containers: 0 (0 full)
Did not check for missing blocks
Did not check for orphaned blocks
Total full LBM containers with extra space: 0 (0 repaired)
Total full LBM container extra space in bytes: 0 (0 repaired)
Total incomplete LBM containers: 0 (0 repaired)
Total LBM partial records: 0 (0 repaired)
Total corrupted LBM metadata records in RocksDB: 0 (0 repaired)
I20260924 08:03:07.412576 15253 rpc_server.cc:225] running with OpenSSL 1.1.1  11 Sep 2018
I20260924 08:03:07.416302 15253 env_posix.cc:2285] Not raising this process' running threads per effective uid limit of 18446744073709551615; it is already as high as it can go
I20260924 08:03:07.416513 15253 kserver.cc:163] Server-wide thread pool size limit: 3276
I20260924 08:03:07.418467 15253 ts_tablet_manager.cc:585] Loaded tablet metadata (0 total tablets, 0 live tablets)
I20260924 08:03:07.418537 15253 ts_tablet_manager.cc:531] Time spent load tablet metadata: real 0.000s	user 0.000s	sys 0.000s
I20260924 08:03:07.418605 15253 ts_tablet_manager.cc:616] Registered 0 tablets
I20260924 08:03:07.418640 15253 ts_tablet_manager.cc:595] Time spent register tablets: real 0.000s	user 0.000s	sys 0.000s
I20260924 08:03:07.429803 15253 rpc_server.cc:307] RPC server started. Bound to: 127.12.95.66:39011
I20260924 08:03:07.431046 15253 server_base.cc:1193] Dumped server information to /tmp/dist-test-taskGoZl2g/test-tmp/ts_authz-itest.1.AuthzProviders_TSAuthzTxnOpsITest.BasicOperationsForAuthorizedUsers_Ranger.1790236757264992-12669-0/minicluster-data/ts-1/data/info.pb
I20260924 08:03:07.433879 15384 acceptor_pool.cc:272] collecting diagnostics on the listening RPC socket 127.12.95.66:39011 every 8 connection(s)
I20260924 08:03:07.436928 12669 external_mini_cluster.cc:1434] Started /tmp/dist-test-taskGoZl2g/build/debug/bin/kudu as pid 15253
I20260924 08:03:07.437039 12669 external_mini_cluster.cc:1448] Reading /tmp/dist-test-taskGoZl2g/test-tmp/ts_authz-itest.1.AuthzProviders_TSAuthzTxnOpsITest.BasicOperationsForAuthorizedUsers_Ranger.1790236757264992-12669-0/minicluster-data/ts-1/wal/instance
Sep 24 08:03:07 dist-test-slave-hwwr krb5kdc[14396](info): TGS_REQ (2 etypes {17 16}) 127.0.0.1: ISSUE: authtime 1790236987, etypes {rep=17 tkt=17 ses=17}, kudu/127.12.95.66@KRBTEST.COM for kudu/127.12.95.126@KRBTEST.COM
I20260924 08:03:07.448974 15385 heartbeater.cc:344] Connected to a master server at 127.12.95.126:39495
I20260924 08:03:07.449146 15385 heartbeater.cc:461] Registering TS with master...
I20260924 08:03:07.449877 15385 heartbeater.cc:507] Master 127.12.95.126:39495 requested a full tablet report, sending...
I20260924 08:03:07.451133 15001 ts_manager.cc:194] Registered new tserver with Master: b7966cba6ae04b6eab79454d42cadefe (127.12.95.66:39011)
I20260924 08:03:07.451732 15001 master_service.cc:502] Signed X509 certificate for tserver {username='kudu', principal='kudu/127.12.95.66@KRBTEST.COM'} at 127.12.95.66:43013
WARNING: no policy specified for kudu/127.12.95.67@KRBTEST.COM; defaulting to no policy
Authenticating as principal test-admin/admin@KRBTEST.COM with password.
Principal "kudu/127.12.95.67@KRBTEST.COM" created.
Authenticating as principal test-admin/admin@KRBTEST.COM with password.
Entry for principal kudu/127.12.95.67 with kvno 2, encryption type aes256-cts-hmac-sha1-96 added to keytab WRFILE:/tmp/dist-test-taskGoZl2g/test-tmp/ts_authz-itest.1.AuthzProviders_TSAuthzTxnOpsITest.BasicOperationsForAuthorizedUsers_Ranger.1790236757264992-12669-0/krb5kdc/kudu.keytab.
Entry for principal kudu/127.12.95.67 with kvno 2, encryption type aes128-cts-hmac-sha1-96 added to keytab WRFILE:/tmp/dist-test-taskGoZl2g/test-tmp/ts_authz-itest.1.AuthzProviders_TSAuthzTxnOpsITest.BasicOperationsForAuthorizedUsers_Ranger.1790236757264992-12669-0/krb5kdc/kudu.keytab.
WARNING: no policy specified for HTTP/127.12.95.67@KRBTEST.COM; defaulting to no policy
Authenticating as principal test-admin/admin@KRBTEST.COM with password.
Principal "HTTP/127.12.95.67@KRBTEST.COM" created.
Authenticating as principal test-admin/admin@KRBTEST.COM with password.
Entry for principal HTTP/127.12.95.67 with kvno 2, encryption type aes256-cts-hmac-sha1-96 added to keytab WRFILE:/tmp/dist-test-taskGoZl2g/test-tmp/ts_authz-itest.1.AuthzProviders_TSAuthzTxnOpsITest.BasicOperationsForAuthorizedUsers_Ranger.1790236757264992-12669-0/krb5kdc/kudu.keytab.
Entry for principal HTTP/127.12.95.67 with kvno 2, encryption type aes128-cts-hmac-sha1-96 added to keytab WRFILE:/tmp/dist-test-taskGoZl2g/test-tmp/ts_authz-itest.1.AuthzProviders_TSAuthzTxnOpsITest.BasicOperationsForAuthorizedUsers_Ranger.1790236757264992-12669-0/krb5kdc/kudu.keytab.
I20260924 08:03:07.544925 12669 external_mini_cluster.cc:1372] Running /tmp/dist-test-taskGoZl2g/build/debug/bin/kudu
/tmp/dist-test-taskGoZl2g/build/debug/bin/kudu
--fs_wal_dir=/tmp/dist-test-taskGoZl2g/test-tmp/ts_authz-itest.1.AuthzProviders_TSAuthzTxnOpsITest.BasicOperationsForAuthorizedUsers_Ranger.1790236757264992-12669-0/minicluster-data/ts-2/wal
--fs_data_dirs=/tmp/dist-test-taskGoZl2g/test-tmp/ts_authz-itest.1.AuthzProviders_TSAuthzTxnOpsITest.BasicOperationsForAuthorizedUsers_Ranger.1790236757264992-12669-0/minicluster-data/ts-2/data
--block_manager=log
--webserver_interface=localhost
--never_fsync
--enable_minidumps=false
--redact=none
--metrics_log_interval_ms=1000
--log_dir=/tmp/dist-test-taskGoZl2g/test-tmp/ts_authz-itest.1.AuthzProviders_TSAuthzTxnOpsITest.BasicOperationsForAuthorizedUsers_Ranger.1790236757264992-12669-0/minicluster-data/ts-2/logs
--server_dump_info_path=/tmp/dist-test-taskGoZl2g/test-tmp/ts_authz-itest.1.AuthzProviders_TSAuthzTxnOpsITest.BasicOperationsForAuthorizedUsers_Ranger.1790236757264992-12669-0/minicluster-data/ts-2/data/info.pb
--server_dump_info_format=pb
--rpc_server_allow_ephemeral_ports
--unlock_experimental_flags
--unlock_unsafe_flags
--logtostderr
--logbuflevel=-1
--ipki_server_key_size=768
--openssl_security_level_override=0
tserver
run
--rpc_bind_addresses=127.12.95.67:0
--local_ip_for_outbound_sockets=127.12.95.67
--webserver_interface=127.12.95.67
--webserver_port=0
--tserver_master_addrs=127.12.95.126:39495
--keytab_file=/tmp/dist-test-taskGoZl2g/test-tmp/ts_authz-itest.1.AuthzProviders_TSAuthzTxnOpsITest.BasicOperationsForAuthorizedUsers_Ranger.1790236757264992-12669-0/krb5kdc/kudu.keytab
--principal=kudu/127.12.95.67
--rpc_authentication=required
--superuser_acl=test-admin
--user_acl=test-user
--webserver_require_spnego=true
--builtin_ntp_servers=127.12.95.84:35553
--builtin_ntp_poll_interval_ms=100
--ntp_initial_sync_wait_secs=10
--time_source=builtin
--user_acl=user0,user1,user2
--tserver_enforce_access_control=true
--enable_txn_system_client_init with env {KRB5CCNAME=/tmp/dist-test-taskGoZl2g/test-tmp/ts_authz-itest.1.AuthzProviders_TSAuthzTxnOpsITest.BasicOperationsForAuthorizedUsers_Ranger.1790236757264992-12669-0/krb5kdc/krb5cc,KRB5_CONFIG=/tmp/dist-test-taskGoZl2g/test-tmp/ts_authz-itest.1.AuthzProviders_TSAuthzTxnOpsITest.BasicOperationsForAuthorizedUsers_Ranger.1790236757264992-12669-0/krb5kdc/krb5.conf,KRB5_KDC_PROFILE=/tmp/dist-test-taskGoZl2g/test-tmp/ts_authz-itest.1.AuthzProviders_TSAuthzTxnOpsITest.BasicOperationsForAuthorizedUsers_Ranger.1790236757264992-12669-0/krb5kdc/kdc.conf,KUDU_ENABLE_KRB5_REALM_FIX=yes}
Sep 24 08:03:07 dist-test-slave-hwwr krb5kdc[14396](info): TGS_REQ (1 etypes {17}) 127.0.0.1: ISSUE: authtime 1790236987, etypes {rep=17 tkt=17 ses=17}, kudu/127.12.95.126@KRBTEST.COM for HTTP/127.12.95.84@KRBTEST.COM
W20260924 08:03:07.693017 15396 flags.cc:432] Enabled unsafe flag: --openssl_security_level_override=0
W20260924 08:03:07.693354 15396 flags.cc:432] Enabled unsafe flag: --rpc_server_allow_ephemeral_ports=true
W20260924 08:03:07.693451 15396 flags.cc:432] Enabled unsafe flag: --never_fsync=true
W20260924 08:03:07.698416 15396 flags.cc:432] Enabled experimental flag: --ipki_server_key_size=768
W20260924 08:03:07.698544 15396 flags.cc:432] Enabled experimental flag: --enable_txn_system_client_init=true
W20260924 08:03:07.698614 15396 flags.cc:432] Enabled experimental flag: --local_ip_for_outbound_sockets=127.12.95.67
I20260924 08:03:07.704782 15396 tablet_server_runner.cc:78] Tablet server non-default flags:
--log_dir=/tmp/dist-test-taskGoZl2g/test-tmp/ts_authz-itest.1.AuthzProviders_TSAuthzTxnOpsITest.BasicOperationsForAuthorizedUsers_Ranger.1790236757264992-12669-0/minicluster-data/ts-2/logs
--logbuflevel=-1
--logtostderr=true
--builtin_ntp_poll_interval_ms=100
--builtin_ntp_servers=127.12.95.84:35553
--ntp_initial_sync_wait_secs=10
--time_source=builtin
--fs_data_dirs=/tmp/dist-test-taskGoZl2g/test-tmp/ts_authz-itest.1.AuthzProviders_TSAuthzTxnOpsITest.BasicOperationsForAuthorizedUsers_Ranger.1790236757264992-12669-0/minicluster-data/ts-2/data
--fs_wal_dir=/tmp/dist-test-taskGoZl2g/test-tmp/ts_authz-itest.1.AuthzProviders_TSAuthzTxnOpsITest.BasicOperationsForAuthorizedUsers_Ranger.1790236757264992-12669-0/minicluster-data/ts-2/wal
--keytab_file=/tmp/dist-test-taskGoZl2g/test-tmp/ts_authz-itest.1.AuthzProviders_TSAuthzTxnOpsITest.BasicOperationsForAuthorizedUsers_Ranger.1790236757264992-12669-0/krb5kdc/kudu.keytab
--principal=kudu/127.12.95.67
--ipki_server_key_size=768
--openssl_security_level_override=0
--rpc_bind_addresses=127.12.95.67:0
--rpc_server_allow_ephemeral_ports=true
--rpc_authentication=required
--superuser_acl=<redacted>
--user_acl=<redacted>
--metrics_log_interval_ms=1000
--server_dump_info_format=pb
--server_dump_info_path=/tmp/dist-test-taskGoZl2g/test-tmp/ts_authz-itest.1.AuthzProviders_TSAuthzTxnOpsITest.BasicOperationsForAuthorizedUsers_Ranger.1790236757264992-12669-0/minicluster-data/ts-2/data/info.pb
--webserver_interface=127.12.95.67
--webserver_port=0
--webserver_require_spnego=true
--enable_txn_system_client_init=true
--tserver_master_addrs=127.12.95.126:39495
--tserver_enforce_access_control=true
--never_fsync=true
--heap_profile_path=/tmp/kudu.15396
--redact=none
--unlock_experimental_flags=true
--unlock_unsafe_flags=true
--enable_minidumps=false
--local_ip_for_outbound_sockets=127.12.95.67

Tablet server version:
kudu 1.19.0-SNAPSHOT
revision ee47a9ca1939200e227f9bf266c97a7c0eed3ccc
build type DEBUG
built by None at 24 Sep 2026 07:43:13 UTC on bdcb31816ec0
build id 13971
I20260924 08:03:07.706179 15396 env_posix.cc:2285] Not raising this process' open files per process limit of 1048576; it is already as high as it can go
I20260924 08:03:07.707263 15396 file_cache.cc:504] Constructed file cache file cache with capacity 419430
W20260924 08:03:07.715201 15405 instance_detector.cc:116] could not retrieve OpenStack instance metadata: Network error: curl error: HTTP response code said error: The requested URL returned error: 404
W20260924 08:03:07.715204 15402 instance_detector.cc:116] could not retrieve AWS instance metadata: Network error: curl error: HTTP response code said error: The requested URL returned error: 404
W20260924 08:03:07.715312 15403 instance_detector.cc:116] could not retrieve Azure instance metadata: Network error: curl error: HTTP response code said error: The requested URL returned error: 404
I20260924 08:03:07.717043 15396 server_base.cc:1061] running on GCE node
I20260924 08:03:07.717475 15396 hybrid_clock.cc:584] initializing the hybrid clock with 'builtin' time source
I20260924 08:03:07.718178 15396 hybrid_clock.cc:630] waiting up to --ntp_initial_sync_wait_secs=10 seconds for the clock to synchronize
I20260924 08:03:07.721493 15396 hybrid_clock.cc:648] HybridClock initialized: now 1790236987721461 us; error 35 us; skew 500 ppm
Sep 24 08:03:07 dist-test-slave-hwwr krb5kdc[14396](info): AS_REQ (2 etypes {17 16}) 127.0.0.1: ISSUE: authtime 1790236987, etypes {rep=17 tkt=17 ses=17}, kudu/127.12.95.67@KRBTEST.COM for krbtgt/KRBTEST.COM@KRBTEST.COM
I20260924 08:03:07.724576 15396 init.cc:377] Logged in from keytab as kudu/127.12.95.67@KRBTEST.COM (short username kudu)
I20260924 08:03:07.725915 15396 webserver.cc:533] Webserver started at http://127.12.95.67:39129/ using document root <none> and password file <none>
I20260924 08:03:07.726624 15396 fs_manager.cc:362] Metadata directory not provided
I20260924 08:03:07.726681 15396 fs_manager.cc:368] Using write-ahead log directory (fs_wal_dir) as metadata directory
I20260924 08:03:07.726902 15396 server_base.cc:909] This appears to be a new deployment of Kudu; creating new FS layout
I20260924 08:03:07.729147 15396 fs_manager.cc:1068] Generated new instance metadata in path /tmp/dist-test-taskGoZl2g/test-tmp/ts_authz-itest.1.AuthzProviders_TSAuthzTxnOpsITest.BasicOperationsForAuthorizedUsers_Ranger.1790236757264992-12669-0/minicluster-data/ts-2/data/instance:
uuid: "767f11fc7f704090be0a663b948577bd"
format_stamp: "Formatted at 2026-09-24 08:03:07 on dist-test-slave-hwwr"
I20260924 08:03:07.735769 15396 fs_manager.cc:1068] Generated new instance metadata in path /tmp/dist-test-taskGoZl2g/test-tmp/ts_authz-itest.1.AuthzProviders_TSAuthzTxnOpsITest.BasicOperationsForAuthorizedUsers_Ranger.1790236757264992-12669-0/minicluster-data/ts-2/wal/instance:
uuid: "767f11fc7f704090be0a663b948577bd"
format_stamp: "Formatted at 2026-09-24 08:03:07 on dist-test-slave-hwwr"
I20260924 08:03:07.754441 15396 fs_manager.cc:696] Time spent creating directory manager: real 0.018s	user 0.004s	sys 0.000s
I20260924 08:03:07.762792 15412 log_block_manager.cc:4127] Time spent loading block containers with low live blocks: real 0.000s	user 0.000s	sys 0.000s
I20260924 08:03:07.765949 15396 fs_manager.cc:730] Time spent opening block manager: real 0.010s	user 0.003s	sys 0.000s
I20260924 08:03:07.766098 15396 fs_manager.cc:647] Opened local filesystem: /tmp/dist-test-taskGoZl2g/test-tmp/ts_authz-itest.1.AuthzProviders_TSAuthzTxnOpsITest.BasicOperationsForAuthorizedUsers_Ranger.1790236757264992-12669-0/minicluster-data/ts-2/data,/tmp/dist-test-taskGoZl2g/test-tmp/ts_authz-itest.1.AuthzProviders_TSAuthzTxnOpsITest.BasicOperationsForAuthorizedUsers_Ranger.1790236757264992-12669-0/minicluster-data/ts-2/wal
uuid: "767f11fc7f704090be0a663b948577bd"
format_stamp: "Formatted at 2026-09-24 08:03:07 on dist-test-slave-hwwr"
I20260924 08:03:07.766222 15396 fs_report.cc:389] FS layout report
--------------------
wal directory: /tmp/dist-test-taskGoZl2g/test-tmp/ts_authz-itest.1.AuthzProviders_TSAuthzTxnOpsITest.BasicOperationsForAuthorizedUsers_Ranger.1790236757264992-12669-0/minicluster-data/ts-2/wal
metadata directory: /tmp/dist-test-taskGoZl2g/test-tmp/ts_authz-itest.1.AuthzProviders_TSAuthzTxnOpsITest.BasicOperationsForAuthorizedUsers_Ranger.1790236757264992-12669-0/minicluster-data/ts-2/wal
1 data directories: /tmp/dist-test-taskGoZl2g/test-tmp/ts_authz-itest.1.AuthzProviders_TSAuthzTxnOpsITest.BasicOperationsForAuthorizedUsers_Ranger.1790236757264992-12669-0/minicluster-data/ts-2/data/data
Total live blocks: 0
Total live bytes: 0
Total live bytes (after alignment): 0
Total number of LBM containers: 0 (0 full)
Did not check for missing blocks
Did not check for orphaned blocks
Total full LBM containers with extra space: 0 (0 repaired)
Total full LBM container extra space in bytes: 0 (0 repaired)
Total incomplete LBM containers: 0 (0 repaired)
Total LBM partial records: 0 (0 repaired)
Total corrupted LBM metadata records in RocksDB: 0 (0 repaired)
I20260924 08:03:07.796423 15396 rpc_server.cc:225] running with OpenSSL 1.1.1  11 Sep 2018
I20260924 08:03:07.800243 15396 env_posix.cc:2285] Not raising this process' running threads per effective uid limit of 18446744073709551615; it is already as high as it can go
I20260924 08:03:07.800817 15396 kserver.cc:163] Server-wide thread pool size limit: 3276
I20260924 08:03:07.802841 15396 ts_tablet_manager.cc:585] Loaded tablet metadata (0 total tablets, 0 live tablets)
I20260924 08:03:07.802910 15396 ts_tablet_manager.cc:531] Time spent load tablet metadata: real 0.000s	user 0.000s	sys 0.000s
I20260924 08:03:07.803002 15396 ts_tablet_manager.cc:616] Registered 0 tablets
I20260924 08:03:07.803031 15396 ts_tablet_manager.cc:595] Time spent register tablets: real 0.000s	user 0.001s	sys 0.000s
I20260924 08:03:07.821262 15396 rpc_server.cc:307] RPC server started. Bound to: 127.12.95.67:43311
I20260924 08:03:07.821336 15527 acceptor_pool.cc:272] collecting diagnostics on the listening RPC socket 127.12.95.67:43311 every 8 connection(s)
I20260924 08:03:07.828469 15396 server_base.cc:1193] Dumped server information to /tmp/dist-test-taskGoZl2g/test-tmp/ts_authz-itest.1.AuthzProviders_TSAuthzTxnOpsITest.BasicOperationsForAuthorizedUsers_Ranger.1790236757264992-12669-0/minicluster-data/ts-2/data/info.pb
Sep 24 08:03:07 dist-test-slave-hwwr krb5kdc[14396](info): TGS_REQ (2 etypes {17 16}) 127.0.0.1: ISSUE: authtime 1790236987, etypes {rep=17 tkt=17 ses=17}, kudu/127.12.95.67@KRBTEST.COM for kudu/127.12.95.126@KRBTEST.COM
I20260924 08:03:07.836983 12669 external_mini_cluster.cc:1434] Started /tmp/dist-test-taskGoZl2g/build/debug/bin/kudu as pid 15396
I20260924 08:03:07.837108 12669 external_mini_cluster.cc:1448] Reading /tmp/dist-test-taskGoZl2g/test-tmp/ts_authz-itest.1.AuthzProviders_TSAuthzTxnOpsITest.BasicOperationsForAuthorizedUsers_Ranger.1790236757264992-12669-0/minicluster-data/ts-2/wal/instance
I20260924 08:03:07.844548 15528 heartbeater.cc:344] Connected to a master server at 127.12.95.126:39495
I20260924 08:03:07.844846 15528 heartbeater.cc:461] Registering TS with master...
I20260924 08:03:07.845382 15528 heartbeater.cc:507] Master 127.12.95.126:39495 requested a full tablet report, sending...
I20260924 08:03:07.846509 15000 ts_manager.cc:194] Registered new tserver with Master: 767f11fc7f704090be0a663b948577bd (127.12.95.67:43311)
I20260924 08:03:07.847229 15000 master_service.cc:502] Signed X509 certificate for tserver {username='kudu', principal='kudu/127.12.95.67@KRBTEST.COM'} at 127.12.95.67:52825
I20260924 08:03:07.851511 12669 external_mini_cluster.cc:955] 3 TS(s) registered with all masters
WARNING: no policy specified for kudu@KRBTEST.COM; defaulting to no policy
Authenticating as principal test-admin/admin@KRBTEST.COM with password.
Principal "kudu@KRBTEST.COM" created.
Sep 24 08:03:07 dist-test-slave-hwwr krb5kdc[14396](info): AS_REQ (2 etypes {17 16}) 127.0.0.1: ISSUE: authtime 1790236987, etypes {rep=17 tkt=17 ses=17}, kudu@KRBTEST.COM for krbtgt/KRBTEST.COM@KRBTEST.COM
Password for kudu@KRBTEST.COM: 
I20260924 08:03:08.152441 15242 heartbeater.cc:499] Master 127.12.95.126:39495 was elected leader, sending a full tablet report...
Sep 24 08:03:08 dist-test-slave-hwwr krb5kdc[14396](info): TGS_REQ (1 etypes {17}) 127.0.0.1: ISSUE: authtime 1790236987, etypes {rep=17 tkt=17 ses=17}, kudu/127.12.95.126@KRBTEST.COM for HTTP/127.12.95.84@KRBTEST.COM
I20260924 08:03:08.352306 12669 mini_ranger.cc:389] Successfully created Ranger user: test-admin
I20260924 08:03:08.454145 15385 heartbeater.cc:499] Master 127.12.95.126:39495 was elected leader, sending a full tablet report...
I20260924 08:03:08.722048 15000 master_service.cc:977] request to refresh authz privileges cache from {username='test-admin', principal='test-admin@KRBTEST.COM'} at 127.0.0.1:56468
I20260924 08:03:08.849475 15528 heartbeater.cc:499] Master 127.12.95.126:39495 was elected leader, sending a full tablet report...
WARNING: no policy specified for test-admin@KRBTEST.COM; defaulting to no policy
add_principal: Principal or policy already exists while creating "test-admin@KRBTEST.COM".
Authenticating as principal kudu/admin@KRBTEST.COM with password.
Sep 24 08:03:09 dist-test-slave-hwwr krb5kdc[14396](info): AS_REQ (2 etypes {17 16}) 127.0.0.1: ISSUE: authtime 1790236989, etypes {rep=17 tkt=17 ses=17}, test-admin@KRBTEST.COM for krbtgt/KRBTEST.COM@KRBTEST.COM
Password for test-admin@KRBTEST.COM: 
Sep 24 08:03:09 dist-test-slave-hwwr krb5kdc[14396](info): TGS_REQ (2 etypes {17 16}) 127.0.0.1: ISSUE: authtime 1790236989, etypes {rep=17 tkt=17 ses=17}, test-admin@KRBTEST.COM for kudu/127.12.95.126@KRBTEST.COM
WARNING: no policy specified for user0@KRBTEST.COM; defaulting to no policy
Authenticating as principal test-admin/admin@KRBTEST.COM with password.
Principal "user0@KRBTEST.COM" created.
Sep 24 08:03:09 dist-test-slave-hwwr krb5kdc[14396](info): AS_REQ (2 etypes {17 16}) 127.0.0.1: ISSUE: authtime 1790236989, etypes {rep=17 tkt=17 ses=17}, user0@KRBTEST.COM for krbtgt/KRBTEST.COM@KRBTEST.COM
Password for user0@KRBTEST.COM: 
Sep 24 08:03:09 dist-test-slave-hwwr krb5kdc[14396](info): TGS_REQ (2 etypes {17 16}) 127.0.0.1: ISSUE: authtime 1790236989, etypes {rep=17 tkt=17 ses=17}, user0@KRBTEST.COM for kudu/127.12.95.126@KRBTEST.COM
I20260924 08:03:09.602806 15000 catalog_manager.cc:2296] Servicing CreateTable request from {username='test-admin', principal='test-admin@KRBTEST.COM'} at 127.0.0.1:56476:
name: "db.table_commit"
schema {
  columns {
    name: "col0"
    type: INT32
    is_key: true
    is_nullable: false
    encoding: AUTO_ENCODING
    compression: DEFAULT_COMPRESSION
    cfile_block_size: 0
    immutable: false
  }
  columns {
    name: "col1"
    type: INT32
    is_key: false
    is_nullable: true
    encoding: AUTO_ENCODING
    compression: DEFAULT_COMPRESSION
    cfile_block_size: 0
    immutable: false
  }
  columns {
    name: "col2"
    type: INT32
    is_key: false
    is_nullable: true
    encoding: AUTO_ENCODING
    compression: DEFAULT_COMPRESSION
    cfile_block_size: 0
    immutable: false
  }
}
num_replicas: 1
split_rows_range_bounds {
}
partition_schema {
  range_schema {
    columns {
      name: "col0"
    }
  }
}
owner: "user0"
I20260924 08:03:09.619343 15451 tablet_service.cc:1511] Processing CreateTablet for tablet a30cfcf4913849648754059ab9692aca (DEFAULT_TABLE table=db.table_commit [id=a863eb6ed7b140fb8d14a1be3637e644]), partition=RANGE (col0) PARTITION UNBOUNDED
I20260924 08:03:09.620298 15451 data_dirs.cc:400] Could only allocate 1 dirs of requested 3 for tablet a30cfcf4913849648754059ab9692aca. 1 dirs total, 0 dirs full, 0 dirs failed
I20260924 08:03:09.624985 15589 tablet_bootstrap.cc:492] T a30cfcf4913849648754059ab9692aca P 767f11fc7f704090be0a663b948577bd: Bootstrap starting.
I20260924 08:03:09.627501 15589 tablet_bootstrap.cc:654] T a30cfcf4913849648754059ab9692aca P 767f11fc7f704090be0a663b948577bd: Neither blocks nor log segments found. Creating new log.
I20260924 08:03:09.628410 15589 log.cc:826] T a30cfcf4913849648754059ab9692aca P 767f11fc7f704090be0a663b948577bd: Log is configured to *not* fsync() on all Append() calls
I20260924 08:03:09.630286 15589 tablet_bootstrap.cc:492] T a30cfcf4913849648754059ab9692aca P 767f11fc7f704090be0a663b948577bd: No bootstrap required, opened a new log
I20260924 08:03:09.630502 15589 ts_tablet_manager.cc:1403] T a30cfcf4913849648754059ab9692aca P 767f11fc7f704090be0a663b948577bd: Time spent bootstrapping tablet: real 0.006s	user 0.004s	sys 0.000s
I20260924 08:03:09.633800 15589 raft_consensus.cc:359] T a30cfcf4913849648754059ab9692aca P 767f11fc7f704090be0a663b948577bd [term 0 FOLLOWER]: Replica starting. Triggering 0 pending ops. Active config: opid_index: -1 OBSOLETE_local: true peers { permanent_uuid: "767f11fc7f704090be0a663b948577bd" member_type: VOTER last_known_addr { host: "127.12.95.67" port: 43311 } }
I20260924 08:03:09.633982 15589 raft_consensus.cc:385] T a30cfcf4913849648754059ab9692aca P 767f11fc7f704090be0a663b948577bd [term 0 FOLLOWER]: Consensus starting up: Expiring failure detector timer to make a prompt election more likely
I20260924 08:03:09.634047 15589 raft_consensus.cc:740] T a30cfcf4913849648754059ab9692aca P 767f11fc7f704090be0a663b948577bd [term 0 FOLLOWER]: Becoming Follower/Learner. State: Replica: 767f11fc7f704090be0a663b948577bd, State: Initialized, Role: FOLLOWER
I20260924 08:03:09.634471 15589 consensus_queue.cc:260] T a30cfcf4913849648754059ab9692aca P 767f11fc7f704090be0a663b948577bd [NON_LEADER]: Queue going to NON_LEADER mode. State: All replicated index: 0, Majority replicated index: 0, Committed index: 0, Last appended: 0.0, Last appended by leader: 0, Current term: 0, Majority size: -1, State: 0, Mode: NON_LEADER, active raft config: opid_index: -1 OBSOLETE_local: true peers { permanent_uuid: "767f11fc7f704090be0a663b948577bd" member_type: VOTER last_known_addr { host: "127.12.95.67" port: 43311 } }
I20260924 08:03:09.634616 15589 raft_consensus.cc:399] T a30cfcf4913849648754059ab9692aca P 767f11fc7f704090be0a663b948577bd [term 0 FOLLOWER]: Only one voter in the Raft config. Triggering election immediately
I20260924 08:03:09.634698 15589 raft_consensus.cc:493] T a30cfcf4913849648754059ab9692aca P 767f11fc7f704090be0a663b948577bd [term 0 FOLLOWER]: Starting leader election (initial election of a single-replica configuration)
I20260924 08:03:09.634784 15589 raft_consensus.cc:3060] T a30cfcf4913849648754059ab9692aca P 767f11fc7f704090be0a663b948577bd [term 0 FOLLOWER]: Advancing to term 1
I20260924 08:03:09.635586 15589 raft_consensus.cc:515] T a30cfcf4913849648754059ab9692aca P 767f11fc7f704090be0a663b948577bd [term 1 FOLLOWER]: Starting leader election with config: opid_index: -1 OBSOLETE_local: true peers { permanent_uuid: "767f11fc7f704090be0a663b948577bd" member_type: VOTER last_known_addr { host: "127.12.95.67" port: 43311 } }
I20260924 08:03:09.635876 15589 leader_election.cc:304] T a30cfcf4913849648754059ab9692aca P 767f11fc7f704090be0a663b948577bd [CANDIDATE]: Term 1 election: Election decided. Result: candidate won. Election summary: received 1 responses out of 1 voters: 1 yes votes; 0 no votes. yes voters: 767f11fc7f704090be0a663b948577bd; no voters: 
I20260924 08:03:09.636101 15589 leader_election.cc:290] T a30cfcf4913849648754059ab9692aca P 767f11fc7f704090be0a663b948577bd [CANDIDATE]: Term 1 election: Requested vote from peers 
I20260924 08:03:09.636216 15591 raft_consensus.cc:2804] T a30cfcf4913849648754059ab9692aca P 767f11fc7f704090be0a663b948577bd [term 1 FOLLOWER]: Leader election won for term 1
I20260924 08:03:09.636466 15591 raft_consensus.cc:697] T a30cfcf4913849648754059ab9692aca P 767f11fc7f704090be0a663b948577bd [term 1 LEADER]: Becoming Leader. State: Replica: 767f11fc7f704090be0a663b948577bd, State: Running, Role: LEADER
I20260924 08:03:09.636746 15591 consensus_queue.cc:237] T a30cfcf4913849648754059ab9692aca P 767f11fc7f704090be0a663b948577bd [LEADER]: Queue going to LEADER mode. State: All replicated index: 0, Majority replicated index: 0, Committed index: 0, Last appended: 0.0, Last appended by leader: 0, Current term: 1, Majority size: 1, State: 0, Mode: LEADER, active raft config: opid_index: -1 OBSOLETE_local: true peers { permanent_uuid: "767f11fc7f704090be0a663b948577bd" member_type: VOTER last_known_addr { host: "127.12.95.67" port: 43311 } }
I20260924 08:03:09.637035 15589 ts_tablet_manager.cc:1434] T a30cfcf4913849648754059ab9692aca P 767f11fc7f704090be0a663b948577bd: Time spent starting tablet: real 0.006s	user 0.007s	sys 0.000s
I20260924 08:03:09.640182 15000 catalog_manager.cc:5838] T a30cfcf4913849648754059ab9692aca P 767f11fc7f704090be0a663b948577bd reported cstate change: term changed from 0 to 1, leader changed from <none> to 767f11fc7f704090be0a663b948577bd (127.12.95.67). New cstate: current_term: 1 leader_uuid: "767f11fc7f704090be0a663b948577bd" committed_config { opid_index: -1 OBSOLETE_local: true peers { permanent_uuid: "767f11fc7f704090be0a663b948577bd" member_type: VOTER last_known_addr { host: "127.12.95.67" port: 43311 } health_report { overall_health: HEALTHY } } }
I20260924 08:03:09.713267 12669 mini_ranger.cc:389] Successfully created Ranger user: user0
I20260924 08:03:09.854970 15000 master_service.cc:977] request to refresh authz privileges cache from {username='test-admin', principal='test-admin@KRBTEST.COM'} at 127.0.0.1:56468
I20260924 08:03:10.045290 12669 mini_ranger.cc:375] User user0 already exists in Ranger, moving on.
I20260924 08:03:10.174839 15000 master_service.cc:977] request to refresh authz privileges cache from {username='test-admin', principal='test-admin@KRBTEST.COM'} at 127.0.0.1:56468
Sep 24 08:03:10 dist-test-slave-hwwr krb5kdc[14396](info): TGS_REQ (2 etypes {17 16}) 127.0.0.1: ISSUE: authtime 1790236986, etypes {rep=17 tkt=17 ses=17}, kudu/127.12.95.126@KRBTEST.COM for kudu/127.12.95.126@KRBTEST.COM
I20260924 08:03:10.411268 15000 catalog_manager.cc:2296] Servicing CreateTable request from {username='kudu', principal='kudu/127.12.95.126@KRBTEST.COM'} at 127.0.0.1:56500:
name: "kudu_system.kudu_transactions"
schema {
  columns {
    name: "txn_id"
    type: INT64
    is_key: true
    is_nullable: false
    encoding: AUTO_ENCODING
    compression: DEFAULT_COMPRESSION
    cfile_block_size: 0
    immutable: false
  }
  columns {
    name: "entry_type"
    type: INT8
    is_key: true
    is_nullable: false
    encoding: AUTO_ENCODING
    compression: DEFAULT_COMPRESSION
    cfile_block_size: 0
    immutable: false
  }
  columns {
    name: "identifier"
    type: STRING
    is_key: true
    is_nullable: false
    encoding: AUTO_ENCODING
    compression: DEFAULT_COMPRESSION
    cfile_block_size: 0
    immutable: false
  }
  columns {
    name: "metadata"
    type: STRING
    is_key: false
    is_nullable: false
    encoding: AUTO_ENCODING
    compression: DEFAULT_COMPRESSION
    cfile_block_size: 0
    immutable: false
  }
}
num_replicas: 1
split_rows_range_bounds {
  rows: "<redacted>""\006\001\000\000\000\000\000\000\000\000\007\001@B\017\000\000\000\000\000"
  indirect_data: "<redacted>"""
}
partition_schema {
  range_schema {
    columns {
      name: "txn_id"
    }
  }
}
table_type: TXN_STATUS_TABLE
I20260924 08:03:10.422482 15313 tablet_service.cc:1511] Processing CreateTablet for tablet 967347c2dd874849a083e6ee9d343a8a (TXN_STATUS_TABLE table=kudu_system.kudu_transactions [id=cdc73e5486084cb4ab4a54d0d4011e1c]), partition=RANGE (txn_id) PARTITION 0 <= VALUES < 1000000
I20260924 08:03:10.423584 15313 data_dirs.cc:400] Could only allocate 1 dirs of requested 3 for tablet 967347c2dd874849a083e6ee9d343a8a. 1 dirs total, 0 dirs full, 0 dirs failed
I20260924 08:03:10.428670 15617 tablet_bootstrap.cc:492] T 967347c2dd874849a083e6ee9d343a8a P b7966cba6ae04b6eab79454d42cadefe: Bootstrap starting.
I20260924 08:03:10.430619 15617 tablet_bootstrap.cc:654] T 967347c2dd874849a083e6ee9d343a8a P b7966cba6ae04b6eab79454d42cadefe: Neither blocks nor log segments found. Creating new log.
I20260924 08:03:10.431268 15617 log.cc:826] T 967347c2dd874849a083e6ee9d343a8a P b7966cba6ae04b6eab79454d42cadefe: Log is configured to *not* fsync() on all Append() calls
I20260924 08:03:10.432688 15617 tablet_bootstrap.cc:492] T 967347c2dd874849a083e6ee9d343a8a P b7966cba6ae04b6eab79454d42cadefe: No bootstrap required, opened a new log
I20260924 08:03:10.432881 15617 ts_tablet_manager.cc:1403] T 967347c2dd874849a083e6ee9d343a8a P b7966cba6ae04b6eab79454d42cadefe: Time spent bootstrapping tablet: real 0.004s	user 0.000s	sys 0.003s
I20260924 08:03:10.435701 15617 raft_consensus.cc:359] T 967347c2dd874849a083e6ee9d343a8a P b7966cba6ae04b6eab79454d42cadefe [term 0 FOLLOWER]: Replica starting. Triggering 0 pending ops. Active config: opid_index: -1 OBSOLETE_local: true peers { permanent_uuid: "b7966cba6ae04b6eab79454d42cadefe" member_type: VOTER last_known_addr { host: "127.12.95.66" port: 39011 } }
I20260924 08:03:10.435865 15617 raft_consensus.cc:385] T 967347c2dd874849a083e6ee9d343a8a P b7966cba6ae04b6eab79454d42cadefe [term 0 FOLLOWER]: Consensus starting up: Expiring failure detector timer to make a prompt election more likely
I20260924 08:03:10.435906 15617 raft_consensus.cc:740] T 967347c2dd874849a083e6ee9d343a8a P b7966cba6ae04b6eab79454d42cadefe [term 0 FOLLOWER]: Becoming Follower/Learner. State: Replica: b7966cba6ae04b6eab79454d42cadefe, State: Initialized, Role: FOLLOWER
I20260924 08:03:10.436247 15617 consensus_queue.cc:260] T 967347c2dd874849a083e6ee9d343a8a P b7966cba6ae04b6eab79454d42cadefe [NON_LEADER]: Queue going to NON_LEADER mode. State: All replicated index: 0, Majority replicated index: 0, Committed index: 0, Last appended: 0.0, Last appended by leader: 0, Current term: 0, Majority size: -1, State: 0, Mode: NON_LEADER, active raft config: opid_index: -1 OBSOLETE_local: true peers { permanent_uuid: "b7966cba6ae04b6eab79454d42cadefe" member_type: VOTER last_known_addr { host: "127.12.95.66" port: 39011 } }
I20260924 08:03:10.436371 15619 raft_consensus.cc:493] T 967347c2dd874849a083e6ee9d343a8a P b7966cba6ae04b6eab79454d42cadefe [term 0 FOLLOWER]: Starting pre-election (no leader contacted us within the election timeout)
I20260924 08:03:10.436522 15619 raft_consensus.cc:515] T 967347c2dd874849a083e6ee9d343a8a P b7966cba6ae04b6eab79454d42cadefe [term 0 FOLLOWER]: Starting pre-election with config: opid_index: -1 OBSOLETE_local: true peers { permanent_uuid: "b7966cba6ae04b6eab79454d42cadefe" member_type: VOTER last_known_addr { host: "127.12.95.66" port: 39011 } }
I20260924 08:03:10.436828 15617 raft_consensus.cc:399] T 967347c2dd874849a083e6ee9d343a8a P b7966cba6ae04b6eab79454d42cadefe [term 0 FOLLOWER]: Only one voter in the Raft config. Triggering election immediately
I20260924 08:03:10.436829 15619 leader_election.cc:304] T 967347c2dd874849a083e6ee9d343a8a P b7966cba6ae04b6eab79454d42cadefe [CANDIDATE]: Term 1 pre-election: Election decided. Result: candidate won. Election summary: received 1 responses out of 1 voters: 1 yes votes; 0 no votes. yes voters: b7966cba6ae04b6eab79454d42cadefe; no voters: 
I20260924 08:03:10.436949 15617 raft_consensus.cc:493] T 967347c2dd874849a083e6ee9d343a8a P b7966cba6ae04b6eab79454d42cadefe [term 0 FOLLOWER]: Starting leader election (initial election of a single-replica configuration)
I20260924 08:03:10.437012 15617 raft_consensus.cc:3060] T 967347c2dd874849a083e6ee9d343a8a P b7966cba6ae04b6eab79454d42cadefe [term 0 FOLLOWER]: Advancing to term 1
I20260924 08:03:10.437214 15619 leader_election.cc:290] T 967347c2dd874849a083e6ee9d343a8a P b7966cba6ae04b6eab79454d42cadefe [CANDIDATE]: Term 1 pre-election: Requested pre-vote from peers 
I20260924 08:03:10.437901 15617 raft_consensus.cc:515] T 967347c2dd874849a083e6ee9d343a8a P b7966cba6ae04b6eab79454d42cadefe [term 1 FOLLOWER]: Starting leader election with config: opid_index: -1 OBSOLETE_local: true peers { permanent_uuid: "b7966cba6ae04b6eab79454d42cadefe" member_type: VOTER last_known_addr { host: "127.12.95.66" port: 39011 } }
I20260924 08:03:10.438050 15617 leader_election.cc:304] T 967347c2dd874849a083e6ee9d343a8a P b7966cba6ae04b6eab79454d42cadefe [CANDIDATE]: Term 1 election: Election decided. Result: candidate won. Election summary: received 1 responses out of 1 voters: 1 yes votes; 0 no votes. yes voters: b7966cba6ae04b6eab79454d42cadefe; no voters: 
I20260924 08:03:10.438093 15620 raft_consensus.cc:2764] T 967347c2dd874849a083e6ee9d343a8a P b7966cba6ae04b6eab79454d42cadefe [term 1 FOLLOWER]: Leader pre-election decision vote started in defunct term 0: won
I20260924 08:03:10.438171 15617 leader_election.cc:290] T 967347c2dd874849a083e6ee9d343a8a P b7966cba6ae04b6eab79454d42cadefe [CANDIDATE]: Term 1 election: Requested vote from peers 
I20260924 08:03:10.438355 15619 raft_consensus.cc:2804] T 967347c2dd874849a083e6ee9d343a8a P b7966cba6ae04b6eab79454d42cadefe [term 1 FOLLOWER]: Leader election won for term 1
I20260924 08:03:10.438468 15619 raft_consensus.cc:697] T 967347c2dd874849a083e6ee9d343a8a P b7966cba6ae04b6eab79454d42cadefe [term 1 LEADER]: Becoming Leader. State: Replica: b7966cba6ae04b6eab79454d42cadefe, State: Running, Role: LEADER
I20260924 08:03:10.438786 15619 consensus_queue.cc:237] T 967347c2dd874849a083e6ee9d343a8a P b7966cba6ae04b6eab79454d42cadefe [LEADER]: Queue going to LEADER mode. State: All replicated index: 0, Majority replicated index: 0, Committed index: 0, Last appended: 0.0, Last appended by leader: 0, Current term: 1, Majority size: 1, State: 0, Mode: LEADER, active raft config: opid_index: -1 OBSOLETE_local: true peers { permanent_uuid: "b7966cba6ae04b6eab79454d42cadefe" member_type: VOTER last_known_addr { host: "127.12.95.66" port: 39011 } }
I20260924 08:03:10.438920 15617 ts_tablet_manager.cc:1434] T 967347c2dd874849a083e6ee9d343a8a P b7966cba6ae04b6eab79454d42cadefe: Time spent starting tablet: real 0.006s	user 0.005s	sys 0.001s
I20260924 08:03:10.440384 15621 tablet_replica.cc:442] T 967347c2dd874849a083e6ee9d343a8a P b7966cba6ae04b6eab79454d42cadefe: TxnStatusTablet state changed. Reason: New leader b7966cba6ae04b6eab79454d42cadefe. Latest consensus state: current_term: 1 leader_uuid: "b7966cba6ae04b6eab79454d42cadefe" committed_config { opid_index: -1 OBSOLETE_local: true peers { permanent_uuid: "b7966cba6ae04b6eab79454d42cadefe" member_type: VOTER last_known_addr { host: "127.12.95.66" port: 39011 } } }
I20260924 08:03:10.440567 15621 tablet_replica.cc:445] T 967347c2dd874849a083e6ee9d343a8a P b7966cba6ae04b6eab79454d42cadefe: This TxnStatusTablet replica's current role is: LEADER
I20260924 08:03:10.440644 15620 tablet_replica.cc:442] T 967347c2dd874849a083e6ee9d343a8a P b7966cba6ae04b6eab79454d42cadefe: TxnStatusTablet state changed. Reason: RaftConsensus started. Latest consensus state: current_term: 1 leader_uuid: "b7966cba6ae04b6eab79454d42cadefe" committed_config { opid_index: -1 OBSOLETE_local: true peers { permanent_uuid: "b7966cba6ae04b6eab79454d42cadefe" member_type: VOTER last_known_addr { host: "127.12.95.66" port: 39011 } } }
I20260924 08:03:10.440724 15620 tablet_replica.cc:445] T 967347c2dd874849a083e6ee9d343a8a P b7966cba6ae04b6eab79454d42cadefe: This TxnStatusTablet replica's current role is: LEADER
I20260924 08:03:10.441329 15623 txn_status_manager.cc:874] Waiting until node catch up with all replicated operations in previous term...
I20260924 08:03:10.441551 15623 txn_status_manager.cc:930] Loading transaction status metadata into memory...
I20260924 08:03:10.442042 15000 catalog_manager.cc:5838] T 967347c2dd874849a083e6ee9d343a8a P b7966cba6ae04b6eab79454d42cadefe reported cstate change: term changed from 0 to 1, leader changed from <none> to b7966cba6ae04b6eab79454d42cadefe (127.12.95.66). New cstate: current_term: 1 leader_uuid: "b7966cba6ae04b6eab79454d42cadefe" committed_config { opid_index: -1 OBSOLETE_local: true peers { permanent_uuid: "b7966cba6ae04b6eab79454d42cadefe" member_type: VOTER last_known_addr { host: "127.12.95.66" port: 39011 } health_report { overall_health: HEALTHY } } }
I20260924 08:03:10.535698 15000 catalog_manager.cc:2296] Servicing CreateTable request from {username='test-admin', principal='test-admin@KRBTEST.COM'} at 127.0.0.1:56476:
name: "db.table_rollback"
schema {
  columns {
    name: "col0"
    type: INT32
    is_key: true
    is_nullable: false
    encoding: AUTO_ENCODING
    compression: DEFAULT_COMPRESSION
    cfile_block_size: 0
    immutable: false
  }
  columns {
    name: "col1"
    type: INT32
    is_key: false
    is_nullable: true
    encoding: AUTO_ENCODING
    compression: DEFAULT_COMPRESSION
    cfile_block_size: 0
    immutable: false
  }
  columns {
    name: "col2"
    type: INT32
    is_key: false
    is_nullable: true
    encoding: AUTO_ENCODING
    compression: DEFAULT_COMPRESSION
    cfile_block_size: 0
    immutable: false
  }
}
num_replicas: 1
split_rows_range_bounds {
}
partition_schema {
  range_schema {
    columns {
      name: "col0"
    }
  }
}
owner: "user0"
I20260924 08:03:10.549649 15176 tablet_service.cc:1511] Processing CreateTablet for tablet f79d8948850d4883af245a84eabdef0b (DEFAULT_TABLE table=db.table_rollback [id=633854710ab64ae3ab06bb572fe396a6]), partition=RANGE (col0) PARTITION UNBOUNDED
I20260924 08:03:10.550693 15176 data_dirs.cc:400] Could only allocate 1 dirs of requested 3 for tablet f79d8948850d4883af245a84eabdef0b. 1 dirs total, 0 dirs full, 0 dirs failed
I20260924 08:03:10.556689 15642 tablet_bootstrap.cc:492] T f79d8948850d4883af245a84eabdef0b P f4ca9de34c04483d80815fccb5714828: Bootstrap starting.
I20260924 08:03:10.559224 15642 tablet_bootstrap.cc:654] T f79d8948850d4883af245a84eabdef0b P f4ca9de34c04483d80815fccb5714828: Neither blocks nor log segments found. Creating new log.
I20260924 08:03:10.560039 15642 log.cc:826] T f79d8948850d4883af245a84eabdef0b P f4ca9de34c04483d80815fccb5714828: Log is configured to *not* fsync() on all Append() calls
I20260924 08:03:10.561877 15642 tablet_bootstrap.cc:492] T f79d8948850d4883af245a84eabdef0b P f4ca9de34c04483d80815fccb5714828: No bootstrap required, opened a new log
I20260924 08:03:10.562065 15642 ts_tablet_manager.cc:1403] T f79d8948850d4883af245a84eabdef0b P f4ca9de34c04483d80815fccb5714828: Time spent bootstrapping tablet: real 0.006s	user 0.005s	sys 0.000s
I20260924 08:03:10.565662 15642 raft_consensus.cc:359] T f79d8948850d4883af245a84eabdef0b P f4ca9de34c04483d80815fccb5714828 [term 0 FOLLOWER]: Replica starting. Triggering 0 pending ops. Active config: opid_index: -1 OBSOLETE_local: true peers { permanent_uuid: "f4ca9de34c04483d80815fccb5714828" member_type: VOTER last_known_addr { host: "127.12.95.65" port: 44043 } }
I20260924 08:03:10.565863 15642 raft_consensus.cc:385] T f79d8948850d4883af245a84eabdef0b P f4ca9de34c04483d80815fccb5714828 [term 0 FOLLOWER]: Consensus starting up: Expiring failure detector timer to make a prompt election more likely
I20260924 08:03:10.565997 15642 raft_consensus.cc:740] T f79d8948850d4883af245a84eabdef0b P f4ca9de34c04483d80815fccb5714828 [term 0 FOLLOWER]: Becoming Follower/Learner. State: Replica: f4ca9de34c04483d80815fccb5714828, State: Initialized, Role: FOLLOWER
I20260924 08:03:10.566434 15642 consensus_queue.cc:260] T f79d8948850d4883af245a84eabdef0b P f4ca9de34c04483d80815fccb5714828 [NON_LEADER]: Queue going to NON_LEADER mode. State: All replicated index: 0, Majority replicated index: 0, Committed index: 0, Last appended: 0.0, Last appended by leader: 0, Current term: 0, Majority size: -1, State: 0, Mode: NON_LEADER, active raft config: opid_index: -1 OBSOLETE_local: true peers { permanent_uuid: "f4ca9de34c04483d80815fccb5714828" member_type: VOTER last_known_addr { host: "127.12.95.65" port: 44043 } }
I20260924 08:03:10.566581 15642 raft_consensus.cc:399] T f79d8948850d4883af245a84eabdef0b P f4ca9de34c04483d80815fccb5714828 [term 0 FOLLOWER]: Only one voter in the Raft config. Triggering election immediately
I20260924 08:03:10.566640 15642 raft_consensus.cc:493] T f79d8948850d4883af245a84eabdef0b P f4ca9de34c04483d80815fccb5714828 [term 0 FOLLOWER]: Starting leader election (initial election of a single-replica configuration)
I20260924 08:03:10.566715 15642 raft_consensus.cc:3060] T f79d8948850d4883af245a84eabdef0b P f4ca9de34c04483d80815fccb5714828 [term 0 FOLLOWER]: Advancing to term 1
I20260924 08:03:10.567669 15642 raft_consensus.cc:515] T f79d8948850d4883af245a84eabdef0b P f4ca9de34c04483d80815fccb5714828 [term 1 FOLLOWER]: Starting leader election with config: opid_index: -1 OBSOLETE_local: true peers { permanent_uuid: "f4ca9de34c04483d80815fccb5714828" member_type: VOTER last_known_addr { host: "127.12.95.65" port: 44043 } }
I20260924 08:03:10.568007 15642 leader_election.cc:304] T f79d8948850d4883af245a84eabdef0b P f4ca9de34c04483d80815fccb5714828 [CANDIDATE]: Term 1 election: Election decided. Result: candidate won. Election summary: received 1 responses out of 1 voters: 1 yes votes; 0 no votes. yes voters: f4ca9de34c04483d80815fccb5714828; no voters: 
I20260924 08:03:10.568279 15642 leader_election.cc:290] T f79d8948850d4883af245a84eabdef0b P f4ca9de34c04483d80815fccb5714828 [CANDIDATE]: Term 1 election: Requested vote from peers 
I20260924 08:03:10.568442 15644 raft_consensus.cc:2804] T f79d8948850d4883af245a84eabdef0b P f4ca9de34c04483d80815fccb5714828 [term 1 FOLLOWER]: Leader election won for term 1
I20260924 08:03:10.568691 15644 raft_consensus.cc:697] T f79d8948850d4883af245a84eabdef0b P f4ca9de34c04483d80815fccb5714828 [term 1 LEADER]: Becoming Leader. State: Replica: f4ca9de34c04483d80815fccb5714828, State: Running, Role: LEADER
I20260924 08:03:10.569051 15644 consensus_queue.cc:237] T f79d8948850d4883af245a84eabdef0b P f4ca9de34c04483d80815fccb5714828 [LEADER]: Queue going to LEADER mode. State: All replicated index: 0, Majority replicated index: 0, Committed index: 0, Last appended: 0.0, Last appended by leader: 0, Current term: 1, Majority size: 1, State: 0, Mode: LEADER, active raft config: opid_index: -1 OBSOLETE_local: true peers { permanent_uuid: "f4ca9de34c04483d80815fccb5714828" member_type: VOTER last_known_addr { host: "127.12.95.65" port: 44043 } }
I20260924 08:03:10.569151 15642 ts_tablet_manager.cc:1434] T f79d8948850d4883af245a84eabdef0b P f4ca9de34c04483d80815fccb5714828: Time spent starting tablet: real 0.007s	user 0.007s	sys 0.000s
I20260924 08:03:10.573799 15000 catalog_manager.cc:5838] T f79d8948850d4883af245a84eabdef0b P f4ca9de34c04483d80815fccb5714828 reported cstate change: term changed from 0 to 1, leader changed from <none> to f4ca9de34c04483d80815fccb5714828 (127.12.95.65). New cstate: current_term: 1 leader_uuid: "f4ca9de34c04483d80815fccb5714828" committed_config { opid_index: -1 OBSOLETE_local: true peers { permanent_uuid: "f4ca9de34c04483d80815fccb5714828" member_type: VOTER last_known_addr { host: "127.12.95.65" port: 44043 } health_report { overall_health: HEALTHY } } }
I20260924 08:03:10.608657 12669 mini_ranger.cc:375] User user0 already exists in Ranger, moving on.
I20260924 08:03:10.755095 15000 master_service.cc:977] request to refresh authz privileges cache from {username='test-admin', principal='test-admin@KRBTEST.COM'} at 127.0.0.1:56468
I20260924 08:03:10.912519 12669 mini_ranger.cc:375] User user0 already exists in Ranger, moving on.
I20260924 08:03:11.016047 15000 master_service.cc:977] request to refresh authz privileges cache from {username='test-admin', principal='test-admin@KRBTEST.COM'} at 127.0.0.1:56468
I20260924 08:03:11.296742 12669 external_mini_cluster.cc:1664] Killing /tmp/dist-test-taskGoZl2g/build/debug/bin/kudu with pid 15106
I20260924 08:03:11.303655 12669 external_mini_cluster.cc:1664] Killing /tmp/dist-test-taskGoZl2g/build/debug/bin/kudu with pid 15253
I20260924 08:03:11.312597 12669 external_mini_cluster.cc:1664] Killing /tmp/dist-test-taskGoZl2g/build/debug/bin/kudu with pid 15396
I20260924 08:03:11.319271 12669 external_mini_cluster.cc:1664] Killing /tmp/dist-test-taskGoZl2g/build/debug/bin/kudu with pid 14969
I20260924 08:03:11.328977 12669 mini_ranger.cc:67] Stopping Ranger...
I20260924 08:03:11.685388 12669 mini_ranger.cc:69] Stopped Ranger
2026-09-24 08:03:11.685 UTC [14427] LOG:  received smart shutdown request
2026-09-24 08:03:11.689 UTC [14427] LOG:  background worker "logical replication launcher" (PID 14435) exited with exit code 1
2026-09-24 08:03:11.690 UTC [14430] LOG:  shutting down
2026-09-24 08:03:11.691 UTC [14430] LOG:  checkpoint starting: shutdown immediate
2026-09-24 08:03:12.167 UTC [14430] LOG:  checkpoint complete: wrote 1559 buffers (9.5%); 0 WAL file(s) added, 0 removed, 0 recycled; write=0.025 s, sync=0.447 s, total=0.478 s; sync files=833, longest=0.005 s, average=0.001 s; distance=8496 kB, estimate=8496 kB; lsn=0/1CC6BD0, redo lsn=0/1CC6BD0
2026-09-24 08:03:12.175 UTC [14427] LOG:  database system is shut down
2026-09-24T08:03:12Z chronyd exiting
[       OK ] AuthzProviders/TSAuthzTxnOpsITest.BasicOperationsForAuthorizedUsers/Ranger (47756 ms)
[----------] 1 test from AuthzProviders/TSAuthzTxnOpsITest (47756 ms total)

[----------] Global test environment tear-down
[==========] 3 tests from 2 test suites ran. (234996 ms total)
[  PASSED  ] 2 tests.
[  FAILED  ] 1 test, listed below:
[  FAILED  ] AuthzProviders/TSAuthzITest.Kudu3661/Ranger, where GetParam() = 0

 1 FAILED TEST