Diagnosed failure
Parameters/TestRpc.TestCallWithChainCertAndChainCA/SSL_UnixSocket: /data0/somelongdirectorytoavoidrpathissues/src/kudu/src/kudu/rpc/rpc-test.cc:270: Failure
Failed
Bad status: Runtime error: could not verify certificate chain (error with cert: subject=CN = localhost, ST = sadfjas, C = AS, emailAddress = sdflkdsajf, O = lskdfjlsad, OU = sldfkja, issuer=C = AS, ST = ASDfkjdhf, L = lskdjf, O = saldfja, OU = skdjf, CN = localhost, emailAddress = sadjflkadsj): : certificate has expired
Google Test trace:
/data0/somelongdirectorytoavoidrpathissues/src/kudu/src/kudu/rpc/rpc-test.cc:267: Connecting to unix:/tmp/dist-test-taskhCIHNK/test-tmp/rpc-test-8ff15086224343ed9d210cd0355c7abc.sock
I20260923 14:37:34.093155 13402 test_util.cc:175] -----------------------------------------------
I20260923 14:37:34.093227 13402 test_util.cc:176] Had fatal failures, leaving test files at /tmp/dist-test-taskhCIHNK/test-tmp/rpc-test.6.Parameters_TestRpc.TestCallWithChainCertAndChainCA_SSL_UnixSocket.1790174254037504-13402-0
Full log
Note: This is test shard 7 of 8.
[==========] Running 21 tests from 2 test suites.
[----------] Global test environment set-up.
[----------] 20 tests from Parameters/TestRpc
[ RUN ] Parameters/TestRpc.TestMessengerCreateDestroy/SSL_UnixSocket
WARNING: Logging before InitGoogleLogging() is written to STDERR
I20260923 14:37:34.059862 13402 rpc-test.cc:169] started messenger TestCreateDestroy
[ OK ] Parameters/TestRpc.TestMessengerCreateDestroy/SSL_UnixSocket (17 ms)
[ RUN ] Parameters/TestRpc.TestNegotiationDeadlock/SSL_UnixSocket
I20260923 14:37:34.071633 13422 acceptor_pool.cc:254] collecting diagnostics on the listening RPC socket unix:/tmp/dist-test-taskhCIHNK/test-tmp/rpc-test-ec21b89d2b704ce2b4a568ea81772090.sock every 8 connection(s)
I20260923 14:37:34.071686 13423 acceptor_pool.cc:254] collecting diagnostics on the listening RPC socket unix:/tmp/dist-test-taskhCIHNK/test-tmp/rpc-test-ec21b89d2b704ce2b4a568ea81772090.sock every 8 connection(s)
[ OK ] Parameters/TestRpc.TestNegotiationDeadlock/SSL_UnixSocket (20 ms)
[ RUN ] Parameters/TestRpc.TestCallWithChainCertAndChainCA/SSL_UnixSocket
I20260923 14:37:34.088368 13439 acceptor_pool.cc:254] collecting diagnostics on the listening RPC socket unix:/tmp/dist-test-taskhCIHNK/test-tmp/rpc-test-8ff15086224343ed9d210cd0355c7abc.sock every 8 connection(s)
I20260923 14:37:34.088438 13440 acceptor_pool.cc:254] collecting diagnostics on the listening RPC socket unix:/tmp/dist-test-taskhCIHNK/test-tmp/rpc-test-8ff15086224343ed9d210cd0355c7abc.sock every 8 connection(s)
/data0/somelongdirectorytoavoidrpathissues/src/kudu/src/kudu/rpc/rpc-test.cc:270: Failure
Failed
Bad status: Runtime error: could not verify certificate chain (error with cert: subject=CN = localhost, ST = sadfjas, C = AS, emailAddress = sdflkdsajf, O = lskdfjlsad, OU = sldfkja, issuer=C = AS, ST = ASDfkjdhf, L = lskdjf, O = saldfja, OU = skdjf, CN = localhost, emailAddress = sadjflkadsj): : certificate has expired
Google Test trace:
/data0/somelongdirectorytoavoidrpathissues/src/kudu/src/kudu/rpc/rpc-test.cc:267: Connecting to unix:/tmp/dist-test-taskhCIHNK/test-tmp/rpc-test-8ff15086224343ed9d210cd0355c7abc.sock
I20260923 14:37:34.093155 13402 test_util.cc:175] -----------------------------------------------
I20260923 14:37:34.093227 13402 test_util.cc:176] Had fatal failures, leaving test files at /tmp/dist-test-taskhCIHNK/test-tmp/rpc-test.6.Parameters_TestRpc.TestCallWithChainCertAndChainCA_SSL_UnixSocket.1790174254037504-13402-0
[ FAILED ] Parameters/TestRpc.TestCallWithChainCertAndChainCA/SSL_UnixSocket, where GetParam() = (true, true) (11 ms)
[ RUN ] Parameters/TestRpc.TestCallWithPasswordProtectedKey/SSL_UnixSocket
I20260923 14:37:34.121111 13465 acceptor_pool.cc:254] collecting diagnostics on the listening RPC socket unix:/tmp/dist-test-taskhCIHNK/test-tmp/rpc-test-6aa41d4611f64f69ac958aec55ce7ab5.sock every 8 connection(s)
I20260923 14:37:34.121150 13464 acceptor_pool.cc:254] collecting diagnostics on the listening RPC socket unix:/tmp/dist-test-taskhCIHNK/test-tmp/rpc-test-6aa41d4611f64f69ac958aec55ce7ab5.sock every 8 connection(s)
W20260923 14:37:34.135901 13461 connection.cc:196] Error closing socket: Network error: TlsSocket::Close: Broken pipe
[ OK ] Parameters/TestRpc.TestCallWithPasswordProtectedKey/SSL_UnixSocket (44 ms)
[ RUN ] Parameters/TestRpc.TestCallToBadServer/SSL_UnixSocket
I20260923 14:37:34.142005 13402 rpc-test.cc:394] Status: Network error: Client connection negotiation failed: client connection to 0.0.0.0:0: connect: Connection refused (error 111)
I20260923 14:37:34.142411 13402 rpc-test.cc:394] Status: Network error: Client connection negotiation failed: client connection to 0.0.0.0:0: connect: Connection refused (error 111)
I20260923 14:37:34.142803 13402 rpc-test.cc:394] Status: Network error: Client connection negotiation failed: client connection to 0.0.0.0:0: connect: Connection refused (error 111)
I20260923 14:37:34.143194 13402 rpc-test.cc:394] Status: Network error: Client connection negotiation failed: client connection to 0.0.0.0:0: connect: Connection refused (error 111)
I20260923 14:37:34.143560 13402 rpc-test.cc:394] Status: Network error: Client connection negotiation failed: client connection to 0.0.0.0:0: connect: Connection refused (error 111)
[ OK ] Parameters/TestRpc.TestCallToBadServer/SSL_UnixSocket (6 ms)
[ RUN ] Parameters/TestRpc.TestWrongService/SSL_UnixSocket
I20260923 14:37:34.149778 13499 acceptor_pool.cc:254] collecting diagnostics on the listening RPC socket unix:/tmp/dist-test-taskhCIHNK/test-tmp/rpc-test-88bc18e0e0d442b0bce3be5282392d14.sock every 8 connection(s)
I20260923 14:37:34.149868 13500 acceptor_pool.cc:254] collecting diagnostics on the listening RPC socket unix:/tmp/dist-test-taskhCIHNK/test-tmp/rpc-test-88bc18e0e0d442b0bce3be5282392d14.sock every 8 connection(s)
I20260923 14:37:34.160378 13496 messenger.cc:345] service WrongServiceName not registered on TestServer
[ OK ] Parameters/TestRpc.TestWrongService/SSL_UnixSocket (18 ms)
[ RUN ] Parameters/TestRpc.TestConnectionKeepalive/SSL_UnixSocket
I20260923 14:37:34.196090 13522 acceptor_pool.cc:254] collecting diagnostics on the listening RPC socket unix:/tmp/dist-test-taskhCIHNK/test-tmp/rpc-test-e393a4ee2f1e43c4a8a9bf9d690d41b5.sock every 8 connection(s)
I20260923 14:37:34.196130 13523 acceptor_pool.cc:254] collecting diagnostics on the listening RPC socket unix:/tmp/dist-test-taskhCIHNK/test-tmp/rpc-test-e393a4ee2f1e43c4a8a9bf9d690d41b5.sock every 8 connection(s)
I20260923 14:37:34.196466 13402 rpc-test.cc:488] Connecting to unix:/tmp/dist-test-taskhCIHNK/test-tmp/rpc-test-e393a4ee2f1e43c4a8a9bf9d690d41b5.sock
W20260923 14:37:34.664122 13535 connection.cc:196] Error closing socket: Network error: TlsSocket::Close: Broken pipe
[ OK ] Parameters/TestRpc.TestConnectionKeepalive/SSL_UnixSocket (1053 ms)
[ RUN ] Parameters/TestRpc.TestClientConnectionMetrics/SSL_UnixSocket
I20260923 14:37:35.224853 13547 acceptor_pool.cc:254] collecting diagnostics on the listening RPC socket unix:/tmp/dist-test-taskhCIHNK/test-tmp/rpc-test-4cd4b4086a34435ba0510e41c2f5186c.sock every 8 connection(s)
I20260923 14:37:35.224964 13548 acceptor_pool.cc:254] collecting diagnostics on the listening RPC socket unix:/tmp/dist-test-taskhCIHNK/test-tmp/rpc-test-4cd4b4086a34435ba0510e41c2f5186c.sock every 8 connection(s)
I20260923 14:37:35.225246 13402 rpc-test.cc:569] Connecting to unix:/tmp/dist-test-taskhCIHNK/test-tmp/rpc-test-4cd4b4086a34435ba0510e41c2f5186c.sock
W20260923 14:37:45.020054 13544 connection.cc:196] Error closing socket: Network error: TlsSocket::Close: Broken pipe
[ OK ] Parameters/TestRpc.TestClientConnectionMetrics/SSL_UnixSocket (9806 ms)
[ RUN ] Parameters/TestRpc.TestCredentialsPolicy/SSL_UnixSocket
I20260923 14:37:45.033252 13571 acceptor_pool.cc:254] collecting diagnostics on the listening RPC socket unix:/tmp/dist-test-taskhCIHNK/test-tmp/rpc-test-0208f16f258e452abbde1e4cfd04525e.sock every 8 connection(s)
I20260923 14:37:45.033299 13572 acceptor_pool.cc:254] collecting diagnostics on the listening RPC socket unix:/tmp/dist-test-taskhCIHNK/test-tmp/rpc-test-0208f16f258e452abbde1e4cfd04525e.sock every 8 connection(s)
I20260923 14:37:45.033624 13402 rpc-test.cc:700] Connecting to unix:/tmp/dist-test-taskhCIHNK/test-tmp/rpc-test-0208f16f258e452abbde1e4cfd04525e.sock
W20260923 14:37:45.065400 13570 connection.cc:196] Error closing socket: Network error: TlsSocket::Close: Broken pipe
W20260923 14:37:45.070156 13570 connection.cc:196] Error closing socket: Network error: TlsSocket::Close: Broken pipe
[ OK ] Parameters/TestRpc.TestCredentialsPolicy/SSL_UnixSocket (49 ms)
[ RUN ] Parameters/TestRpc.TestCallLongerThanKeepalive/SSL_UnixSocket
I20260923 14:37:45.081991 13596 acceptor_pool.cc:254] collecting diagnostics on the listening RPC socket unix:/tmp/dist-test-taskhCIHNK/test-tmp/rpc-test-ddc12de288cc4fe1880954bf03616183.sock every 8 connection(s)
I20260923 14:37:45.082036 13597 acceptor_pool.cc:254] collecting diagnostics on the listening RPC socket unix:/tmp/dist-test-taskhCIHNK/test-tmp/rpc-test-ddc12de288cc4fe1880954bf03616183.sock every 8 connection(s)
I20260923 14:37:45.109637 13600 rpc-test-base.h:222] got call: sleep_micros: 3000000 deferred: true
I20260923 14:37:48.110487 13600 rpcz_store.cc:275] Call kudu.rpc.GenericCalculatorService.Sleep from unix:<unnamed> (request call id 0) took 3000 ms. Trace:
I20260923 14:37:48.110634 13600 rpcz_store.cc:276] 0923 14:37:45.109552 (+ 0us) service_pool.cc:170] Inserting onto call queue
0923 14:37:45.109605 (+ 53us) service_pool.cc:227] Handling call
0923 14:37:48.110465 (+3000860us) inbound_call.cc:173] Queueing success response
Metrics: {}
W20260923 14:37:48.112103 13593 connection.cc:196] Error closing socket: Network error: TlsSocket::Close: Broken pipe
[ OK ] Parameters/TestRpc.TestCallLongerThanKeepalive/SSL_UnixSocket (3042 ms)
[ RUN ] Parameters/TestRpc.TestRpcSidecar/SSL_UnixSocket
I20260923 14:37:48.128543 13621 acceptor_pool.cc:254] collecting diagnostics on the listening RPC socket unix:/tmp/dist-test-taskhCIHNK/test-tmp/rpc-test-eabaa3a40c2e4fd8ae47e8c82b4f83cc.sock every 8 connection(s)
I20260923 14:37:48.128634 13622 acceptor_pool.cc:254] collecting diagnostics on the listening RPC socket unix:/tmp/dist-test-taskhCIHNK/test-tmp/rpc-test-eabaa3a40c2e4fd8ae47e8c82b4f83cc.sock every 8 connection(s)
W20260923 14:37:48.186616 13618 connection.cc:196] Error closing socket: Network error: TlsSocket::Close: Broken pipe
[ OK ] Parameters/TestRpc.TestRpcSidecar/SSL_UnixSocket (74 ms)
[ RUN ] Parameters/TestRpc.TestRpcSidecarLimits/SSL_UnixSocket
I20260923 14:37:50.753553 13646 acceptor_pool.cc:254] collecting diagnostics on the listening RPC socket unix:/tmp/dist-test-taskhCIHNK/test-tmp/rpc-test-253de86bdbee49a3913412bfd589aae9.sock every 8 connection(s)
I20260923 14:37:50.753587 13647 acceptor_pool.cc:254] collecting diagnostics on the listening RPC socket unix:/tmp/dist-test-taskhCIHNK/test-tmp/rpc-test-253de86bdbee49a3913412bfd589aae9.sock every 8 connection(s)
W20260923 14:37:50.778151 13402 serialization.cc:72] Serialized kudu.rpc_test.PushStringsRequestPB (2147483654 bytes) is larger than the maximum configured RPC message size (52428800 bytes). Sending anyway, but peer may reject the data.
W20260923 14:37:50.781967 13643 connection.cc:535] server connection from unix:<unnamed> recv error: Network error: RPC frame had a length of 2147483714, but we only support messages up to 52428800 bytes long.
W20260923 14:37:50.782032 13643 connection.cc:158] shutting down server connection from unix:<unnamed> with pending inbound data: 4/2147483714 bytes received; last active 0 ns ago: status Network error: RPC frame had a length of 2147483714, but we only support messages up to 52428800 bytes long.
W20260923 14:37:50.782215 13659 connection.cc:698] client connection to unix:/tmp/dist-test-taskhCIHNK/test-tmp/rpc-test-253de86bdbee49a3913412bfd589aae9.sock send error: Network error: failed to write to TLS socket: Broken pipe
W20260923 14:37:50.782402 13659 connection.cc:196] Error closing socket: Network error: TlsSocket::Close: Success
I20260923 14:37:50.804973 13671 acceptor_pool.cc:254] collecting diagnostics on the listening RPC socket unix:/tmp/dist-test-taskhCIHNK/test-tmp/rpc-test-253de86bdbee49a3913412bfd589aae9.sock every 8 connection(s)
I20260923 14:37:50.805006 13672 acceptor_pool.cc:254] collecting diagnostics on the listening RPC socket unix:/tmp/dist-test-taskhCIHNK/test-tmp/rpc-test-253de86bdbee49a3913412bfd589aae9.sock every 8 connection(s)
W20260923 14:37:56.091745 13668 connection.cc:577] server connection from unix:<unnamed>: received bad data: 'Corruption: Invalid packet: message had a length of 2147483710, but we only support messages up to 2147483647 bytes
'
W20260923 14:37:56.092118 13684 connection.cc:196] Error closing socket: Network error: TlsSocket::Close: Broken pipe
[ OK ] Parameters/TestRpc.TestRpcSidecarLimits/SSL_UnixSocket (7907 ms)
[ RUN ] Parameters/TestRpc.TestCallTimeoutDoesntAffectNegotiation/SSL_UnixSocket
I20260923 14:37:56.108408 13697 acceptor_pool.cc:254] collecting diagnostics on the listening RPC socket unix:/tmp/dist-test-taskhCIHNK/test-tmp/rpc-test-dfe13d8a4af14e1cb00ce1c0a1f33c8a.sock every 8 connection(s)
I20260923 14:37:56.108558 13698 acceptor_pool.cc:254] collecting diagnostics on the listening RPC socket unix:/tmp/dist-test-taskhCIHNK/test-tmp/rpc-test-dfe13d8a4af14e1cb00ce1c0a1f33c8a.sock every 8 connection(s)
W20260923 14:37:56.123550 13692 negotiation.cc:266] Injecting 500ms delay in negotiation
I20260923 14:37:56.173849 13402 rpc-test-base.h:595] status: Timed out: connection negotiation to unix:/tmp/dist-test-taskhCIHNK/test-tmp/rpc-test-dfe13d8a4af14e1cb00ce1c0a1f33c8a.sock for RPC Sleep timed out after 0.050s (ON_OUTBOUND_QUEUE), seconds elapsed: 0.0507054
[ OK ] Parameters/TestRpc.TestCallTimeoutDoesntAffectNegotiation/SSL_UnixSocket (534 ms)
[ RUN ] Parameters/TestRpc.TestRpcHandlerLatencyMetric/SSL_UnixSocket
I20260923 14:37:56.660068 13722 acceptor_pool.cc:254] collecting diagnostics on the listening RPC socket unix:/tmp/dist-test-taskhCIHNK/test-tmp/rpc-test-692df43865bd4dca9b3f2734ef397bcd.sock every 8 connection(s)
I20260923 14:37:56.660107 13723 acceptor_pool.cc:254] collecting diagnostics on the listening RPC socket unix:/tmp/dist-test-taskhCIHNK/test-tmp/rpc-test-692df43865bd4dca9b3f2734ef397bcd.sock every 8 connection(s)
I20260923 14:37:56.711109 13402 rpc-test.cc:1236] Sleep() min lat: 20351
I20260923 14:37:56.711165 13402 rpc-test.cc:1237] Sleep() mean lat: 20351
I20260923 14:37:56.711192 13402 rpc-test.cc:1238] Sleep() max lat: 20351
I20260923 14:37:56.711205 13402 rpc-test.cc:1239] Sleep() #calls: 1
W20260923 14:37:56.711884 13719 connection.cc:196] Error closing socket: Network error: TlsSocket::Close: Broken pipe
[ OK ] Parameters/TestRpc.TestRpcHandlerLatencyMetric/SSL_UnixSocket (83 ms)
[ RUN ] Parameters/TestRpc.TimedOutOnResponseMetricServiceQueue/SSL_UnixSocket
I20260923 14:37:56.720182 13748 acceptor_pool.cc:254] collecting diagnostics on the listening RPC socket unix:/tmp/dist-test-taskhCIHNK/test-tmp/rpc-test-869960c9b5234b32aede32ee0b3fd63e.sock every 8 connection(s)
I20260923 14:37:56.720252 13749 acceptor_pool.cc:254] collecting diagnostics on the listening RPC socket unix:/tmp/dist-test-taskhCIHNK/test-tmp/rpc-test-869960c9b5234b32aede32ee0b3fd63e.sock every 8 connection(s)
W20260923 14:37:56.772565 13750 rpcz_store.cc:267] Call kudu.rpc_test.CalculatorService.Sleep from unix:<unnamed> (request call id 2) took 20 ms (client timeout 20 ms). Trace:
W20260923 14:37:56.772678 13750 rpcz_store.cc:269] 0923 14:37:56.752204 (+ 0us) service_pool.cc:170] Inserting onto call queue
0923 14:37:56.772500 (+ 20296us) service_pool.cc:214] Skipping call since client already timed out
0923 14:37:56.772550 (+ 50us) inbound_call.cc:173] Queueing failure response
Metrics: {}
W20260923 14:37:56.773445 13745 connection.cc:196] Error closing socket: Network error: TlsSocket::Close: Broken pipe
[ OK ] Parameters/TestRpc.TimedOutOnResponseMetricServiceQueue/SSL_UnixSocket (60 ms)
[ RUN ] Parameters/TestRpc.RpcPendingConnectionsMetric/SSL_UnixSocket
I20260923 14:37:56.776736 13771 acceptor_pool.cc:254] collecting diagnostics on the listening RPC socket 0.0.0.0:35403 every 8 connection(s)
I20260923 14:37:56.776808 13772 acceptor_pool.cc:254] collecting diagnostics on the listening RPC socket 0.0.0.0:35403 every 8 connection(s)
W20260923 14:37:56.777808 13767 negotiation.cc:337] Failed RPC negotiation. Trace:
0923 14:37:56.777468 (+ 0us) reactor.cc:625] Submitting negotiation task for server connection from 127.0.0.1:59228 (local address 127.0.0.1:35403)
0923 14:37:56.777548 (+ 80us) server_negotiation.cc:206] Beginning negotiation
0923 14:37:56.777551 (+ 3us) server_negotiation.cc:399] Waiting for connection header
0923 14:37:56.777623 (+ 72us) negotiation.cc:327] Negotiation complete: Network error: Server connection negotiation failed: server connection from 127.0.0.1:59228: BlockingRecv error: recv got EOF from 127.0.0.1:59228 (error 108)
Metrics: {"server-negotiator.queue_time_us":22}
[ OK ] Parameters/TestRpc.RpcPendingConnectionsMetric/SSL_UnixSocket (14 ms)
[ RUN ] Parameters/TestRpc.TestRpcContextClientDeadline/SSL_UnixSocket
I20260923 14:37:56.796096 13787 acceptor_pool.cc:254] collecting diagnostics on the listening RPC socket unix:/tmp/dist-test-taskhCIHNK/test-tmp/rpc-test-71b00be24dec4e7e95a818cb413cf2ca.sock every 8 connection(s)
I20260923 14:37:56.796159 13788 acceptor_pool.cc:254] collecting diagnostics on the listening RPC socket unix:/tmp/dist-test-taskhCIHNK/test-tmp/rpc-test-71b00be24dec4e7e95a818cb413cf2ca.sock every 8 connection(s)
W20260923 14:37:56.829324 13784 connection.cc:196] Error closing socket: Network error: TlsSocket::Close: Broken pipe
[ OK ] Parameters/TestRpc.TestRpcContextClientDeadline/SSL_UnixSocket (41 ms)
[ RUN ] Parameters/TestRpc.TestApplicationFeatureFlagUnsupportedServer/SSL_UnixSocket
I20260923 14:37:56.857337 13812 acceptor_pool.cc:254] collecting diagnostics on the listening RPC socket unix:/tmp/dist-test-taskhCIHNK/test-tmp/rpc-test-411cf81825eb4a76b2962e094807dc08.sock every 8 connection(s)
I20260923 14:37:56.857373 13813 acceptor_pool.cc:254] collecting diagnostics on the listening RPC socket unix:/tmp/dist-test-taskhCIHNK/test-tmp/rpc-test-411cf81825eb4a76b2962e094807dc08.sock every 8 connection(s)
[ OK ] Parameters/TestRpc.TestApplicationFeatureFlagUnsupportedServer/SSL_UnixSocket (52 ms)
[ RUN ] Parameters/TestRpc.TestCancellationAsync/SSL_UnixSocket
I20260923 14:37:56.890954 13838 acceptor_pool.cc:254] collecting diagnostics on the listening RPC socket unix:/tmp/dist-test-taskhCIHNK/test-tmp/rpc-test-ad3d970874964d2197b2a040623f3a3e.sock every 8 connection(s)
I20260923 14:37:56.890965 13839 acceptor_pool.cc:254] collecting diagnostics on the listening RPC socket unix:/tmp/dist-test-taskhCIHNK/test-tmp/rpc-test-ad3d970874964d2197b2a040623f3a3e.sock every 8 connection(s)
I20260923 14:37:56.891185 13402 rpc-test.cc:1716] Connecting to unix:/tmp/dist-test-taskhCIHNK/test-tmp/rpc-test-ad3d970874964d2197b2a040623f3a3e.sock
I20260923 14:37:56.902594 13402 test_util.cc:268] Using random seed: 1843158720
I20260923 14:37:56.919420 13841 rpc-test-base.h:240] got call: sleep_micros: 500 pattern: 4294967295 num_repetitions: 2097152 sidecar_idx: 0
I20260923 14:37:56.936553 13842 rpc-test-base.h:240] got call: sleep_micros: 500 pattern: 4294967295 num_repetitions: 2097152 sidecar_idx: 0
I20260923 14:37:56.954087 13841 rpc-test-base.h:240] got call: sleep_micros: 500 pattern: 4294967295 num_repetitions: 2097152 sidecar_idx: 0
I20260923 14:37:56.969602 13842 rpc-test-base.h:240] got call: sleep_micros: 500 pattern: 4294967295 num_repetitions: 2097152 sidecar_idx: 0
I20260923 14:37:56.984855 13841 rpc-test-base.h:240] got call: sleep_micros: 500 pattern: 4294967295 num_repetitions: 2097152 sidecar_idx: 0
I20260923 14:37:57.000201 13842 rpc-test-base.h:240] got call: sleep_micros: 500 pattern: 4294967295 num_repetitions: 2097152 sidecar_idx: 0
I20260923 14:37:57.015511 13841 rpc-test-base.h:240] got call: sleep_micros: 500 pattern: 4294967295 num_repetitions: 2097152 sidecar_idx: 0
W20260923 14:37:57.016891 13835 connection.cc:196] Error closing socket: Network error: TlsSocket::Close: Broken pipe
W20260923 14:37:57.028244 13835 connection.cc:441] server connection from unix:<unnamed> torn down before Call kudu.rpc.GenericCalculatorService.SleepWithSidecar from unix:<unnamed> (request call id 8) could send its response
W20260923 14:37:57.038385 13835 connection.cc:441] server connection from unix:<unnamed> torn down before Call kudu.rpc.GenericCalculatorService.SleepWithSidecar from unix:<unnamed> (request call id 9) could send its response
[ OK ] Parameters/TestRpc.TestCancellationAsync/SSL_UnixSocket (156 ms)
[ RUN ] Parameters/TestRpc.TestPerformanceBySocketType/SSL_UnixSocket
I20260923 14:37:57.053372 13863 acceptor_pool.cc:254] collecting diagnostics on the listening RPC socket unix:/tmp/dist-test-taskhCIHNK/test-tmp/rpc-test-bc90cdebdc95423caf82221e39978748.sock every 8 connection(s)
I20260923 14:37:57.053426 13864 acceptor_pool.cc:254] collecting diagnostics on the listening RPC socket unix:/tmp/dist-test-taskhCIHNK/test-tmp/rpc-test-bc90cdebdc95423caf82221e39978748.sock every 8 connection(s)
I20260923 14:37:57.053714 13402 rpc-test.cc:1846] Connecting to unix:/tmp/dist-test-taskhCIHNK/test-tmp/rpc-test-bc90cdebdc95423caf82221e39978748.sock
I20260923 14:37:58.511761 13402 rpc-test.cc:1859] Sending 1024MB via ssl-enabled unix socket: real 1.446s user 1.715s sys 0.934s
I20260923 14:37:59.920271 13402 rpc-test.cc:1859] Sending 1024MB via ssl-enabled unix socket: real 1.408s user 1.735s sys 0.840s
I20260923 14:38:01.355145 13402 rpc-test.cc:1859] Sending 1024MB via ssl-enabled unix socket: real 1.435s user 1.789s sys 0.839s
I20260923 14:38:02.840876 13402 rpc-test.cc:1859] Sending 1024MB via ssl-enabled unix socket: real 1.486s user 1.837s sys 0.884s
I20260923 14:38:04.216382 13402 rpc-test.cc:1859] Sending 1024MB via ssl-enabled unix socket: real 1.375s user 1.688s sys 0.837s
[ OK ] Parameters/TestRpc.TestPerformanceBySocketType/SSL_UnixSocket (7178 ms)
[----------] 20 tests from Parameters/TestRpc (30174 ms total)
[----------] 1 test from Parameters/TestRpcSocketTxRxQueue
[ RUN ] Parameters/TestRpcSocketTxRxQueue.AcceptorRxQueueSizeMetric/0
I20260923 14:38:04.220772 13888 acceptor_pool.cc:254] collecting diagnostics on the listening RPC socket 0.0.0.0:42853 every 1 connection(s)
I20260923 14:38:04.220851 13889 acceptor_pool.cc:254] collecting diagnostics on the listening RPC socket 0.0.0.0:42853 every 1 connection(s)
W20260923 14:38:04.221614 13884 negotiation.cc:337] Failed RPC negotiation. Trace:
0923 14:38:04.221382 (+ 0us) reactor.cc:625] Submitting negotiation task for server connection from 127.0.0.1:48048 (local address 127.0.0.1:42853)
0923 14:38:04.221478 (+ 96us) server_negotiation.cc:206] Beginning negotiation
0923 14:38:04.221481 (+ 3us) server_negotiation.cc:399] Waiting for connection header
0923 14:38:04.221554 (+ 73us) negotiation.cc:327] Negotiation complete: Network error: Server connection negotiation failed: server connection from 127.0.0.1:48048: BlockingRecv error: recv got EOF from 127.0.0.1:48048 (error 108)
Metrics: {"server-negotiator.queue_time_us":29}
[ OK ] Parameters/TestRpcSocketTxRxQueue.AcceptorRxQueueSizeMetric/0 (5 ms)
[----------] 1 test from Parameters/TestRpcSocketTxRxQueue (5 ms total)
[----------] Global test environment tear-down
[==========] 21 tests from 2 test suites ran. (30180 ms total)
[ PASSED ] 20 tests.
[ FAILED ] 1 test, listed below:
[ FAILED ] Parameters/TestRpc.TestCallWithChainCertAndChainCA/SSL_UnixSocket, where GetParam() = (true, true)
1 FAILED TEST