Diagnosed failure

Parameters/TestRpc.TestCallWithChainCertAndChainCA/SSL_TCP: /data0/somelongdirectorytoavoidrpathissues/src/kudu/src/kudu/rpc/rpc-test.cc:270: Failure
Failed
Bad status: Runtime error: could not verify certificate chain (error with cert: subject=CN = localhost, ST = sadfjas, C = AS, emailAddress = sdflkdsajf, O = lskdfjlsad, OU = sldfkja, issuer=C = AS, ST = ASDfkjdhf, L = lskdjf, O = saldfja, OU = skdjf, CN = localhost, emailAddress = sadjflkadsj): : certificate has expired
Google Test trace:
/data0/somelongdirectorytoavoidrpathissues/src/kudu/src/kudu/rpc/rpc-test.cc:267: Connecting to 0.0.0.0:39707
I20260926 12:14:31.499801  8052 test_util.cc:175] -----------------------------------------------
I20260926 12:14:31.499996  8052 test_util.cc:176] Had fatal failures, leaving test files at /tmp/dist-test-taskpZpB_l/test-tmp/rpc-test.5.Parameters_TestRpc.TestCallWithChainCertAndChainCA_SSL_TCP.1790424870139710-8052-0

Full log

Note: This is test shard 6 of 8.
[==========] Running 21 tests from 2 test suites.
[----------] Global test environment set-up.
[----------] 20 tests from Parameters/TestRpc
[ RUN      ] Parameters/TestRpc.TestMessengerCreateDestroy/SSL_TCP
WARNING: Logging before InitGoogleLogging() is written to STDERR
I20260926 12:14:30.233206  8052 rpc-test.cc:169] started messenger TestCreateDestroy
[       OK ] Parameters/TestRpc.TestMessengerCreateDestroy/SSL_TCP (1164 ms)
[ RUN      ] Parameters/TestRpc.TestNegotiationDeadlock/SSL_TCP
I20260926 12:14:31.380561  8074 acceptor_pool.cc:254] collecting diagnostics on the listening RPC socket 0.0.0.0:40215 every 8 connection(s)
I20260926 12:14:31.382138  8075 acceptor_pool.cc:254] collecting diagnostics on the listening RPC socket 0.0.0.0:40215 every 8 connection(s)
[       OK ] Parameters/TestRpc.TestNegotiationDeadlock/SSL_TCP (76 ms)
[ RUN      ] Parameters/TestRpc.TestCallWithChainCertAndChainCA/SSL_TCP
I20260926 12:14:31.470707  8090 acceptor_pool.cc:254] collecting diagnostics on the listening RPC socket 0.0.0.0:39707 every 8 connection(s)
I20260926 12:14:31.472934  8091 acceptor_pool.cc:254] collecting diagnostics on the listening RPC socket 0.0.0.0:39707 every 8 connection(s)
/data0/somelongdirectorytoavoidrpathissues/src/kudu/src/kudu/rpc/rpc-test.cc:270: Failure
Failed
Bad status: Runtime error: could not verify certificate chain (error with cert: subject=CN = localhost, ST = sadfjas, C = AS, emailAddress = sdflkdsajf, O = lskdfjlsad, OU = sldfkja, issuer=C = AS, ST = ASDfkjdhf, L = lskdjf, O = saldfja, OU = skdjf, CN = localhost, emailAddress = sadjflkadsj): : certificate has expired
Google Test trace:
/data0/somelongdirectorytoavoidrpathissues/src/kudu/src/kudu/rpc/rpc-test.cc:267: Connecting to 0.0.0.0:39707
I20260926 12:14:31.499801  8052 test_util.cc:175] -----------------------------------------------
I20260926 12:14:31.499996  8052 test_util.cc:176] Had fatal failures, leaving test files at /tmp/dist-test-taskpZpB_l/test-tmp/rpc-test.5.Parameters_TestRpc.TestCallWithChainCertAndChainCA_SSL_TCP.1790424870139710-8052-0
[  FAILED  ] Parameters/TestRpc.TestCallWithChainCertAndChainCA/SSL_TCP, where GetParam() = (true, false) (66 ms)
[ RUN      ] Parameters/TestRpc.TestCallWithPasswordProtectedKey/SSL_TCP
I20260926 12:14:31.515690  8115 acceptor_pool.cc:254] collecting diagnostics on the listening RPC socket 0.0.0.0:34665 every 8 connection(s)
I20260926 12:14:31.516426  8116 acceptor_pool.cc:254] collecting diagnostics on the listening RPC socket 0.0.0.0:34665 every 8 connection(s)
[       OK ] Parameters/TestRpc.TestCallWithPasswordProtectedKey/SSL_TCP (65 ms)
[ RUN      ] Parameters/TestRpc.TestCallToBadServer/SSL_TCP
I20260926 12:14:31.589313  8052 rpc-test.cc:394] Status: Network error: Client connection negotiation failed: client connection to 0.0.0.0:0: connect: Connection refused (error 111)
I20260926 12:14:31.590701  8052 rpc-test.cc:394] Status: Network error: Client connection negotiation failed: client connection to 0.0.0.0:0: connect: Connection refused (error 111)
I20260926 12:14:31.591991  8052 rpc-test.cc:394] Status: Network error: Client connection negotiation failed: client connection to 0.0.0.0:0: connect: Connection refused (error 111)
I20260926 12:14:31.593258  8052 rpc-test.cc:394] Status: Network error: Client connection negotiation failed: client connection to 0.0.0.0:0: connect: Connection refused (error 111)
I20260926 12:14:31.594566  8052 rpc-test.cc:394] Status: Network error: Client connection negotiation failed: client connection to 0.0.0.0:0: connect: Connection refused (error 111)
[       OK ] Parameters/TestRpc.TestCallToBadServer/SSL_TCP (31 ms)
[ RUN      ] Parameters/TestRpc.TestWrongService/SSL_TCP
I20260926 12:14:31.617026  8150 acceptor_pool.cc:254] collecting diagnostics on the listening RPC socket 0.0.0.0:40971 every 8 connection(s)
I20260926 12:14:31.617837  8151 acceptor_pool.cc:254] collecting diagnostics on the listening RPC socket 0.0.0.0:40971 every 8 connection(s)
I20260926 12:14:31.692355  8147 messenger.cc:345] service WrongServiceName not registered on TestServer
[       OK ] Parameters/TestRpc.TestWrongService/SSL_TCP (105 ms)
[ RUN      ] Parameters/TestRpc.TestConnectionKeepalive/SSL_TCP
I20260926 12:14:31.723819  8173 acceptor_pool.cc:254] collecting diagnostics on the listening RPC socket 0.0.0.0:36983 every 8 connection(s)
I20260926 12:14:31.724565  8174 acceptor_pool.cc:254] collecting diagnostics on the listening RPC socket 0.0.0.0:36983 every 8 connection(s)
I20260926 12:14:31.727734  8052 rpc-test.cc:488] Connecting to 0.0.0.0:36983
[       OK ] Parameters/TestRpc.TestConnectionKeepalive/SSL_TCP (1060 ms)
[ RUN      ] Parameters/TestRpc.TestClientConnectionMetrics/SSL_TCP
I20260926 12:14:32.789367  8198 acceptor_pool.cc:254] collecting diagnostics on the listening RPC socket 0.0.0.0:40115 every 8 connection(s)
I20260926 12:14:32.790340  8199 acceptor_pool.cc:254] collecting diagnostics on the listening RPC socket 0.0.0.0:40115 every 8 connection(s)
I20260926 12:14:32.793697  8052 rpc-test.cc:569] Connecting to 0.0.0.0:40115
[       OK ] Parameters/TestRpc.TestClientConnectionMetrics/SSL_TCP (115839 ms)
[ RUN      ] Parameters/TestRpc.TestCredentialsPolicy/SSL_TCP
I20260926 12:16:28.621899  8232 acceptor_pool.cc:254] collecting diagnostics on the listening RPC socket 0.0.0.0:34839 every 8 connection(s)
I20260926 12:16:28.622730  8233 acceptor_pool.cc:254] collecting diagnostics on the listening RPC socket 0.0.0.0:34839 every 8 connection(s)
I20260926 12:16:28.625946  8052 rpc-test.cc:700] Connecting to 0.0.0.0:34839
[       OK ] Parameters/TestRpc.TestCredentialsPolicy/SSL_TCP (83 ms)
[ RUN      ] Parameters/TestRpc.TestCallLongerThanKeepalive/SSL_TCP
I20260926 12:16:28.715363  8257 acceptor_pool.cc:254] collecting diagnostics on the listening RPC socket 0.0.0.0:34293 every 8 connection(s)
I20260926 12:16:28.716099  8258 acceptor_pool.cc:254] collecting diagnostics on the listening RPC socket 0.0.0.0:34293 every 8 connection(s)
I20260926 12:16:28.753512  8261 rpc-test-base.h:222] got call: sleep_micros: 3000000 deferred: true
I20260926 12:16:31.757896  8261 rpcz_store.cc:275] Call kudu.rpc.GenericCalculatorService.Sleep from 127.0.0.1:47966 (request call id 0) took 3004 ms. Trace:
I20260926 12:16:31.758293  8261 rpcz_store.cc:276] 0926 12:16:28.753280 (+     0us) service_pool.cc:170] Inserting onto call queue
0926 12:16:28.753372 (+    92us) service_pool.cc:227] Handling call
0926 12:16:31.757715 (+3004343us) inbound_call.cc:173] Queueing success response
Metrics: {}
[       OK ] Parameters/TestRpc.TestCallLongerThanKeepalive/SSL_TCP (3083 ms)
[ RUN      ] Parameters/TestRpc.TestRpcSidecar/SSL_TCP
I20260926 12:16:31.807678  8283 acceptor_pool.cc:254] collecting diagnostics on the listening RPC socket 0.0.0.0:34211 every 8 connection(s)
I20260926 12:16:31.808495  8284 acceptor_pool.cc:254] collecting diagnostics on the listening RPC socket 0.0.0.0:34211 every 8 connection(s)
[       OK ] Parameters/TestRpc.TestRpcSidecar/SSL_TCP (524 ms)
[ RUN      ] Parameters/TestRpc.TestRpcSidecarLimits/SSL_TCP
I20260926 12:16:48.997496  8309 acceptor_pool.cc:254] collecting diagnostics on the listening RPC socket 0.0.0.0:44265 every 8 connection(s)
I20260926 12:16:48.998482  8310 acceptor_pool.cc:254] collecting diagnostics on the listening RPC socket 0.0.0.0:44265 every 8 connection(s)
W20260926 12:16:49.015447  8052 serialization.cc:72] Serialized kudu.rpc_test.PushStringsRequestPB (2147483654 bytes) is larger than the maximum configured RPC message size (52428800 bytes). Sending anyway, but peer may reject the data.
W20260926 12:16:49.030346  8306 connection.cc:535] server connection from 127.0.0.1:49628 recv error: Network error: RPC frame had a length of 2147483714, but we only support messages up to 52428800 bytes long.
W20260926 12:16:49.030639  8306 connection.cc:158] shutting down server connection from 127.0.0.1:49628 with pending inbound data: 4/2147483714 bytes received; last active 0 ns ago: status Network error: RPC frame had a length of 2147483714, but we only support messages up to 52428800 bytes long.
W20260926 12:16:49.031523  8322 connection.cc:698] client connection to 0.0.0.0:44265 send error: Network error: failed to write to TLS socket: Connection reset by peer
W20260926 12:16:49.032068  8322 connection.cc:196] Error closing socket: Network error: TlsSocket::Close: Success
[       OK ] Parameters/TestRpc.TestRpcSidecarLimits/SSL_TCP (17529 ms)
[ RUN      ] Parameters/TestRpc.TestCallTimeoutDoesntAffectNegotiation/SSL_TCP
I20260926 12:16:49.841022  8334 acceptor_pool.cc:254] collecting diagnostics on the listening RPC socket 0.0.0.0:43061 every 8 connection(s)
I20260926 12:16:49.841732  8335 acceptor_pool.cc:254] collecting diagnostics on the listening RPC socket 0.0.0.0:43061 every 8 connection(s)
W20260926 12:16:49.865446  8330 negotiation.cc:266] Injecting 500ms delay in negotiation
I20260926 12:16:49.914981  8052 rpc-test-base.h:595] status: Timed out: connection negotiation to 0.0.0.0:43061 for RPC Sleep timed out after 0.050s (ON_OUTBOUND_QUEUE), seconds elapsed: 0.0505489
[       OK ] Parameters/TestRpc.TestCallTimeoutDoesntAffectNegotiation/SSL_TCP (558 ms)
[ RUN      ] Parameters/TestRpc.TestRpcHandlerLatencyMetric/SSL_TCP
I20260926 12:16:50.409775  8359 acceptor_pool.cc:254] collecting diagnostics on the listening RPC socket 0.0.0.0:41719 every 8 connection(s)
I20260926 12:16:50.410549  8360 acceptor_pool.cc:254] collecting diagnostics on the listening RPC socket 0.0.0.0:41719 every 8 connection(s)
I20260926 12:16:50.470351  8052 rpc-test.cc:1236] Sleep() min lat: 21543
I20260926 12:16:50.470531  8052 rpc-test.cc:1237] Sleep() mean lat: 21543
I20260926 12:16:50.470652  8052 rpc-test.cc:1238] Sleep() max lat: 21543
I20260926 12:16:50.470765  8052 rpc-test.cc:1239] Sleep() #calls: 1
[       OK ] Parameters/TestRpc.TestRpcHandlerLatencyMetric/SSL_TCP (95 ms)
[ RUN      ] Parameters/TestRpc.TimedOutOnResponseMetricServiceQueue/SSL_TCP
I20260926 12:16:50.533922  8385 acceptor_pool.cc:254] collecting diagnostics on the listening RPC socket 0.0.0.0:35519 every 8 connection(s)
I20260926 12:16:50.534719  8386 acceptor_pool.cc:254] collecting diagnostics on the listening RPC socket 0.0.0.0:35519 every 8 connection(s)
W20260926 12:16:50.605859  8387 rpcz_store.cc:267] Call kudu.rpc_test.CalculatorService.Sleep from 127.0.0.1:47768 (request call id 2) took 20 ms (client timeout 20 ms). Trace:
W20260926 12:16:50.606259  8387 rpcz_store.cc:269] 0926 12:16:50.585440 (+     0us) service_pool.cc:170] Inserting onto call queue
0926 12:16:50.605674 (+ 20234us) service_pool.cc:214] Skipping call since client already timed out
0926 12:16:50.605747 (+    73us) inbound_call.cc:173] Queueing failure response
Metrics: {}
[       OK ] Parameters/TestRpc.TimedOutOnResponseMetricServiceQueue/SSL_TCP (134 ms)
[ RUN      ] Parameters/TestRpc.RpcPendingConnectionsMetric/SSL_TCP
I20260926 12:16:50.622852  8408 acceptor_pool.cc:254] collecting diagnostics on the listening RPC socket 0.0.0.0:34939 every 8 connection(s)
I20260926 12:16:50.623579  8409 acceptor_pool.cc:254] collecting diagnostics on the listening RPC socket 0.0.0.0:34939 every 8 connection(s)
W20260926 12:16:50.628466  8404 negotiation.cc:337] Failed RPC negotiation. Trace:
0926 12:16:50.627310 (+     0us) reactor.cc:625] Submitting negotiation task for server connection from 127.0.0.1:58496 (local address 127.0.0.1:34939)
0926 12:16:50.627698 (+   388us) server_negotiation.cc:206] Beginning negotiation
0926 12:16:50.627715 (+    17us) server_negotiation.cc:399] Waiting for connection header
0926 12:16:50.627934 (+   219us) negotiation.cc:327] Negotiation complete: Network error: Server connection negotiation failed: server connection from 127.0.0.1:58496: BlockingRecv error: recv got EOF from 127.0.0.1:58496 (error 108)
Metrics: {"server-negotiator.queue_time_us":98}
[       OK ] Parameters/TestRpc.RpcPendingConnectionsMetric/SSL_TCP (36 ms)
[ RUN      ] Parameters/TestRpc.TestRpcContextClientDeadline/SSL_TCP
I20260926 12:16:50.681201  8425 acceptor_pool.cc:254] collecting diagnostics on the listening RPC socket 0.0.0.0:42657 every 8 connection(s)
I20260926 12:16:50.682021  8426 acceptor_pool.cc:254] collecting diagnostics on the listening RPC socket 0.0.0.0:42657 every 8 connection(s)
[       OK ] Parameters/TestRpc.TestRpcContextClientDeadline/SSL_TCP (113 ms)
[ RUN      ] Parameters/TestRpc.TestApplicationFeatureFlagUnsupportedServer/SSL_TCP
I20260926 12:16:50.793555  8450 acceptor_pool.cc:254] collecting diagnostics on the listening RPC socket 0.0.0.0:46371 every 8 connection(s)
I20260926 12:16:50.794329  8451 acceptor_pool.cc:254] collecting diagnostics on the listening RPC socket 0.0.0.0:46371 every 8 connection(s)
[       OK ] Parameters/TestRpc.TestApplicationFeatureFlagUnsupportedServer/SSL_TCP (71 ms)
[ RUN      ] Parameters/TestRpc.TestCancellationAsync/SSL_TCP
I20260926 12:16:50.865520  8475 acceptor_pool.cc:254] collecting diagnostics on the listening RPC socket 0.0.0.0:45781 every 8 connection(s)
I20260926 12:16:50.866264  8476 acceptor_pool.cc:254] collecting diagnostics on the listening RPC socket 0.0.0.0:45781 every 8 connection(s)
I20260926 12:16:50.869366  8052 rpc-test.cc:1716] Connecting to 0.0.0.0:45781
I20260926 12:16:50.888130  8052 test_util.cc:268] Using random seed: -825926229
I20260926 12:16:51.121351  8479 rpc-test-base.h:240] got call: sleep_micros: 500 pattern: 4294967295 num_repetitions: 2097152 sidecar_idx: 0
I20260926 12:16:51.283056  8478 rpc-test-base.h:240] got call: sleep_micros: 500 pattern: 4294967295 num_repetitions: 2097152 sidecar_idx: 0
I20260926 12:16:51.478448  8479 rpc-test-base.h:240] got call: sleep_micros: 500 pattern: 4294967295 num_repetitions: 2097152 sidecar_idx: 0
I20260926 12:16:51.667400  8478 rpc-test-base.h:240] got call: sleep_micros: 500 pattern: 4294967295 num_repetitions: 2097152 sidecar_idx: 0
I20260926 12:16:51.858490  8479 rpc-test-base.h:240] got call: sleep_micros: 500 pattern: 4294967295 num_repetitions: 2097152 sidecar_idx: 0
I20260926 12:16:52.062148  8479 rpc-test-base.h:240] got call: sleep_micros: 500 pattern: 4294967295 num_repetitions: 2097152 sidecar_idx: 0
I20260926 12:16:52.242590  8479 rpc-test-base.h:240] got call: sleep_micros: 500 pattern: 4294967295 num_repetitions: 2097152 sidecar_idx: 0
I20260926 12:16:52.423007  8479 rpc-test-base.h:240] got call: sleep_micros: 500 pattern: 4294967295 num_repetitions: 2097152 sidecar_idx: 0
W20260926 12:16:52.574922  8472 connection.cc:196] Error closing socket: Network error: TlsSocket::Close: Broken pipe
W20260926 12:16:52.612885  8472 connection.cc:441] server connection from 127.0.0.1:51486 torn down before Call kudu.rpc.GenericCalculatorService.SleepWithSidecar from 127.0.0.1:51486 (request call id 8) could send its response
[       OK ] Parameters/TestRpc.TestCancellationAsync/SSL_TCP (1787 ms)
[ RUN      ] Parameters/TestRpc.TestPerformanceBySocketType/SSL_TCP
I20260926 12:16:52.720077  8500 acceptor_pool.cc:254] collecting diagnostics on the listening RPC socket 0.0.0.0:37037 every 8 connection(s)
I20260926 12:16:52.720809  8501 acceptor_pool.cc:254] collecting diagnostics on the listening RPC socket 0.0.0.0:37037 every 8 connection(s)
I20260926 12:16:52.723907  8052 rpc-test.cc:1846] Connecting to 0.0.0.0:37037
I20260926 12:17:11.860422  8052 rpc-test.cc:1859] Sending 1024MB via ssl-enabled tcp socket: real 19.121s	user 16.411s	sys 10.915s
I20260926 12:17:30.905397  8052 rpc-test.cc:1859] Sending 1024MB via ssl-enabled tcp socket: real 19.045s	user 16.486s	sys 10.567s
I20260926 12:17:49.754750  8052 rpc-test.cc:1859] Sending 1024MB via ssl-enabled tcp socket: real 18.849s	user 16.501s	sys 10.284s
I20260926 12:18:08.638888  8052 rpc-test.cc:1859] Sending 1024MB via ssl-enabled tcp socket: real 18.884s	user 16.468s	sys 10.345s
I20260926 12:18:27.651181  8052 rpc-test.cc:1859] Sending 1024MB via ssl-enabled tcp socket: real 19.012s	user 16.299s	sys 10.748s
[       OK ] Parameters/TestRpc.TestPerformanceBySocketType/SSL_TCP (95047 ms)
[----------] 20 tests from Parameters/TestRpc (237479 ms total)

[----------] 1 test from Parameters/TestRpcSocketTxRxQueue
[ RUN      ] Parameters/TestRpcSocketTxRxQueue.OverCapacity/0
W20260926 12:18:28.112051  8544 negotiation.cc:337] Failed RPC negotiation. Trace:
0926 12:18:27.693619 (+     0us) reactor.cc:625] Submitting negotiation task for client connection to 0.0.0.0:37009 (local address 127.0.0.1:38962)
0926 12:18:27.694285 (+   666us) negotiation.cc:107] Waiting for socket to connect
0926 12:18:27.694333 (+    48us) client_negotiation.cc:174] Beginning negotiation
0926 12:18:27.694617 (+   284us) client_negotiation.cc:252] Sending NEGOTIATE NegotiatePB request
0926 12:18:28.110814 (+416197us) negotiation.cc:327] Negotiation complete: Network error: Client connection negotiation failed: client connection to 0.0.0.0:37009: BlockingRecv error: recv error from unknown peer: Transport endpoint is not connected (error 107)
Metrics: {"client-negotiator.queue_time_us":206}
W20260926 12:18:28.111809  8526 negotiation.cc:337] Failed RPC negotiation. Trace:
0926 12:18:27.679563 (+     0us) reactor.cc:625] Submitting negotiation task for client connection to 0.0.0.0:37009 (local address 127.0.0.1:38944)
0926 12:18:27.680247 (+   684us) negotiation.cc:107] Waiting for socket to connect
0926 12:18:27.680295 (+    48us) client_negotiation.cc:174] Beginning negotiation
0926 12:18:27.680849 (+   554us) client_negotiation.cc:252] Sending NEGOTIATE NegotiatePB request
0926 12:18:28.110653 (+429804us) negotiation.cc:327] Negotiation complete: Network error: Client connection negotiation failed: client connection to 0.0.0.0:37009: BlockingRecv error: recv error from unknown peer: Transport endpoint is not connected (error 107)
Metrics: {"client-negotiator.queue_time_us":141}
W20260926 12:18:28.114701  8553 negotiation.cc:337] Failed RPC negotiation. Trace:
0926 12:18:27.705715 (+     0us) reactor.cc:625] Submitting negotiation task for client connection to 0.0.0.0:37009 (local address 127.0.0.1:38972)
0926 12:18:27.706345 (+   630us) negotiation.cc:107] Waiting for socket to connect
0926 12:18:27.706393 (+    48us) client_negotiation.cc:174] Beginning negotiation
0926 12:18:27.706688 (+   295us) client_negotiation.cc:252] Sending NEGOTIATE NegotiatePB request
0926 12:18:28.110653 (+403965us) negotiation.cc:327] Negotiation complete: Network error: Client connection negotiation failed: client connection to 0.0.0.0:37009: BlockingRecv error: recv error from unknown peer: Transport endpoint is not connected (error 107)
Metrics: {"client-negotiator.queue_time_us":145}
W20260926 12:18:28.115060  8571 negotiation.cc:337] Failed RPC negotiation. Trace:
0926 12:18:27.730313 (+     0us) reactor.cc:625] Submitting negotiation task for client connection to 0.0.0.0:37009 (local address 127.0.0.1:38982)
0926 12:18:27.730878 (+   565us) negotiation.cc:107] Waiting for socket to connect
0926 12:18:27.730909 (+    31us) client_negotiation.cc:174] Beginning negotiation
0926 12:18:27.731116 (+   207us) client_negotiation.cc:252] Sending NEGOTIATE NegotiatePB request
0926 12:18:28.111720 (+380604us) negotiation.cc:327] Negotiation complete: Network error: Client connection negotiation failed: client connection to 0.0.0.0:37009: BlockingRecv error: recv error from unknown peer: Transport endpoint is not connected (error 107)
Metrics: {"client-negotiator.queue_time_us":136}
W20260926 12:18:28.115497  8562 negotiation.cc:337] Failed RPC negotiation. Trace:
0926 12:18:27.717764 (+     0us) reactor.cc:625] Submitting negotiation task for client connection to 0.0.0.0:37009 (local address 127.0.0.1:38978)
0926 12:18:27.718379 (+   615us) negotiation.cc:107] Waiting for socket to connect
0926 12:18:27.718466 (+    87us) client_negotiation.cc:174] Beginning negotiation
0926 12:18:27.718747 (+   281us) client_negotiation.cc:252] Sending NEGOTIATE NegotiatePB request
0926 12:18:28.113701 (+394954us) negotiation.cc:327] Negotiation complete: Network error: Client connection negotiation failed: client connection to 0.0.0.0:37009: BlockingRecv error: recv error from unknown peer: Transport endpoint is not connected (error 107)
Metrics: {"client-negotiator.queue_time_us":165}
W20260926 12:18:28.115180  8535 negotiation.cc:337] Failed RPC negotiation. Trace:
0926 12:18:27.686394 (+     0us) reactor.cc:625] Submitting negotiation task for client connection to 0.0.0.0:37009 (local address 127.0.0.1:38950)
0926 12:18:27.687012 (+   618us) negotiation.cc:107] Waiting for socket to connect
0926 12:18:27.687055 (+    43us) client_negotiation.cc:174] Beginning negotiation
0926 12:18:27.687352 (+   297us) client_negotiation.cc:252] Sending NEGOTIATE NegotiatePB request
0926 12:18:28.110779 (+423427us) negotiation.cc:327] Negotiation complete: Network error: Client connection negotiation failed: client connection to 0.0.0.0:37009: BlockingRecv error: recv error from unknown peer: Transport endpoint is not connected (error 107)
Metrics: {"client-negotiator.queue_time_us":172}
[       OK ] Parameters/TestRpcSocketTxRxQueue.OverCapacity/0 (1231 ms)
[----------] 1 test from Parameters/TestRpcSocketTxRxQueue (1231 ms total)

[----------] Global test environment tear-down
[==========] 21 tests from 2 test suites ran. (238711 ms total)
[  PASSED  ] 20 tests.
[  FAILED  ] 1 test, listed below:
[  FAILED  ] Parameters/TestRpc.TestCallWithChainCertAndChainCA/SSL_TCP, where GetParam() = (true, false)

 1 FAILED TEST