Diagnosed failure

Parameters/TestRpc.TestCallWithChainCertAndChainCA/SSL_TCP: /data0/somelongdirectorytoavoidrpathissues/src/kudu/src/kudu/rpc/rpc-test.cc:270: Failure
Failed
Bad status: Runtime error: could not verify certificate chain (error with cert: subject=CN = localhost, ST = sadfjas, C = AS, emailAddress = sdflkdsajf, O = lskdfjlsad, OU = sldfkja, issuer=C = AS, ST = ASDfkjdhf, L = lskdjf, O = saldfja, OU = skdjf, CN = localhost, emailAddress = sadjflkadsj): : certificate has expired
Google Test trace:
/data0/somelongdirectorytoavoidrpathissues/src/kudu/src/kudu/rpc/rpc-test.cc:267: Connecting to 0.0.0.0:36057
I20260929 11:23:57.318588   379 test_util.cc:175] -----------------------------------------------
I20260929 11:23:57.318693   379 test_util.cc:176] Had fatal failures, leaving test files at /tmp/dist-test-taskJrmBV8/test-tmp/rpc-test.5.Parameters_TestRpc.TestCallWithChainCertAndChainCA_SSL_TCP.1790681037176840-379-0

Full log

Note: This is test shard 6 of 8.
[==========] Running 21 tests from 2 test suites.
[----------] Global test environment set-up.
[----------] 20 tests from Parameters/TestRpc
[ RUN      ] Parameters/TestRpc.TestMessengerCreateDestroy/SSL_TCP
WARNING: Logging before InitGoogleLogging() is written to STDERR
I20260929 11:23:57.245661   379 rpc-test.cc:169] started messenger TestCreateDestroy
[       OK ] Parameters/TestRpc.TestMessengerCreateDestroy/SSL_TCP (51 ms)
[ RUN      ] Parameters/TestRpc.TestNegotiationDeadlock/SSL_TCP
I20260929 11:23:57.262192   399 acceptor_pool.cc:254] collecting diagnostics on the listening RPC socket 0.0.0.0:42421 every 8 connection(s)
I20260929 11:23:57.262580   400 acceptor_pool.cc:254] collecting diagnostics on the listening RPC socket 0.0.0.0:42421 every 8 connection(s)
[       OK ] Parameters/TestRpc.TestNegotiationDeadlock/SSL_TCP (34 ms)
[ RUN      ] Parameters/TestRpc.TestCallWithChainCertAndChainCA/SSL_TCP
I20260929 11:23:57.305737   415 acceptor_pool.cc:254] collecting diagnostics on the listening RPC socket 0.0.0.0:36057 every 8 connection(s)
I20260929 11:23:57.306078   416 acceptor_pool.cc:254] collecting diagnostics on the listening RPC socket 0.0.0.0:36057 every 8 connection(s)
/data0/somelongdirectorytoavoidrpathissues/src/kudu/src/kudu/rpc/rpc-test.cc:270: Failure
Failed
Bad status: Runtime error: could not verify certificate chain (error with cert: subject=CN = localhost, ST = sadfjas, C = AS, emailAddress = sdflkdsajf, O = lskdfjlsad, OU = sldfkja, issuer=C = AS, ST = ASDfkjdhf, L = lskdjf, O = saldfja, OU = skdjf, CN = localhost, emailAddress = sadjflkadsj): : certificate has expired
Google Test trace:
/data0/somelongdirectorytoavoidrpathissues/src/kudu/src/kudu/rpc/rpc-test.cc:267: Connecting to 0.0.0.0:36057
I20260929 11:23:57.318588   379 test_util.cc:175] -----------------------------------------------
I20260929 11:23:57.318693   379 test_util.cc:176] Had fatal failures, leaving test files at /tmp/dist-test-taskJrmBV8/test-tmp/rpc-test.5.Parameters_TestRpc.TestCallWithChainCertAndChainCA_SSL_TCP.1790681037176840-379-0
[  FAILED  ] Parameters/TestRpc.TestCallWithChainCertAndChainCA/SSL_TCP, where GetParam() = (true, false) (34 ms)
[ RUN      ] Parameters/TestRpc.TestCallWithPasswordProtectedKey/SSL_TCP
I20260929 11:23:57.330861   440 acceptor_pool.cc:254] collecting diagnostics on the listening RPC socket 0.0.0.0:43825 every 8 connection(s)
I20260929 11:23:57.331125   441 acceptor_pool.cc:254] collecting diagnostics on the listening RPC socket 0.0.0.0:43825 every 8 connection(s)
[       OK ] Parameters/TestRpc.TestCallWithPasswordProtectedKey/SSL_TCP (49 ms)
[ RUN      ] Parameters/TestRpc.TestCallToBadServer/SSL_TCP
I20260929 11:23:57.385161   379 rpc-test.cc:394] Status: Network error: Client connection negotiation failed: client connection to 0.0.0.0:0: connect: Connection refused (error 111)
I20260929 11:23:57.386379   379 rpc-test.cc:394] Status: Network error: Client connection negotiation failed: client connection to 0.0.0.0:0: connect: Connection refused (error 111)
I20260929 11:23:57.387074   379 rpc-test.cc:394] Status: Network error: Client connection negotiation failed: client connection to 0.0.0.0:0: connect: Connection refused (error 111)
I20260929 11:23:57.387785   379 rpc-test.cc:394] Status: Network error: Client connection negotiation failed: client connection to 0.0.0.0:0: connect: Connection refused (error 111)
I20260929 11:23:57.388628   379 rpc-test.cc:394] Status: Network error: Client connection negotiation failed: client connection to 0.0.0.0:0: connect: Connection refused (error 111)
[       OK ] Parameters/TestRpc.TestCallToBadServer/SSL_TCP (22 ms)
[ RUN      ] Parameters/TestRpc.TestWrongService/SSL_TCP
I20260929 11:23:57.407661   475 acceptor_pool.cc:254] collecting diagnostics on the listening RPC socket 0.0.0.0:38245 every 8 connection(s)
I20260929 11:23:57.407963   476 acceptor_pool.cc:254] collecting diagnostics on the listening RPC socket 0.0.0.0:38245 every 8 connection(s)
I20260929 11:23:57.443348   474 messenger.cc:345] service WrongServiceName not registered on TestServer
[       OK ] Parameters/TestRpc.TestWrongService/SSL_TCP (57 ms)
[ RUN      ] Parameters/TestRpc.TestConnectionKeepalive/SSL_TCP
I20260929 11:23:57.464529   498 acceptor_pool.cc:254] collecting diagnostics on the listening RPC socket 0.0.0.0:35313 every 8 connection(s)
I20260929 11:23:57.464792   499 acceptor_pool.cc:254] collecting diagnostics on the listening RPC socket 0.0.0.0:35313 every 8 connection(s)
I20260929 11:23:57.465785   379 rpc-test.cc:488] Connecting to 0.0.0.0:35313
[       OK ] Parameters/TestRpc.TestConnectionKeepalive/SSL_TCP (1052 ms)
[ RUN      ] Parameters/TestRpc.TestClientConnectionMetrics/SSL_TCP
I20260929 11:23:58.513187   523 acceptor_pool.cc:254] collecting diagnostics on the listening RPC socket 0.0.0.0:45005 every 8 connection(s)
I20260929 11:23:58.513441   524 acceptor_pool.cc:254] collecting diagnostics on the listening RPC socket 0.0.0.0:45005 every 8 connection(s)
I20260929 11:23:58.515401   379 rpc-test.cc:569] Connecting to 0.0.0.0:45005
[       OK ] Parameters/TestRpc.TestClientConnectionMetrics/SSL_TCP (20088 ms)
[ RUN      ] Parameters/TestRpc.TestCredentialsPolicy/SSL_TCP
I20260929 11:24:18.619253   546 acceptor_pool.cc:254] collecting diagnostics on the listening RPC socket 0.0.0.0:41845 every 8 connection(s)
I20260929 11:24:18.619480   547 acceptor_pool.cc:254] collecting diagnostics on the listening RPC socket 0.0.0.0:41845 every 8 connection(s)
I20260929 11:24:18.620545   379 rpc-test.cc:700] Connecting to 0.0.0.0:41845
[       OK ] Parameters/TestRpc.TestCredentialsPolicy/SSL_TCP (74 ms)
[ RUN      ] Parameters/TestRpc.TestCallLongerThanKeepalive/SSL_TCP
I20260929 11:24:18.708442   571 acceptor_pool.cc:254] collecting diagnostics on the listening RPC socket 0.0.0.0:36693 every 8 connection(s)
I20260929 11:24:18.708702   572 acceptor_pool.cc:254] collecting diagnostics on the listening RPC socket 0.0.0.0:36693 every 8 connection(s)
I20260929 11:24:18.743717   575 rpc-test-base.h:222] got call: sleep_micros: 3000000 deferred: true
I20260929 11:24:21.745435   575 rpcz_store.cc:275] Call kudu.rpc.GenericCalculatorService.Sleep from 127.0.0.1:33098 (request call id 0) took 3001 ms. Trace:
I20260929 11:24:21.745645   575 rpcz_store.cc:276] 0929 11:24:18.743582 (+     0us) service_pool.cc:170] Inserting onto call queue
0929 11:24:18.743675 (+    93us) service_pool.cc:227] Handling call
0929 11:24:21.745387 (+3001712us) inbound_call.cc:173] Queueing success response
Metrics: {}
[       OK ] Parameters/TestRpc.TestCallLongerThanKeepalive/SSL_TCP (3088 ms)
[ RUN      ] Parameters/TestRpc.TestRpcSidecar/SSL_TCP
I20260929 11:24:21.767293   596 acceptor_pool.cc:254] collecting diagnostics on the listening RPC socket 0.0.0.0:40287 every 8 connection(s)
I20260929 11:24:21.767508   597 acceptor_pool.cc:254] collecting diagnostics on the listening RPC socket 0.0.0.0:40287 every 8 connection(s)
[       OK ] Parameters/TestRpc.TestRpcSidecar/SSL_TCP (114 ms)
[ RUN      ] Parameters/TestRpc.TestRpcSidecarLimits/SSL_TCP
I20260929 11:24:24.014143   621 acceptor_pool.cc:254] collecting diagnostics on the listening RPC socket 0.0.0.0:37533 every 8 connection(s)
I20260929 11:24:24.014442   622 acceptor_pool.cc:254] collecting diagnostics on the listening RPC socket 0.0.0.0:37533 every 8 connection(s)
W20260929 11:24:24.056993   379 serialization.cc:72] Serialized kudu.rpc_test.PushStringsRequestPB (2147483654 bytes) is larger than the maximum configured RPC message size (52428800 bytes). Sending anyway, but peer may reject the data.
W20260929 11:24:24.062842   619 connection.cc:535] server connection from 127.0.0.1:58074 recv error: Network error: RPC frame had a length of 2147483714, but we only support messages up to 52428800 bytes long.
W20260929 11:24:24.062979   619 connection.cc:158] shutting down server connection from 127.0.0.1:58074 with pending inbound data: 4/2147483714 bytes received; last active 0 ns ago: status Network error: RPC frame had a length of 2147483714, but we only support messages up to 52428800 bytes long.
W20260929 11:24:24.063277   634 connection.cc:698] client connection to 0.0.0.0:37533 send error: Network error: failed to write to TLS socket: Connection reset by peer
W20260929 11:24:24.063580   634 connection.cc:196] Error closing socket: Network error: TlsSocket::Close: Success
I20260929 11:24:24.079748   646 acceptor_pool.cc:254] collecting diagnostics on the listening RPC socket 0.0.0.0:41379 every 8 connection(s)
I20260929 11:24:24.080150   647 acceptor_pool.cc:254] collecting diagnostics on the listening RPC socket 0.0.0.0:41379 every 8 connection(s)
W20260929 11:24:29.402406   644 connection.cc:577] server connection from 127.0.0.1:49252: received bad data: 'Corruption: Invalid packet: message had a length of 2147483710, but we only support messages up to 2147483647 bytes
'
[       OK ] Parameters/TestRpc.TestRpcSidecarLimits/SSL_TCP (8044 ms)
[ RUN      ] Parameters/TestRpc.TestCallTimeoutDoesntAffectNegotiation/SSL_TCP
I20260929 11:24:29.933398   671 acceptor_pool.cc:254] collecting diagnostics on the listening RPC socket 0.0.0.0:36987 every 8 connection(s)
I20260929 11:24:29.933645   672 acceptor_pool.cc:254] collecting diagnostics on the listening RPC socket 0.0.0.0:36987 every 8 connection(s)
W20260929 11:24:29.956722   667 negotiation.cc:266] Injecting 500ms delay in negotiation
I20260929 11:24:30.007220   379 rpc-test-base.h:595] status: Timed out: connection negotiation to 0.0.0.0:36987 for RPC Sleep timed out after 0.050s (ON_OUTBOUND_QUEUE), seconds elapsed: 0.0511826
[       OK ] Parameters/TestRpc.TestCallTimeoutDoesntAffectNegotiation/SSL_TCP (555 ms)
[ RUN      ] Parameters/TestRpc.TestRpcHandlerLatencyMetric/SSL_TCP
I20260929 11:24:30.493528   696 acceptor_pool.cc:254] collecting diagnostics on the listening RPC socket 0.0.0.0:40277 every 8 connection(s)
I20260929 11:24:30.493852   697 acceptor_pool.cc:254] collecting diagnostics on the listening RPC socket 0.0.0.0:40277 every 8 connection(s)
I20260929 11:24:30.530653   379 rpc-test.cc:1236] Sleep() min lat: 20590
I20260929 11:24:30.530764   379 rpc-test.cc:1237] Sleep() mean lat: 20590
I20260929 11:24:30.530827   379 rpc-test.cc:1238] Sleep() max lat: 20590
I20260929 11:24:30.530875   379 rpc-test.cc:1239] Sleep() #calls: 1
[       OK ] Parameters/TestRpc.TestRpcHandlerLatencyMetric/SSL_TCP (68 ms)
[ RUN      ] Parameters/TestRpc.TimedOutOnResponseMetricServiceQueue/SSL_TCP
I20260929 11:24:30.557154   722 acceptor_pool.cc:254] collecting diagnostics on the listening RPC socket 0.0.0.0:41507 every 8 connection(s)
I20260929 11:24:30.557335   723 acceptor_pool.cc:254] collecting diagnostics on the listening RPC socket 0.0.0.0:41507 every 8 connection(s)
W20260929 11:24:30.625272   724 rpcz_store.cc:267] Call kudu.rpc_test.CalculatorService.Sleep from 127.0.0.1:36816 (request call id 2) took 20 ms (client timeout 20 ms). Trace:
W20260929 11:24:30.625443   724 rpcz_store.cc:269] 0929 11:24:30.604723 (+     0us) service_pool.cc:170] Inserting onto call queue
0929 11:24:30.625052 (+ 20329us) service_pool.cc:214] Skipping call since client already timed out
0929 11:24:30.625253 (+   201us) inbound_call.cc:173] Queueing failure response
Metrics: {}
[       OK ] Parameters/TestRpc.TimedOutOnResponseMetricServiceQueue/SSL_TCP (93 ms)
[ RUN      ] Parameters/TestRpc.RpcPendingConnectionsMetric/SSL_TCP
I20260929 11:24:30.634529   745 acceptor_pool.cc:254] collecting diagnostics on the listening RPC socket 0.0.0.0:46497 every 8 connection(s)
I20260929 11:24:30.634752   746 acceptor_pool.cc:254] collecting diagnostics on the listening RPC socket 0.0.0.0:46497 every 8 connection(s)
W20260929 11:24:30.645143   741 negotiation.cc:337] Failed RPC negotiation. Trace:
0929 11:24:30.644441 (+     0us) reactor.cc:625] Submitting negotiation task for server connection from 127.0.0.1:51284 (local address 127.0.0.1:46497)
0929 11:24:30.644627 (+   186us) server_negotiation.cc:206] Beginning negotiation
0929 11:24:30.644631 (+     4us) server_negotiation.cc:399] Waiting for connection header
0929 11:24:30.644757 (+   126us) negotiation.cc:327] Negotiation complete: Network error: Server connection negotiation failed: server connection from 127.0.0.1:51284: BlockingRecv error: recv got EOF from 127.0.0.1:51284 (error 108)
Metrics: {"server-negotiator.queue_time_us":65}
[       OK ] Parameters/TestRpc.RpcPendingConnectionsMetric/SSL_TCP (27 ms)
[ RUN      ] Parameters/TestRpc.TestRpcContextClientDeadline/SSL_TCP
I20260929 11:24:30.672245   761 acceptor_pool.cc:254] collecting diagnostics on the listening RPC socket 0.0.0.0:39129 every 8 connection(s)
I20260929 11:24:30.672466   762 acceptor_pool.cc:254] collecting diagnostics on the listening RPC socket 0.0.0.0:39129 every 8 connection(s)
[       OK ] Parameters/TestRpc.TestRpcContextClientDeadline/SSL_TCP (59 ms)
[ RUN      ] Parameters/TestRpc.TestApplicationFeatureFlagUnsupportedServer/SSL_TCP
I20260929 11:24:30.753705   786 acceptor_pool.cc:254] collecting diagnostics on the listening RPC socket 0.0.0.0:36057 every 8 connection(s)
I20260929 11:24:30.753926   787 acceptor_pool.cc:254] collecting diagnostics on the listening RPC socket 0.0.0.0:36057 every 8 connection(s)
[       OK ] Parameters/TestRpc.TestApplicationFeatureFlagUnsupportedServer/SSL_TCP (61 ms)
[ RUN      ] Parameters/TestRpc.TestCancellationAsync/SSL_TCP
I20260929 11:24:30.797961   811 acceptor_pool.cc:254] collecting diagnostics on the listening RPC socket 0.0.0.0:40101 every 8 connection(s)
I20260929 11:24:30.798189   812 acceptor_pool.cc:254] collecting diagnostics on the listening RPC socket 0.0.0.0:40101 every 8 connection(s)
I20260929 11:24:30.798969   379 rpc-test.cc:1716] Connecting to 0.0.0.0:40101
I20260929 11:24:30.815824   379 test_util.cc:268] Using random seed: 1830930982
I20260929 11:24:30.853485   815 rpc-test-base.h:240] got call: sleep_micros: 500 pattern: 4294967295 num_repetitions: 2097152 sidecar_idx: 0
I20260929 11:24:30.879992   814 rpc-test-base.h:240] got call: sleep_micros: 500 pattern: 4294967295 num_repetitions: 2097152 sidecar_idx: 0
I20260929 11:24:30.907433   813 rpc-test-base.h:240] got call: sleep_micros: 500 pattern: 4294967295 num_repetitions: 2097152 sidecar_idx: 0
I20260929 11:24:30.934290   815 rpc-test-base.h:240] got call: sleep_micros: 500 pattern: 4294967295 num_repetitions: 2097152 sidecar_idx: 0
I20260929 11:24:30.960850   813 rpc-test-base.h:240] got call: sleep_micros: 500 pattern: 4294967295 num_repetitions: 2097152 sidecar_idx: 0
I20260929 11:24:30.986387   814 rpc-test-base.h:240] got call: sleep_micros: 500 pattern: 4294967295 num_repetitions: 2097152 sidecar_idx: 0
W20260929 11:24:31.010811   810 connection.cc:196] Error closing socket: Network error: TlsSocket::Close: Broken pipe
W20260929 11:24:31.018663   810 connection.cc:441] server connection from 127.0.0.1:54164 torn down before Call kudu.rpc.GenericCalculatorService.SleepWithSidecar from 127.0.0.1:54164 (request call id 7) could send its response
W20260929 11:24:31.030391   810 connection.cc:441] server connection from 127.0.0.1:54164 torn down before Call kudu.rpc.GenericCalculatorService.SleepWithSidecar from 127.0.0.1:54164 (request call id 8) could send its response
[       OK ] Parameters/TestRpc.TestCancellationAsync/SSL_TCP (254 ms)
[ RUN      ] Parameters/TestRpc.TestPerformanceBySocketType/SSL_TCP
I20260929 11:24:31.066088   836 acceptor_pool.cc:254] collecting diagnostics on the listening RPC socket 0.0.0.0:36411 every 8 connection(s)
I20260929 11:24:31.066438   837 acceptor_pool.cc:254] collecting diagnostics on the listening RPC socket 0.0.0.0:36411 every 8 connection(s)
I20260929 11:24:31.067397   379 rpc-test.cc:1846] Connecting to 0.0.0.0:36411
I20260929 11:24:34.134833   379 rpc-test.cc:1859] Sending 1024MB via ssl-enabled tcp socket: real 3.030s	user 2.883s	sys 2.189s
I20260929 11:24:37.144260   379 rpc-test.cc:1859] Sending 1024MB via ssl-enabled tcp socket: real 3.009s	user 2.661s	sys 2.323s
I20260929 11:24:40.157317   379 rpc-test.cc:1859] Sending 1024MB via ssl-enabled tcp socket: real 3.013s	user 2.672s	sys 2.358s
I20260929 11:24:43.246261   379 rpc-test.cc:1859] Sending 1024MB via ssl-enabled tcp socket: real 3.089s	user 2.728s	sys 2.379s
I20260929 11:24:46.297945   379 rpc-test.cc:1859] Sending 1024MB via ssl-enabled tcp socket: real 3.052s	user 2.798s	sys 2.295s
[       OK ] Parameters/TestRpc.TestPerformanceBySocketType/SSL_TCP (15272 ms)
[----------] 20 tests from Parameters/TestRpc (49108 ms total)

[----------] 1 test from Parameters/TestRpcSocketTxRxQueue
[ RUN      ] Parameters/TestRpcSocketTxRxQueue.OverCapacity/0
W20260929 11:24:46.610276   898 negotiation.cc:337] Failed RPC negotiation. Trace:
0929 11:24:46.326139 (+     0us) reactor.cc:625] Submitting negotiation task for client connection to 0.0.0.0:41921 (local address 127.0.0.1:47304)
0929 11:24:46.326430 (+   291us) negotiation.cc:107] Waiting for socket to connect
0929 11:24:46.326450 (+    20us) client_negotiation.cc:174] Beginning negotiation
0929 11:24:46.326621 (+   171us) client_negotiation.cc:252] Sending NEGOTIATE NegotiatePB request
0929 11:24:46.609824 (+283203us) negotiation.cc:327] Negotiation complete: Network error: Client connection negotiation failed: client connection to 0.0.0.0:41921: BlockingRecv error: recv error from unknown peer: Transport endpoint is not connected (error 107)
Metrics: {"client-negotiator.queue_time_us":85}
W20260929 11:24:46.611066   853 negotiation.cc:337] Failed RPC negotiation. Trace:
0929 11:24:46.311189 (+     0us) reactor.cc:625] Submitting negotiation task for client connection to 0.0.0.0:41921 (local address 127.0.0.1:47268)
0929 11:24:46.311362 (+   173us) negotiation.cc:107] Waiting for socket to connect
0929 11:24:46.311380 (+    18us) client_negotiation.cc:174] Beginning negotiation
0929 11:24:46.311493 (+   113us) client_negotiation.cc:252] Sending NEGOTIATE NegotiatePB request
0929 11:24:46.609824 (+298331us) negotiation.cc:327] Negotiation complete: Network error: Client connection negotiation failed: client connection to 0.0.0.0:41921: BlockingRecv error: recv error from unknown peer: Transport endpoint is not connected (error 107)
Metrics: {"client-negotiator.queue_time_us":51}
W20260929 11:24:46.611192   862 negotiation.cc:337] Failed RPC negotiation. Trace:
0929 11:24:46.313758 (+     0us) reactor.cc:625] Submitting negotiation task for client connection to 0.0.0.0:41921 (local address 127.0.0.1:47272)
0929 11:24:46.313955 (+   197us) negotiation.cc:107] Waiting for socket to connect
0929 11:24:46.313976 (+    21us) client_negotiation.cc:174] Beginning negotiation
0929 11:24:46.314079 (+   103us) client_negotiation.cc:252] Sending NEGOTIATE NegotiatePB request
0929 11:24:46.609912 (+295833us) negotiation.cc:327] Negotiation complete: Network error: Client connection negotiation failed: client connection to 0.0.0.0:41921: BlockingRecv error: recv error from unknown peer: Transport endpoint is not connected (error 107)
Metrics: {"client-negotiator.queue_time_us":54}
W20260929 11:24:46.612075   889 negotiation.cc:337] Failed RPC negotiation. Trace:
0929 11:24:46.323004 (+     0us) reactor.cc:625] Submitting negotiation task for client connection to 0.0.0.0:41921 (local address 127.0.0.1:47300)
0929 11:24:46.323200 (+   196us) negotiation.cc:107] Waiting for socket to connect
0929 11:24:46.323232 (+    32us) client_negotiation.cc:174] Beginning negotiation
0929 11:24:46.323349 (+   117us) client_negotiation.cc:252] Sending NEGOTIATE NegotiatePB request
0929 11:24:46.610457 (+287108us) negotiation.cc:327] Negotiation complete: Network error: Client connection negotiation failed: client connection to 0.0.0.0:41921: BlockingRecv error: recv error from unknown peer: Transport endpoint is not connected (error 107)
Metrics: {"client-negotiator.queue_time_us":57}
W20260929 11:24:46.613255   871 negotiation.cc:337] Failed RPC negotiation. Trace:
0929 11:24:46.316518 (+     0us) reactor.cc:625] Submitting negotiation task for client connection to 0.0.0.0:41921 (local address 127.0.0.1:47286)
0929 11:24:46.316784 (+   266us) negotiation.cc:107] Waiting for socket to connect
0929 11:24:46.316809 (+    25us) client_negotiation.cc:174] Beginning negotiation
0929 11:24:46.316930 (+   121us) client_negotiation.cc:252] Sending NEGOTIATE NegotiatePB request
0929 11:24:46.610012 (+293082us) negotiation.cc:327] Negotiation complete: Network error: Client connection negotiation failed: client connection to 0.0.0.0:41921: BlockingRecv error: recv error from unknown peer: Transport endpoint is not connected (error 107)
Metrics: {"client-negotiator.queue_time_us":68}
W20260929 11:24:46.617208   880 negotiation.cc:337] Failed RPC negotiation. Trace:
0929 11:24:46.320047 (+     0us) reactor.cc:625] Submitting negotiation task for client connection to 0.0.0.0:41921 (local address 127.0.0.1:47290)
0929 11:24:46.320261 (+   214us) negotiation.cc:107] Waiting for socket to connect
0929 11:24:46.320288 (+    27us) client_negotiation.cc:174] Beginning negotiation
0929 11:24:46.320405 (+   117us) client_negotiation.cc:252] Sending NEGOTIATE NegotiatePB request
0929 11:24:46.610025 (+289620us) negotiation.cc:327] Negotiation complete: Network error: Client connection negotiation failed: client connection to 0.0.0.0:41921: BlockingRecv error: recv error from unknown peer: Transport endpoint is not connected (error 107)
Metrics: {"client-negotiator.queue_time_us":79}
[       OK ] Parameters/TestRpcSocketTxRxQueue.OverCapacity/0 (1082 ms)
[----------] 1 test from Parameters/TestRpcSocketTxRxQueue (1082 ms total)

[----------] Global test environment tear-down
[==========] 21 tests from 2 test suites ran. (50191 ms total)
[  PASSED  ] 20 tests.
[  FAILED  ] 1 test, listed below:
[  FAILED  ] Parameters/TestRpc.TestCallWithChainCertAndChainCA/SSL_TCP, where GetParam() = (true, false)

 1 FAILED TEST