Diagnosed failure

Parameters/TestRpc.TestCallWithChainCertAndChainCA/SSL_UnixSocket: /data0/somelongdirectorytoavoidrpathissues/src/kudu/src/kudu/rpc/rpc-test.cc:270: Failure
Failed
Bad status: Runtime error: could not verify certificate chain (error with cert: subject=CN = localhost, ST = sadfjas, C = AS, emailAddress = sdflkdsajf, O = lskdfjlsad, OU = sldfkja, issuer=C = AS, ST = ASDfkjdhf, L = lskdjf, O = saldfja, OU = skdjf, CN = localhost, emailAddress = sadjflkadsj): : certificate has expired
Google Test trace:
/data0/somelongdirectorytoavoidrpathissues/src/kudu/src/kudu/rpc/rpc-test.cc:267: Connecting to unix:/tmp/dist-test-taskzkFmMP/test-tmp/rpc-test-c04925de5de14919a0c3986f21993019.sock
I20260925 01:27:40.877209  8942 test_util.cc:175] -----------------------------------------------
I20260925 01:27:40.877265  8942 test_util.cc:176] Had fatal failures, leaving test files at /tmp/dist-test-taskzkFmMP/test-tmp/rpc-test.6.Parameters_TestRpc.TestCallWithChainCertAndChainCA_SSL_UnixSocket.1790299660792039-8942-0

Full log

Note: This is test shard 7 of 8.
[==========] Running 21 tests from 2 test suites.
[----------] Global test environment set-up.
[----------] 20 tests from Parameters/TestRpc
[ RUN      ] Parameters/TestRpc.TestMessengerCreateDestroy/SSL_UnixSocket
WARNING: Logging before InitGoogleLogging() is written to STDERR
I20260925 01:27:40.824472  8942 rpc-test.cc:169] started messenger TestCreateDestroy
[       OK ] Parameters/TestRpc.TestMessengerCreateDestroy/SSL_UnixSocket (27 ms)
[ RUN      ] Parameters/TestRpc.TestNegotiationDeadlock/SSL_UnixSocket
I20260925 01:27:40.833643  8962 acceptor_pool.cc:254] collecting diagnostics on the listening RPC socket unix:/tmp/dist-test-taskzkFmMP/test-tmp/rpc-test-03c82219ddf644c88ca7045893e1102a.sock every 8 connection(s)
I20260925 01:27:40.833693  8963 acceptor_pool.cc:254] collecting diagnostics on the listening RPC socket unix:/tmp/dist-test-taskzkFmMP/test-tmp/rpc-test-03c82219ddf644c88ca7045893e1102a.sock every 8 connection(s)
[       OK ] Parameters/TestRpc.TestNegotiationDeadlock/SSL_UnixSocket (18 ms)
[ RUN      ] Parameters/TestRpc.TestCallWithChainCertAndChainCA/SSL_UnixSocket
I20260925 01:27:40.871707  8978 acceptor_pool.cc:254] collecting diagnostics on the listening RPC socket unix:/tmp/dist-test-taskzkFmMP/test-tmp/rpc-test-c04925de5de14919a0c3986f21993019.sock every 8 connection(s)
I20260925 01:27:40.871766  8979 acceptor_pool.cc:254] collecting diagnostics on the listening RPC socket unix:/tmp/dist-test-taskzkFmMP/test-tmp/rpc-test-c04925de5de14919a0c3986f21993019.sock every 8 connection(s)
/data0/somelongdirectorytoavoidrpathissues/src/kudu/src/kudu/rpc/rpc-test.cc:270: Failure
Failed
Bad status: Runtime error: could not verify certificate chain (error with cert: subject=CN = localhost, ST = sadfjas, C = AS, emailAddress = sdflkdsajf, O = lskdfjlsad, OU = sldfkja, issuer=C = AS, ST = ASDfkjdhf, L = lskdjf, O = saldfja, OU = skdjf, CN = localhost, emailAddress = sadjflkadsj): : certificate has expired
Google Test trace:
/data0/somelongdirectorytoavoidrpathissues/src/kudu/src/kudu/rpc/rpc-test.cc:267: Connecting to unix:/tmp/dist-test-taskzkFmMP/test-tmp/rpc-test-c04925de5de14919a0c3986f21993019.sock
I20260925 01:27:40.877209  8942 test_util.cc:175] -----------------------------------------------
I20260925 01:27:40.877265  8942 test_util.cc:176] Had fatal failures, leaving test files at /tmp/dist-test-taskzkFmMP/test-tmp/rpc-test.6.Parameters_TestRpc.TestCallWithChainCertAndChainCA_SSL_UnixSocket.1790299660792039-8942-0
[  FAILED  ] Parameters/TestRpc.TestCallWithChainCertAndChainCA/SSL_UnixSocket, where GetParam() = (true, true) (31 ms)
[ RUN      ] Parameters/TestRpc.TestCallWithPasswordProtectedKey/SSL_UnixSocket
I20260925 01:27:40.887159  9003 acceptor_pool.cc:254] collecting diagnostics on the listening RPC socket unix:/tmp/dist-test-taskzkFmMP/test-tmp/rpc-test-ed38238d046642329d9a4ff5fefadddd.sock every 8 connection(s)
I20260925 01:27:40.887207  9004 acceptor_pool.cc:254] collecting diagnostics on the listening RPC socket unix:/tmp/dist-test-taskzkFmMP/test-tmp/rpc-test-ed38238d046642329d9a4ff5fefadddd.sock every 8 connection(s)
W20260925 01:27:40.904904  9000 connection.cc:196] Error closing socket: Network error: TlsSocket::Close: Broken pipe
[       OK ] Parameters/TestRpc.TestCallWithPasswordProtectedKey/SSL_UnixSocket (29 ms)
[ RUN      ] Parameters/TestRpc.TestCallToBadServer/SSL_UnixSocket
I20260925 01:27:40.918190  8942 rpc-test.cc:394] Status: Network error: Client connection negotiation failed: client connection to 0.0.0.0:0: connect: Connection refused (error 111)
I20260925 01:27:40.918712  8942 rpc-test.cc:394] Status: Network error: Client connection negotiation failed: client connection to 0.0.0.0:0: connect: Connection refused (error 111)
I20260925 01:27:40.919169  8942 rpc-test.cc:394] Status: Network error: Client connection negotiation failed: client connection to 0.0.0.0:0: connect: Connection refused (error 111)
I20260925 01:27:40.919631  8942 rpc-test.cc:394] Status: Network error: Client connection negotiation failed: client connection to 0.0.0.0:0: connect: Connection refused (error 111)
I20260925 01:27:40.920083  8942 rpc-test.cc:394] Status: Network error: Client connection negotiation failed: client connection to 0.0.0.0:0: connect: Connection refused (error 111)
[       OK ] Parameters/TestRpc.TestCallToBadServer/SSL_UnixSocket (14 ms)
[ RUN      ] Parameters/TestRpc.TestWrongService/SSL_UnixSocket
I20260925 01:27:40.928194  9038 acceptor_pool.cc:254] collecting diagnostics on the listening RPC socket unix:/tmp/dist-test-taskzkFmMP/test-tmp/rpc-test-a260997ba8f945bbbedb9d3af885bd29.sock every 8 connection(s)
I20260925 01:27:40.928200  9039 acceptor_pool.cc:254] collecting diagnostics on the listening RPC socket unix:/tmp/dist-test-taskzkFmMP/test-tmp/rpc-test-a260997ba8f945bbbedb9d3af885bd29.sock every 8 connection(s)
I20260925 01:27:40.949683  9035 messenger.cc:345] service WrongServiceName not registered on TestServer
[       OK ] Parameters/TestRpc.TestWrongService/SSL_UnixSocket (31 ms)
[ RUN      ] Parameters/TestRpc.TestConnectionKeepalive/SSL_UnixSocket
I20260925 01:27:40.972503  9061 acceptor_pool.cc:254] collecting diagnostics on the listening RPC socket unix:/tmp/dist-test-taskzkFmMP/test-tmp/rpc-test-bb2a169725914ca0b7d55a4747d9dd15.sock every 8 connection(s)
I20260925 01:27:40.972556  9062 acceptor_pool.cc:254] collecting diagnostics on the listening RPC socket unix:/tmp/dist-test-taskzkFmMP/test-tmp/rpc-test-bb2a169725914ca0b7d55a4747d9dd15.sock every 8 connection(s)
I20260925 01:27:40.972900  8942 rpc-test.cc:488] Connecting to unix:/tmp/dist-test-taskzkFmMP/test-tmp/rpc-test-bb2a169725914ca0b7d55a4747d9dd15.sock
W20260925 01:27:41.453954  9074 connection.cc:196] Error closing socket: Network error: TlsSocket::Close: Broken pipe
[       OK ] Parameters/TestRpc.TestConnectionKeepalive/SSL_UnixSocket (1043 ms)
[ RUN      ] Parameters/TestRpc.TestClientConnectionMetrics/SSL_UnixSocket
I20260925 01:27:42.011937  9086 acceptor_pool.cc:254] collecting diagnostics on the listening RPC socket unix:/tmp/dist-test-taskzkFmMP/test-tmp/rpc-test-40c1fed65a6a4417b84f97c19653576f.sock every 8 connection(s)
I20260925 01:27:42.011945  9087 acceptor_pool.cc:254] collecting diagnostics on the listening RPC socket unix:/tmp/dist-test-taskzkFmMP/test-tmp/rpc-test-40c1fed65a6a4417b84f97c19653576f.sock every 8 connection(s)
I20260925 01:27:42.012269  8942 rpc-test.cc:569] Connecting to unix:/tmp/dist-test-taskzkFmMP/test-tmp/rpc-test-40c1fed65a6a4417b84f97c19653576f.sock
W20260925 01:27:53.544183  9083 connection.cc:196] Error closing socket: Network error: TlsSocket::Close: Broken pipe
[       OK ] Parameters/TestRpc.TestClientConnectionMetrics/SSL_UnixSocket (11549 ms)
[ RUN      ] Parameters/TestRpc.TestCredentialsPolicy/SSL_UnixSocket
I20260925 01:27:53.585569  9109 acceptor_pool.cc:254] collecting diagnostics on the listening RPC socket unix:/tmp/dist-test-taskzkFmMP/test-tmp/rpc-test-6640e385e2f04bf0aa5955dbba07d3ab.sock every 8 connection(s)
I20260925 01:27:53.585604  9110 acceptor_pool.cc:254] collecting diagnostics on the listening RPC socket unix:/tmp/dist-test-taskzkFmMP/test-tmp/rpc-test-6640e385e2f04bf0aa5955dbba07d3ab.sock every 8 connection(s)
I20260925 01:27:53.585948  8942 rpc-test.cc:700] Connecting to unix:/tmp/dist-test-taskzkFmMP/test-tmp/rpc-test-6640e385e2f04bf0aa5955dbba07d3ab.sock
W20260925 01:27:53.603536  9108 connection.cc:196] Error closing socket: Network error: TlsSocket::Close: Broken pipe
W20260925 01:27:53.609054  9108 connection.cc:196] Error closing socket: Network error: TlsSocket::Close: Broken pipe
[       OK ] Parameters/TestRpc.TestCredentialsPolicy/SSL_UnixSocket (64 ms)
[ RUN      ] Parameters/TestRpc.TestCallLongerThanKeepalive/SSL_UnixSocket
I20260925 01:27:53.628371  9134 acceptor_pool.cc:254] collecting diagnostics on the listening RPC socket unix:/tmp/dist-test-taskzkFmMP/test-tmp/rpc-test-dbfd83fe7f824dc0aceaa0238b42208f.sock every 8 connection(s)
I20260925 01:27:53.628399  9135 acceptor_pool.cc:254] collecting diagnostics on the listening RPC socket unix:/tmp/dist-test-taskzkFmMP/test-tmp/rpc-test-dbfd83fe7f824dc0aceaa0238b42208f.sock every 8 connection(s)
I20260925 01:27:53.648391  9138 rpc-test-base.h:222] got call: sleep_micros: 3000000 deferred: true
I20260925 01:27:56.649294  9138 rpcz_store.cc:275] Call kudu.rpc.GenericCalculatorService.Sleep from unix:<unnamed> (request call id 0) took 3001 ms. Trace:
I20260925 01:27:56.649410  9138 rpcz_store.cc:276] 0925 01:27:53.648300 (+     0us) service_pool.cc:170] Inserting onto call queue
0925 01:27:53.648362 (+    62us) service_pool.cc:227] Handling call
0925 01:27:56.649271 (+3000909us) inbound_call.cc:173] Queueing success response
Metrics: {}
W20260925 01:27:56.651006  9131 connection.cc:196] Error closing socket: Network error: TlsSocket::Close: Broken pipe
[       OK ] Parameters/TestRpc.TestCallLongerThanKeepalive/SSL_UnixSocket (3042 ms)
[ RUN      ] Parameters/TestRpc.TestRpcSidecar/SSL_UnixSocket
I20260925 01:27:56.673308  9159 acceptor_pool.cc:254] collecting diagnostics on the listening RPC socket unix:/tmp/dist-test-taskzkFmMP/test-tmp/rpc-test-5abb41944a0f4f57bf61d3b399e675b9.sock every 8 connection(s)
I20260925 01:27:56.673353  9160 acceptor_pool.cc:254] collecting diagnostics on the listening RPC socket unix:/tmp/dist-test-taskzkFmMP/test-tmp/rpc-test-5abb41944a0f4f57bf61d3b399e675b9.sock every 8 connection(s)
W20260925 01:27:56.735190  9156 connection.cc:196] Error closing socket: Network error: TlsSocket::Close: Broken pipe
[       OK ] Parameters/TestRpc.TestRpcSidecar/SSL_UnixSocket (85 ms)
[ RUN      ] Parameters/TestRpc.TestRpcSidecarLimits/SSL_UnixSocket
I20260925 01:27:58.522006  9184 acceptor_pool.cc:254] collecting diagnostics on the listening RPC socket unix:/tmp/dist-test-taskzkFmMP/test-tmp/rpc-test-286f669892fd421f8185b39da63b4675.sock every 8 connection(s)
I20260925 01:27:58.522035  9185 acceptor_pool.cc:254] collecting diagnostics on the listening RPC socket unix:/tmp/dist-test-taskzkFmMP/test-tmp/rpc-test-286f669892fd421f8185b39da63b4675.sock every 8 connection(s)
W20260925 01:27:58.547143  8942 serialization.cc:72] Serialized kudu.rpc_test.PushStringsRequestPB (2147483654 bytes) is larger than the maximum configured RPC message size (52428800 bytes). Sending anyway, but peer may reject the data.
W20260925 01:27:58.551466  9181 connection.cc:535] server connection from unix:<unnamed> recv error: Network error: RPC frame had a length of 2147483714, but we only support messages up to 52428800 bytes long.
W20260925 01:27:58.551541  9181 connection.cc:158] shutting down server connection from unix:<unnamed> with pending inbound data: 4/2147483714 bytes received; last active 0 ns ago: status Network error: RPC frame had a length of 2147483714, but we only support messages up to 52428800 bytes long.
W20260925 01:27:58.551789  9197 connection.cc:698] client connection to unix:/tmp/dist-test-taskzkFmMP/test-tmp/rpc-test-286f669892fd421f8185b39da63b4675.sock send error: Network error: failed to write to TLS socket: Broken pipe
W20260925 01:27:58.552006  9197 connection.cc:196] Error closing socket: Network error: TlsSocket::Close: Success
I20260925 01:27:58.568473  9209 acceptor_pool.cc:254] collecting diagnostics on the listening RPC socket unix:/tmp/dist-test-taskzkFmMP/test-tmp/rpc-test-286f669892fd421f8185b39da63b4675.sock every 8 connection(s)
I20260925 01:27:58.568797  9210 acceptor_pool.cc:254] collecting diagnostics on the listening RPC socket unix:/tmp/dist-test-taskzkFmMP/test-tmp/rpc-test-286f669892fd421f8185b39da63b4675.sock every 8 connection(s)
W20260925 01:28:03.798657  9206 connection.cc:577] server connection from unix:<unnamed>: received bad data: 'Corruption: Invalid packet: message had a length of 2147483710, but we only support messages up to 2147483647 bytes
'
W20260925 01:28:03.799064  9222 connection.cc:196] Error closing socket: Network error: TlsSocket::Close: Broken pipe
[       OK ] Parameters/TestRpc.TestRpcSidecarLimits/SSL_UnixSocket (7063 ms)
[ RUN      ] Parameters/TestRpc.TestCallTimeoutDoesntAffectNegotiation/SSL_UnixSocket
I20260925 01:28:03.818621  9234 acceptor_pool.cc:254] collecting diagnostics on the listening RPC socket unix:/tmp/dist-test-taskzkFmMP/test-tmp/rpc-test-6d054c885a64413e97a32ad7346cbadb.sock every 8 connection(s)
I20260925 01:28:03.818687  9235 acceptor_pool.cc:254] collecting diagnostics on the listening RPC socket unix:/tmp/dist-test-taskzkFmMP/test-tmp/rpc-test-6d054c885a64413e97a32ad7346cbadb.sock every 8 connection(s)
W20260925 01:28:03.827201  9229 negotiation.cc:266] Injecting 500ms delay in negotiation
I20260925 01:28:03.877705  8942 rpc-test-base.h:595] status: Timed out: connection negotiation to unix:/tmp/dist-test-taskzkFmMP/test-tmp/rpc-test-6d054c885a64413e97a32ad7346cbadb.sock for RPC Sleep timed out after 0.050s (ON_OUTBOUND_QUEUE), seconds elapsed: 0.0510114
W20260925 01:28:04.333988  9231 connection.cc:196] Error closing socket: Network error: TlsSocket::Close: Broken pipe
[       OK ] Parameters/TestRpc.TestCallTimeoutDoesntAffectNegotiation/SSL_UnixSocket (533 ms)
[ RUN      ] Parameters/TestRpc.TestRpcHandlerLatencyMetric/SSL_UnixSocket
I20260925 01:28:04.361248  9259 acceptor_pool.cc:254] collecting diagnostics on the listening RPC socket unix:/tmp/dist-test-taskzkFmMP/test-tmp/rpc-test-c9767d78742842ffb080d025cc872803.sock every 8 connection(s)
I20260925 01:28:04.361340  9260 acceptor_pool.cc:254] collecting diagnostics on the listening RPC socket unix:/tmp/dist-test-taskzkFmMP/test-tmp/rpc-test-c9767d78742842ffb080d025cc872803.sock every 8 connection(s)
I20260925 01:28:04.410641  8942 rpc-test.cc:1236] Sleep() min lat: 20543
I20260925 01:28:04.410715  8942 rpc-test.cc:1237] Sleep() mean lat: 20543
I20260925 01:28:04.410744  8942 rpc-test.cc:1238] Sleep() max lat: 20543
I20260925 01:28:04.410758  8942 rpc-test.cc:1239] Sleep() #calls: 1
[       OK ] Parameters/TestRpc.TestRpcHandlerLatencyMetric/SSL_UnixSocket (77 ms)
[ RUN      ] Parameters/TestRpc.TimedOutOnResponseMetricServiceQueue/SSL_UnixSocket
I20260925 01:28:04.428357  9285 acceptor_pool.cc:254] collecting diagnostics on the listening RPC socket unix:/tmp/dist-test-taskzkFmMP/test-tmp/rpc-test-6224d950e2f446a1be99a6e429638e8d.sock every 8 connection(s)
I20260925 01:28:04.428406  9286 acceptor_pool.cc:254] collecting diagnostics on the listening RPC socket unix:/tmp/dist-test-taskzkFmMP/test-tmp/rpc-test-6224d950e2f446a1be99a6e429638e8d.sock every 8 connection(s)
W20260925 01:28:04.492149  9287 rpcz_store.cc:267] Call kudu.rpc_test.CalculatorService.Sleep from unix:<unnamed> (request call id 2) took 20 ms (client timeout 20 ms). Trace:
W20260925 01:28:04.492331  9287 rpcz_store.cc:269] 0925 01:28:04.471682 (+     0us) service_pool.cc:170] Inserting onto call queue
0925 01:28:04.492068 (+ 20386us) service_pool.cc:214] Skipping call since client already timed out
0925 01:28:04.492101 (+    33us) inbound_call.cc:173] Queueing failure response
Metrics: {}
W20260925 01:28:04.493197  9282 connection.cc:196] Error closing socket: Network error: TlsSocket::Close: Broken pipe
[       OK ] Parameters/TestRpc.TimedOutOnResponseMetricServiceQueue/SSL_UnixSocket (81 ms)
[ RUN      ] Parameters/TestRpc.RpcPendingConnectionsMetric/SSL_UnixSocket
I20260925 01:28:04.497041  9308 acceptor_pool.cc:254] collecting diagnostics on the listening RPC socket 0.0.0.0:33681 every 8 connection(s)
I20260925 01:28:04.497083  9309 acceptor_pool.cc:254] collecting diagnostics on the listening RPC socket 0.0.0.0:33681 every 8 connection(s)
W20260925 01:28:04.498252  9304 negotiation.cc:337] Failed RPC negotiation. Trace:
0925 01:28:04.497819 (+     0us) reactor.cc:625] Submitting negotiation task for server connection from 127.0.0.1:42478 (local address 127.0.0.1:33681)
0925 01:28:04.497949 (+   130us) server_negotiation.cc:206] Beginning negotiation
0925 01:28:04.497953 (+     4us) server_negotiation.cc:399] Waiting for connection header
0925 01:28:04.498048 (+    95us) negotiation.cc:327] Negotiation complete: Network error: Server connection negotiation failed: server connection from 127.0.0.1:42478: BlockingRecv error: recv got EOF from 127.0.0.1:42478 (error 108)
Metrics: {"server-negotiator.queue_time_us":62}
[       OK ] Parameters/TestRpc.RpcPendingConnectionsMetric/SSL_UnixSocket (14 ms)
[ RUN      ] Parameters/TestRpc.TestRpcContextClientDeadline/SSL_UnixSocket
I20260925 01:28:04.519351  9324 acceptor_pool.cc:254] collecting diagnostics on the listening RPC socket unix:/tmp/dist-test-taskzkFmMP/test-tmp/rpc-test-b67e66b9143e4831ab2b515cba2ebc59.sock every 8 connection(s)
I20260925 01:28:04.519390  9325 acceptor_pool.cc:254] collecting diagnostics on the listening RPC socket unix:/tmp/dist-test-taskzkFmMP/test-tmp/rpc-test-b67e66b9143e4831ab2b515cba2ebc59.sock every 8 connection(s)
W20260925 01:28:04.561672  9321 connection.cc:196] Error closing socket: Network error: TlsSocket::Close: Broken pipe
[       OK ] Parameters/TestRpc.TestRpcContextClientDeadline/SSL_UnixSocket (53 ms)
[ RUN      ] Parameters/TestRpc.TestApplicationFeatureFlagUnsupportedServer/SSL_UnixSocket
I20260925 01:28:04.595089  9349 acceptor_pool.cc:254] collecting diagnostics on the listening RPC socket unix:/tmp/dist-test-taskzkFmMP/test-tmp/rpc-test-09e6aaae62404e45b11aec5e146c6d16.sock every 8 connection(s)
I20260925 01:28:04.595137  9350 acceptor_pool.cc:254] collecting diagnostics on the listening RPC socket unix:/tmp/dist-test-taskzkFmMP/test-tmp/rpc-test-09e6aaae62404e45b11aec5e146c6d16.sock every 8 connection(s)
[       OK ] Parameters/TestRpc.TestApplicationFeatureFlagUnsupportedServer/SSL_UnixSocket (50 ms)
[ RUN      ] Parameters/TestRpc.TestCancellationAsync/SSL_UnixSocket
I20260925 01:28:04.631047  9374 acceptor_pool.cc:254] collecting diagnostics on the listening RPC socket unix:/tmp/dist-test-taskzkFmMP/test-tmp/rpc-test-c7f67bf82b9f4a97955ced7341ec5173.sock every 8 connection(s)
I20260925 01:28:04.631075  9375 acceptor_pool.cc:254] collecting diagnostics on the listening RPC socket unix:/tmp/dist-test-taskzkFmMP/test-tmp/rpc-test-c7f67bf82b9f4a97955ced7341ec5173.sock every 8 connection(s)
I20260925 01:28:04.631384  8942 rpc-test.cc:1716] Connecting to unix:/tmp/dist-test-taskzkFmMP/test-tmp/rpc-test-c7f67bf82b9f4a97955ced7341ec5173.sock
I20260925 01:28:04.649765  8942 test_util.cc:268] Using random seed: -1598112991
I20260925 01:28:04.667305  9378 rpc-test-base.h:240] got call: sleep_micros: 500 pattern: 4294967295 num_repetitions: 2097152 sidecar_idx: 0
I20260925 01:28:04.684741  9377 rpc-test-base.h:240] got call: sleep_micros: 500 pattern: 4294967295 num_repetitions: 2097152 sidecar_idx: 0
I20260925 01:28:04.702857  9378 rpc-test-base.h:240] got call: sleep_micros: 500 pattern: 4294967295 num_repetitions: 2097152 sidecar_idx: 0
I20260925 01:28:04.719254  9377 rpc-test-base.h:240] got call: sleep_micros: 500 pattern: 4294967295 num_repetitions: 2097152 sidecar_idx: 0
I20260925 01:28:04.735219  9378 rpc-test-base.h:240] got call: sleep_micros: 500 pattern: 4294967295 num_repetitions: 2097152 sidecar_idx: 0
I20260925 01:28:04.752727  9377 rpc-test-base.h:240] got call: sleep_micros: 500 pattern: 4294967295 num_repetitions: 2097152 sidecar_idx: 0
I20260925 01:28:04.768803  9378 rpc-test-base.h:240] got call: sleep_micros: 500 pattern: 4294967295 num_repetitions: 2097152 sidecar_idx: 0
I20260925 01:28:04.785104  9377 rpc-test-base.h:240] got call: sleep_micros: 500 pattern: 4294967295 num_repetitions: 2097152 sidecar_idx: 0
W20260925 01:28:04.787384  9371 connection.cc:196] Error closing socket: Network error: TlsSocket::Close: Broken pipe
W20260925 01:28:04.795624  9371 connection.cc:441] server connection from unix:<unnamed> torn down before Call kudu.rpc.GenericCalculatorService.SleepWithSidecar from unix:<unnamed> (request call id 8) could send its response
W20260925 01:28:04.807435  9371 connection.cc:441] server connection from unix:<unnamed> torn down before Call kudu.rpc.GenericCalculatorService.SleepWithSidecar from unix:<unnamed> (request call id 9) could send its response
[       OK ] Parameters/TestRpc.TestCancellationAsync/SSL_UnixSocket (195 ms)
[ RUN      ] Parameters/TestRpc.TestPerformanceBySocketType/SSL_UnixSocket
I20260925 01:28:04.819657  9399 acceptor_pool.cc:254] collecting diagnostics on the listening RPC socket unix:/tmp/dist-test-taskzkFmMP/test-tmp/rpc-test-3d230d6b082f471b96cc7543eb588a00.sock every 8 connection(s)
I20260925 01:28:04.819773  9400 acceptor_pool.cc:254] collecting diagnostics on the listening RPC socket unix:/tmp/dist-test-taskzkFmMP/test-tmp/rpc-test-3d230d6b082f471b96cc7543eb588a00.sock every 8 connection(s)
I20260925 01:28:04.820031  8942 rpc-test.cc:1846] Connecting to unix:/tmp/dist-test-taskzkFmMP/test-tmp/rpc-test-3d230d6b082f471b96cc7543eb588a00.sock
I20260925 01:28:06.587996  8942 rpc-test.cc:1859] Sending 1024MB via ssl-enabled unix socket: real 1.762s	user 2.139s	sys 0.988s
I20260925 01:28:08.357084  8942 rpc-test.cc:1859] Sending 1024MB via ssl-enabled unix socket: real 1.769s	user 2.149s	sys 1.006s
I20260925 01:28:10.077950  8942 rpc-test.cc:1859] Sending 1024MB via ssl-enabled unix socket: real 1.721s	user 2.079s	sys 0.991s
I20260925 01:28:11.842727  8942 rpc-test.cc:1859] Sending 1024MB via ssl-enabled unix socket: real 1.765s	user 2.224s	sys 0.918s
I20260925 01:28:13.638923  8942 rpc-test.cc:1859] Sending 1024MB via ssl-enabled unix socket: real 1.796s	user 2.117s	sys 1.083s
W20260925 01:28:13.639963  9396 connection.cc:196] Error closing socket: Network error: TlsSocket::Close: Broken pipe
[       OK ] Parameters/TestRpc.TestPerformanceBySocketType/SSL_UnixSocket (8832 ms)
[----------] 20 tests from Parameters/TestRpc (32842 ms total)

[----------] 1 test from Parameters/TestRpcSocketTxRxQueue
[ RUN      ] Parameters/TestRpcSocketTxRxQueue.AcceptorRxQueueSizeMetric/0
I20260925 01:28:13.648561  9424 acceptor_pool.cc:254] collecting diagnostics on the listening RPC socket 0.0.0.0:41131 every 1 connection(s)
I20260925 01:28:13.648581  9425 acceptor_pool.cc:254] collecting diagnostics on the listening RPC socket 0.0.0.0:41131 every 1 connection(s)
W20260925 01:28:13.649523  9420 negotiation.cc:337] Failed RPC negotiation. Trace:
0925 01:28:13.649259 (+     0us) reactor.cc:625] Submitting negotiation task for server connection from 127.0.0.1:54708 (local address 127.0.0.1:41131)
0925 01:28:13.649377 (+   118us) server_negotiation.cc:206] Beginning negotiation
0925 01:28:13.649380 (+     3us) server_negotiation.cc:399] Waiting for connection header
0925 01:28:13.649455 (+    75us) negotiation.cc:327] Negotiation complete: Network error: Server connection negotiation failed: server connection from 127.0.0.1:54708: BlockingRecv error: recv got EOF from 127.0.0.1:54708 (error 108)
Metrics: {"server-negotiator.queue_time_us":41}
[       OK ] Parameters/TestRpcSocketTxRxQueue.AcceptorRxQueueSizeMetric/0 (10 ms)
[----------] 1 test from Parameters/TestRpcSocketTxRxQueue (10 ms total)

[----------] Global test environment tear-down
[==========] 21 tests from 2 test suites ran. (32852 ms total)
[  PASSED  ] 20 tests.
[  FAILED  ] 1 test, listed below:
[  FAILED  ] Parameters/TestRpc.TestCallWithChainCertAndChainCA/SSL_UnixSocket, where GetParam() = (true, true)

 1 FAILED TEST