Diagnosed failure

Parameters/TestRpc.TestCallWithChainCertAndRootCA/SSL_TCP: /data0/somelongdirectorytoavoidrpathissues/src/kudu/src/kudu/rpc/rpc-test.cc:303: Failure
Failed
Bad status: Runtime error: could not verify certificate chain (error with cert: subject=CN = localhost, ST = sadfjas, C = AS, emailAddress = sdflkdsajf, O = lskdfjlsad, OU = sldfkja, issuer=C = AS, ST = ASDfkjdhf, L = lskdjf, O = saldfja, OU = skdjf, CN = localhost, emailAddress = sadjflkadsj): : certificate has expired
Google Test trace:
/data0/somelongdirectorytoavoidrpathissues/src/kudu/src/kudu/rpc/rpc-test.cc:300: Connecting to 0.0.0.0:45717
I20260928 23:49:47.810343 16455 test_util.cc:175] -----------------------------------------------
I20260928 23:49:47.810537 16455 test_util.cc:176] Had fatal failures, leaving test files at /tmp/dist-test-tasklX7Jnv/test-tmp/rpc-test.1.Parameters_TestRpc.TestCallWithChainCertAndRootCA_SSL_TCP.1790639386281845-16455-0

Full log

Note: This is test shard 2 of 8.
[==========] Running 21 tests from 2 test suites.
[----------] Global test environment set-up.
[----------] 1 test from TestRpc
[ RUN      ] TestRpc.TestMethodsByName
[       OK ] TestRpc.TestMethodsByName (7 ms)
[----------] 1 test from TestRpc (7 ms total)

[----------] 20 tests from Parameters/TestRpc
[ RUN      ] Parameters/TestRpc.TestAcceptorPoolStartStop/SSL_TCP
WARNING: Logging before InitGoogleLogging() is written to STDERR
I20260928 23:49:46.393199 16470 acceptor_pool.cc:254] collecting diagnostics on the listening RPC socket 0.0.0.0:41967 every 8 connection(s)
I20260928 23:49:46.394887 16471 acceptor_pool.cc:254] collecting diagnostics on the listening RPC socket 0.0.0.0:41967 every 8 connection(s)
I20260928 23:49:47.554457 16482 acceptor_pool.cc:254] collecting diagnostics on the listening RPC socket 0.0.0.0:32905 every 8 connection(s)
I20260928 23:49:47.555567 16483 acceptor_pool.cc:254] collecting diagnostics on the listening RPC socket 0.0.0.0:32905 every 8 connection(s)
I20260928 23:49:47.574620 16493 acceptor_pool.cc:254] collecting diagnostics on the listening RPC socket 0.0.0.0:41869 every 8 connection(s)
I20260928 23:49:47.576108 16494 acceptor_pool.cc:254] collecting diagnostics on the listening RPC socket 0.0.0.0:41869 every 8 connection(s)
I20260928 23:49:47.624128 16504 acceptor_pool.cc:254] collecting diagnostics on the listening RPC socket 0.0.0.0:43763 every 8 connection(s)
I20260928 23:49:47.624888 16505 acceptor_pool.cc:254] collecting diagnostics on the listening RPC socket 0.0.0.0:43763 every 8 connection(s)
I20260928 23:49:47.647207 16515 acceptor_pool.cc:254] collecting diagnostics on the listening RPC socket 0.0.0.0:39449 every 8 connection(s)
I20260928 23:49:47.647974 16516 acceptor_pool.cc:254] collecting diagnostics on the listening RPC socket 0.0.0.0:39449 every 8 connection(s)
[       OK ] Parameters/TestRpc.TestAcceptorPoolStartStop/SSL_TCP (1308 ms)
[ RUN      ] Parameters/TestRpc.TestCall/SSL_TCP
I20260928 23:49:47.669807 16528 acceptor_pool.cc:254] collecting diagnostics on the listening RPC socket 0.0.0.0:39809 every 8 connection(s)
I20260928 23:49:47.672086 16529 acceptor_pool.cc:254] collecting diagnostics on the listening RPC socket 0.0.0.0:39809 every 8 connection(s)
I20260928 23:49:47.677150 16455 rpc-test.cc:234] Connecting to 0.0.0.0:39809
[       OK ] Parameters/TestRpc.TestCall/SSL_TCP (109 ms)
[ RUN      ] Parameters/TestRpc.TestCallWithChainCertAndRootCA/SSL_TCP
I20260928 23:49:47.789084 16553 acceptor_pool.cc:254] collecting diagnostics on the listening RPC socket 0.0.0.0:45717 every 8 connection(s)
I20260928 23:49:47.789831 16554 acceptor_pool.cc:254] collecting diagnostics on the listening RPC socket 0.0.0.0:45717 every 8 connection(s)
/data0/somelongdirectorytoavoidrpathissues/src/kudu/src/kudu/rpc/rpc-test.cc:303: Failure
Failed
Bad status: Runtime error: could not verify certificate chain (error with cert: subject=CN = localhost, ST = sadfjas, C = AS, emailAddress = sdflkdsajf, O = lskdfjlsad, OU = sldfkja, issuer=C = AS, ST = ASDfkjdhf, L = lskdjf, O = saldfja, OU = skdjf, CN = localhost, emailAddress = sadjflkadsj): : certificate has expired
Google Test trace:
/data0/somelongdirectorytoavoidrpathissues/src/kudu/src/kudu/rpc/rpc-test.cc:300: Connecting to 0.0.0.0:45717
I20260928 23:49:47.810343 16455 test_util.cc:175] -----------------------------------------------
I20260928 23:49:47.810537 16455 test_util.cc:176] Had fatal failures, leaving test files at /tmp/dist-test-tasklX7Jnv/test-tmp/rpc-test.1.Parameters_TestRpc.TestCallWithChainCertAndRootCA_SSL_TCP.1790639386281845-16455-0
[  FAILED  ] Parameters/TestRpc.TestCallWithChainCertAndRootCA/SSL_TCP, where GetParam() = (true, false) (48 ms)
[ RUN      ] Parameters/TestRpc.TestCallWithBadPasswordProtectedKey/SSL_TCP
[       OK ] Parameters/TestRpc.TestCallWithBadPasswordProtectedKey/SSL_TCP (33 ms)
[ RUN      ] Parameters/TestRpc.TestInvalidMethodCall/SSL_TCP
I20260928 23:49:47.874256 16590 acceptor_pool.cc:254] collecting diagnostics on the listening RPC socket 0.0.0.0:34205 every 8 connection(s)
I20260928 23:49:47.875164 16591 acceptor_pool.cc:254] collecting diagnostics on the listening RPC socket 0.0.0.0:34205 every 8 connection(s)
I20260928 23:49:47.878700 16455 rpc-test.cc:406] Connecting to 0.0.0.0:34205
[       OK ] Parameters/TestRpc.TestInvalidMethodCall/SSL_TCP (73 ms)
[ RUN      ] Parameters/TestRpc.TestHighFDs/SSL_TCP
I20260928 23:49:48.171655 16615 acceptor_pool.cc:254] collecting diagnostics on the listening RPC socket 0.0.0.0:43375 every 8 connection(s)
I20260928 23:49:48.172478 16616 acceptor_pool.cc:254] collecting diagnostics on the listening RPC socket 0.0.0.0:43375 every 8 connection(s)
[       OK ] Parameters/TestRpc.TestHighFDs/SSL_TCP (300 ms)
[ RUN      ] Parameters/TestRpc.TestConnectionAlwaysKeepalive/SSL_TCP
I20260928 23:49:48.232388 16638 acceptor_pool.cc:254] collecting diagnostics on the listening RPC socket 0.0.0.0:36293 every 8 connection(s)
I20260928 23:49:48.233314 16639 acceptor_pool.cc:254] collecting diagnostics on the listening RPC socket 0.0.0.0:36293 every 8 connection(s)
I20260928 23:49:48.236581 16455 rpc-test.cc:532] Connecting to 0.0.0.0:36293
[       OK ] Parameters/TestRpc.TestConnectionAlwaysKeepalive/SSL_TCP (3067 ms)
[ RUN      ] Parameters/TestRpc.TestReopenOutboundConnections/SSL_TCP
I20260928 23:49:51.319548 16661 acceptor_pool.cc:254] collecting diagnostics on the listening RPC socket 0.0.0.0:39397 every 8 connection(s)
I20260928 23:49:51.320333 16662 acceptor_pool.cc:254] collecting diagnostics on the listening RPC socket 0.0.0.0:39397 every 8 connection(s)
I20260928 23:49:51.323453 16455 rpc-test.cc:658] Connecting to 0.0.0.0:39397
[       OK ] Parameters/TestRpc.TestReopenOutboundConnections/SSL_TCP (414 ms)
[ RUN      ] Parameters/TestRpc.TestConnectionNetworkPlane/SSL_TCP
I20260928 23:49:51.720587 16684 acceptor_pool.cc:254] collecting diagnostics on the listening RPC socket 0.0.0.0:42697 every 8 connection(s)
I20260928 23:49:51.721415 16685 acceptor_pool.cc:254] collecting diagnostics on the listening RPC socket 0.0.0.0:42697 every 8 connection(s)
I20260928 23:49:51.724754 16455 rpc-test.cc:772] Connecting to 0.0.0.0:42697
[       OK ] Parameters/TestRpc.TestConnectionNetworkPlane/SSL_TCP (89 ms)
[ RUN      ] Parameters/TestRpc.TestTCPKeepalive/SSL_TCP
I20260928 23:49:51.810009 16709 acceptor_pool.cc:254] collecting diagnostics on the listening RPC socket 0.0.0.0:40575 every 8 connection(s)
I20260928 23:49:51.810770 16710 acceptor_pool.cc:254] collecting diagnostics on the listening RPC socket 0.0.0.0:40575 every 8 connection(s)
I20260928 23:49:51.862320 16713 rpc-test-base.h:222] got call: sleep_micros: 8000000 deferred: true
I20260928 23:49:59.866634 16713 rpcz_store.cc:275] Call kudu.rpc.GenericCalculatorService.Sleep from 127.0.0.1:46232 (request call id 0) took 8004 ms. Trace:
I20260928 23:49:59.867043 16713 rpcz_store.cc:276] 0928 23:49:51.862014 (+     0us) service_pool.cc:170] Inserting onto call queue
0928 23:49:51.862154 (+   140us) service_pool.cc:227] Handling call
0928 23:49:59.866447 (+8004293us) inbound_call.cc:173] Queueing success response
Metrics: {}
[       OK ] Parameters/TestRpc.TestTCPKeepalive/SSL_TCP (8089 ms)
[ RUN      ] Parameters/TestRpc.TestMaxSmallSidecars/SSL_TCP
I20260928 23:49:59.909919 16735 acceptor_pool.cc:254] collecting diagnostics on the listening RPC socket 0.0.0.0:33827 every 8 connection(s)
I20260928 23:49:59.910763 16736 acceptor_pool.cc:254] collecting diagnostics on the listening RPC socket 0.0.0.0:33827 every 8 connection(s)
[       OK ] Parameters/TestRpc.TestMaxSmallSidecars/SSL_TCP (213 ms)
[ RUN      ] Parameters/TestRpc.TestCallTimeout/SSL_TCP
I20260928 23:50:00.118927 16760 acceptor_pool.cc:254] collecting diagnostics on the listening RPC socket 0.0.0.0:45227 every 8 connection(s)
I20260928 23:50:00.119629 16761 acceptor_pool.cc:254] collecting diagnostics on the listening RPC socket 0.0.0.0:45227 every 8 connection(s)
I20260928 23:50:00.156428 16455 rpc-test-base.h:595] status: Timed out: connection negotiation to 0.0.0.0:45227 for RPC Sleep timed out after 0.000s (ON_OUTBOUND_QUEUE), seconds elapsed: 0.00249051
I20260928 23:50:00.165449 16764 rpc-test-base.h:222] got call: sleep_micros: 700000
I20260928 23:50:00.358278 16455 rpc-test-base.h:595] status: Timed out: Sleep RPC to 0.0.0.0:45227 timed out after 0.200s (SENT), seconds elapsed: 0.201431
I20260928 23:50:00.359778 16763 rpc-test-base.h:222] got call: sleep_micros: 2000000
W20260928 23:50:00.866159 16764 rpcz_store.cc:267] Call kudu.rpc.GenericCalculatorService.Sleep from 127.0.0.1:39710 (request call id 1) took 700 ms (client timeout 200 ms). Trace:
W20260928 23:50:00.866492 16764 rpcz_store.cc:269] 0928 23:50:00.165257 (+     0us) service_pool.cc:170] Inserting onto call queue
0928 23:50:00.165381 (+   124us) service_pool.cc:227] Handling call
0928 23:50:00.866090 (+700709us) inbound_call.cc:173] Queueing success response
Metrics: {}
I20260928 23:50:01.861438 16455 rpc-test-base.h:595] status: Timed out: Sleep RPC to 0.0.0.0:45227 timed out after 1.500s (SENT), seconds elapsed: 1.50284
W20260928 23:50:02.360312 16763 rpcz_store.cc:267] Call kudu.rpc.GenericCalculatorService.Sleep from 127.0.0.1:39710 (request call id 2) took 2000 ms (client timeout 1500 ms). Trace:
W20260928 23:50:02.360625 16763 rpcz_store.cc:269] 0928 23:50:00.359494 (+     0us) service_pool.cc:170] Inserting onto call queue
0928 23:50:00.359614 (+   120us) service_pool.cc:227] Handling call
0928 23:50:02.360255 (+2000641us) inbound_call.cc:173] Queueing success response
Metrics: {}
W20260928 23:50:02.361127 16758 connection.cc:441] server connection from 127.0.0.1:39710 torn down before Call kudu.rpc.GenericCalculatorService.Sleep from 127.0.0.1:39710 (request call id 2) could send its response
[       OK ] Parameters/TestRpc.TestCallTimeout/SSL_TCP (2272 ms)
[ RUN      ] Parameters/TestRpc.TestServerShutsDown/SSL_TCP
I20260928 23:50:02.368551 16455 rpc-test.cc:1125] Connecting to 0.0.0.0:40139
W20260928 23:50:02.378335 16777 negotiation.cc:337] Failed RPC negotiation. Trace:
0928 23:50:02.376688 (+     0us) reactor.cc:625] Submitting negotiation task for client connection to 0.0.0.0:40139 (local address 127.0.0.1:40362)
0928 23:50:02.377175 (+   487us) negotiation.cc:107] Waiting for socket to connect
0928 23:50:02.377209 (+    34us) client_negotiation.cc:174] Beginning negotiation
0928 23:50:02.377447 (+   238us) client_negotiation.cc:252] Sending NEGOTIATE NegotiatePB request
0928 23:50:02.377711 (+   264us) negotiation.cc:327] Negotiation complete: Network error: Client connection negotiation failed: client connection to 0.0.0.0:40139: BlockingWrite error: write error: Broken pipe (error 32)
Metrics: {"client-negotiator.queue_time_us":120}
[       OK ] Parameters/TestRpc.TestServerShutsDown/SSL_TCP (14 ms)
[ RUN      ] Parameters/TestRpc.TimedOutOnResponseMetric/SSL_TCP
I20260928 23:50:02.401990 16794 acceptor_pool.cc:254] collecting diagnostics on the listening RPC socket 0.0.0.0:39091 every 8 connection(s)
I20260928 23:50:02.402814 16795 acceptor_pool.cc:254] collecting diagnostics on the listening RPC socket 0.0.0.0:39091 every 8 connection(s)
W20260928 23:50:02.653594 16798 rpcz_store.cc:267] Call kudu.rpc_test.CalculatorService.Sleep from 127.0.0.1:47428 (request call id 3) took 50 ms (client timeout 25 ms). Trace:
W20260928 23:50:02.653946 16798 rpcz_store.cc:269] 0928 23:50:02.602913 (+     0us) service_pool.cc:170] Inserting onto call queue
0928 23:50:02.603046 (+   133us) service_pool.cc:227] Handling call
0928 23:50:02.653514 (+ 50468us) inbound_call.cc:173] Queueing success response
Related trace 'test_child':
Metrics: {"test_sleep_us":50000,"child_traces":[["test_child",{"related_trace_metric":1}]]}
W20260928 23:50:02.712874 16798 rpcz_store.cc:267] Call kudu.rpc_test.CalculatorService.Sleep from 127.0.0.1:47428 (request call id 4) took 50 ms (client timeout 50 ms). Trace:
W20260928 23:50:02.713164 16798 rpcz_store.cc:269] 0928 23:50:02.662218 (+     0us) service_pool.cc:170] Inserting onto call queue
0928 23:50:02.662351 (+   133us) service_pool.cc:227] Handling call
0928 23:50:02.712809 (+ 50458us) inbound_call.cc:173] Queueing success response
Related trace 'test_child':
Metrics: {"test_sleep_us":50000,"child_traces":[["test_child",{"related_trace_metric":1}]]}
[       OK ] Parameters/TestRpc.TimedOutOnResponseMetric/SSL_TCP (341 ms)
[ RUN      ] Parameters/TestRpc.AcceptorDispatchingTimesMetric/SSL_TCP
I20260928 23:50:02.736270 16819 acceptor_pool.cc:254] collecting diagnostics on the listening RPC socket 0.0.0.0:45589 every 8 connection(s)
I20260928 23:50:02.736917 16820 acceptor_pool.cc:254] collecting diagnostics on the listening RPC socket 0.0.0.0:45589 every 8 connection(s)
W20260928 23:50:02.743924 16815 negotiation.cc:337] Failed RPC negotiation. Trace:
0928 23:50:02.741462 (+     0us) reactor.cc:625] Submitting negotiation task for server connection from 127.0.0.1:47832 (local address 127.0.0.1:45589)
0928 23:50:02.742066 (+   604us) server_negotiation.cc:206] Beginning negotiation
0928 23:50:02.742102 (+    36us) server_negotiation.cc:399] Waiting for connection header
0928 23:50:02.742513 (+   411us) negotiation.cc:327] Negotiation complete: Network error: Server connection negotiation failed: server connection from 127.0.0.1:47832: BlockingRecv error: recv got EOF from 127.0.0.1:47832 (error 108)
Metrics: {"server-negotiator.queue_time_us":136}
[       OK ] Parameters/TestRpc.AcceptorDispatchingTimesMetric/SSL_TCP (24 ms)
[ RUN      ] Parameters/TestRpc.TestRpcCallbackDestroysMessenger/SSL_TCP
[       OK ] Parameters/TestRpc.TestRpcCallbackDestroysMessenger/SSL_TCP (26 ms)
[ RUN      ] Parameters/TestRpc.TestApplicationFeatureFlag/SSL_TCP
I20260928 23:50:02.793268 16844 acceptor_pool.cc:254] collecting diagnostics on the listening RPC socket 0.0.0.0:43059 every 8 connection(s)
I20260928 23:50:02.794004 16845 acceptor_pool.cc:254] collecting diagnostics on the listening RPC socket 0.0.0.0:43059 every 8 connection(s)
W20260928 23:50:02.826793 16842 messenger.cc:357] Unable to handle RPC call: Not implemented: call requires unsupported application feature flags: 99
[       OK ] Parameters/TestRpc.TestApplicationFeatureFlag/SSL_TCP (61 ms)
[ RUN      ] Parameters/TestRpc.TestCancellation/SSL_TCP
I20260928 23:50:02.849402 16869 acceptor_pool.cc:254] collecting diagnostics on the listening RPC socket 0.0.0.0:37145 every 8 connection(s)
I20260928 23:50:02.850127 16870 acceptor_pool.cc:254] collecting diagnostics on the listening RPC socket 0.0.0.0:37145 every 8 connection(s)
I20260928 23:50:02.853323 16455 rpc-test.cc:1648] Connecting to 0.0.0.0:37145
I20260928 23:50:02.959475 16455 rpc-test-base.h:595] status: Aborted: Sleep RPC to 0.0.0.0:37145 is cancelled in state READY, seconds elapsed: 0.000421944
I20260928 23:50:03.110651 16455 rpc-test-base.h:595] status: Aborted: Sleep RPC to 0.0.0.0:37145 is cancelled in state SENT, seconds elapsed: 0.00098308
I20260928 23:50:03.157713 16872 rpc-test-base.h:222] got call: sleep_micros: 510000
I20260928 23:50:03.295118 16455 rpc-test-base.h:595] status: Aborted: Sleep RPC to 0.0.0.0:37145 is cancelled in state SENT, seconds elapsed: 0.000928262
I20260928 23:50:03.352736 16871 rpc-test-base.h:222] got call: sleep_micros: 510000
I20260928 23:50:03.469347 16455 rpc-test-base.h:595] status: Aborted: Sleep RPC to 0.0.0.0:37145 is cancelled in state SENT, seconds elapsed: 0.000924907
W20260928 23:50:03.510911 16873 rpcz_store.cc:267] Call kudu.rpc.GenericCalculatorService.Sleep from 127.0.0.1:55450 (request call id 11) took 15 ms (client timeout 10 ms). Trace:
W20260928 23:50:03.511245 16873 rpcz_store.cc:269] 0928 23:50:03.495426 (+     0us) service_pool.cc:170] Inserting onto call queue
0928 23:50:03.510597 (+ 15171us) service_pool.cc:214] Skipping call since client already timed out
0928 23:50:03.510724 (+   127us) inbound_call.cc:173] Queueing failure response
Metrics: {}
I20260928 23:50:03.511862 16873 rpc-test-base.h:222] got call: sleep_micros: 1500000
W20260928 23:50:03.668378 16872 rpcz_store.cc:267] Call kudu.rpc.GenericCalculatorService.Sleep from 127.0.0.1:55450 (request call id 3) took 510 ms (client timeout 10 ms). Trace:
W20260928 23:50:03.668699 16872 rpcz_store.cc:269] 0928 23:50:03.157511 (+     0us) service_pool.cc:170] Inserting onto call queue
0928 23:50:03.157649 (+   138us) service_pool.cc:227] Handling call
0928 23:50:03.668323 (+510674us) inbound_call.cc:173] Queueing success response
Metrics: {}
W20260928 23:50:03.863514 16871 rpcz_store.cc:267] Call kudu.rpc.GenericCalculatorService.Sleep from 127.0.0.1:55450 (request call id 7) took 511 ms (client timeout 10 ms). Trace:
W20260928 23:50:03.863914 16871 rpcz_store.cc:269] 0928 23:50:03.352451 (+     0us) service_pool.cc:170] Inserting onto call queue
0928 23:50:03.352644 (+   193us) service_pool.cc:227] Handling call
0928 23:50:03.863457 (+510813us) inbound_call.cc:173] Queueing success response
Metrics: {}
I20260928 23:50:04.470927 16455 rpc-test-base.h:595] status: Timed out: Sleep RPC to 0.0.0.0:37145 timed out after 1.000s (SENT), seconds elapsed: 1.00118
I20260928 23:50:04.472309 16871 rpc-test-base.h:222] got call: sleep_micros: 1500000
W20260928 23:50:05.012449 16873 rpcz_store.cc:267] Call kudu.rpc.GenericCalculatorService.Sleep from 127.0.0.1:55450 (request call id 12) took 1516 ms (client timeout 1000 ms). Trace:
W20260928 23:50:05.012796 16873 rpcz_store.cc:269] 0928 23:50:03.495771 (+     0us) service_pool.cc:170] Inserting onto call queue
0928 23:50:03.511818 (+ 16047us) service_pool.cc:227] Handling call
0928 23:50:05.012394 (+1500576us) inbound_call.cc:173] Queueing success response
Metrics: {}
I20260928 23:50:05.472344 16455 rpc-test-base.h:595] status: Timed out: Sleep RPC to 0.0.0.0:37145 timed out after 1.000s (SENT), seconds elapsed: 1.0011
W20260928 23:50:05.473815 16867 messenger.cc:357] Unable to handle RPC call: Not implemented: call requires unsupported application feature flags: 99, 1
W20260928 23:50:05.475446 16867 messenger.cc:357] Unable to handle RPC call: Not implemented: call requires unsupported application feature flags: 99, 1
W20260928 23:50:05.972867 16871 rpcz_store.cc:267] Call kudu.rpc.GenericCalculatorService.Sleep from 127.0.0.1:55450 (request call id 13) took 1500 ms (client timeout 1000 ms). Trace:
W20260928 23:50:05.973181 16871 rpcz_store.cc:269] 0928 23:50:04.472133 (+     0us) service_pool.cc:170] Inserting onto call queue
0928 23:50:04.472261 (+   128us) service_pool.cc:227] Handling call
0928 23:50:05.972808 (+1500547us) inbound_call.cc:173] Queueing success response
Metrics: {}
W20260928 23:50:05.973744 16867 connection.cc:441] server connection from 127.0.0.1:55450 torn down before Call kudu.rpc.GenericCalculatorService.Sleep from 127.0.0.1:55450 (request call id 13) could send its response
[       OK ] Parameters/TestRpc.TestCancellation/SSL_TCP (3144 ms)
[ RUN      ] Parameters/TestRpc.TestCancellationMultiThreads/SSL_TCP
I20260928 23:50:06.010496 16894 acceptor_pool.cc:254] collecting diagnostics on the listening RPC socket 0.0.0.0:35427 every 8 connection(s)
I20260928 23:50:06.011264 16895 acceptor_pool.cc:254] collecting diagnostics on the listening RPC socket 0.0.0.0:35427 every 8 connection(s)
I20260928 23:50:06.014456 16455 rpc-test.cc:1808] Connecting to 0.0.0.0:35427
I20260928 23:50:06.165640 16908 test_util.cc:268] Using random seed: -1179013526
I20260928 23:50:06.166729 16909 test_util.cc:268] Using random seed: -1179012428
I20260928 23:50:06.168147 16910 test_util.cc:268] Using random seed: -1179011011
I20260928 23:50:06.169602 16911 test_util.cc:268] Using random seed: -1179009574
I20260928 23:50:06.171087 16912 test_util.cc:268] Using random seed: -1179008177
I20260928 23:50:06.172474 16913 test_util.cc:268] Using random seed: -1179006794
I20260928 23:50:06.173755 16914 test_util.cc:268] Using random seed: -1179005505
I20260928 23:50:06.175593 16915 test_util.cc:268] Using random seed: -1179003726
I20260928 23:50:06.177021 16916 test_util.cc:268] Using random seed: -1179002280
I20260928 23:50:06.178764 16917 test_util.cc:268] Using random seed: -1179000548
I20260928 23:50:06.180635 16918 test_util.cc:268] Using random seed: -1178998675
I20260928 23:50:06.182019 16919 test_util.cc:268] Using random seed: -1178997275
I20260928 23:50:06.184376 16920 test_util.cc:268] Using random seed: -1178995014
I20260928 23:50:06.187137 16921 test_util.cc:268] Using random seed: -1178992370
I20260928 23:50:06.189352 16922 test_util.cc:268] Using random seed: -1178990033
I20260928 23:50:06.193178 16923 test_util.cc:268] Using random seed: -1178986236
I20260928 23:50:06.197180 16924 test_util.cc:268] Using random seed: -1178982225
I20260928 23:50:06.201139 16925 test_util.cc:268] Using random seed: -1178978270
I20260928 23:50:06.203109 16926 test_util.cc:268] Using random seed: -1178976217
I20260928 23:50:06.205231 16927 test_util.cc:268] Using random seed: -1178974094
I20260928 23:50:06.207439 16928 test_util.cc:268] Using random seed: -1178971897
I20260928 23:50:06.209154 16929 test_util.cc:268] Using random seed: -1178970157
I20260928 23:50:06.210798 16930 test_util.cc:268] Using random seed: -1178968513
I20260928 23:50:06.212978 16931 test_util.cc:268] Using random seed: -1178966320
I20260928 23:50:06.214691 16932 test_util.cc:268] Using random seed: -1178964644
I20260928 23:50:06.216426 16933 test_util.cc:268] Using random seed: -1178962910
I20260928 23:50:06.218092 16934 test_util.cc:268] Using random seed: -1178961296
I20260928 23:50:06.219769 16935 test_util.cc:268] Using random seed: -1178959552
I20260928 23:50:06.221419 16936 test_util.cc:268] Using random seed: -1178957876
I20260928 23:50:06.223068 16937 test_util.cc:268] Using random seed: -1178956236
[       OK ] Parameters/TestRpc.TestCancellationMultiThreads/SSL_TCP (18527 ms)
[ RUN      ] Parameters/TestRpc.TestCallId/SSL_TCP
I20260928 23:50:24.538076 16951 acceptor_pool.cc:254] collecting diagnostics on the listening RPC socket 0.0.0.0:40113 every 8 connection(s)
I20260928 23:50:24.538878 16952 acceptor_pool.cc:254] collecting diagnostics on the listening RPC socket 0.0.0.0:40113 every 8 connection(s)
[       OK ] Parameters/TestRpc.TestCallId/SSL_TCP (84 ms)
[----------] 20 tests from Parameters/TestRpc (38249 ms total)

[----------] Global test environment tear-down
[==========] 21 tests from 2 test suites ran. (38257 ms total)
[  PASSED  ] 20 tests.
[  FAILED  ] 1 test, listed below:
[  FAILED  ] Parameters/TestRpc.TestCallWithChainCertAndRootCA/SSL_TCP, where GetParam() = (true, false)

 1 FAILED TEST