Diagnosed failure
Parameters/TestRpc.TestCallWithChainCertAndChainCA/SSL_UnixSocket: /data0/somelongdirectorytoavoidrpathissues/src/kudu/src/kudu/rpc/rpc-test.cc:270: Failure
Failed
Bad status: Runtime error: could not verify certificate chain (error with cert: subject=CN = localhost, ST = sadfjas, C = AS, emailAddress = sdflkdsajf, O = lskdfjlsad, OU = sldfkja, issuer=C = AS, ST = ASDfkjdhf, L = lskdjf, O = saldfja, OU = skdjf, CN = localhost, emailAddress = sadjflkadsj): : certificate has expired
Google Test trace:
/data0/somelongdirectorytoavoidrpathissues/src/kudu/src/kudu/rpc/rpc-test.cc:267: Connecting to unix:/tmp/dist-test-taskSBAZ9a/test-tmp/rpc-test-2845393b951b455898a91bd88b9fbdbc.sock
I20260927 02:04:16.595861 7898 test_util.cc:175] -----------------------------------------------
I20260927 02:04:16.596112 7898 test_util.cc:176] Had fatal failures, leaving test files at /tmp/dist-test-taskSBAZ9a/test-tmp/rpc-test.6.Parameters_TestRpc.TestCallWithChainCertAndChainCA_SSL_UnixSocket.1790474655133323-7898-0
Full log
Note: This is test shard 7 of 8.
[==========] Running 21 tests from 2 test suites.
[----------] Global test environment set-up.
[----------] 20 tests from Parameters/TestRpc
[ RUN ] Parameters/TestRpc.TestMessengerCreateDestroy/SSL_UnixSocket
WARNING: Logging before InitGoogleLogging() is written to STDERR
I20260927 02:04:15.283545 7898 rpc-test.cc:169] started messenger TestCreateDestroy
[ OK ] Parameters/TestRpc.TestMessengerCreateDestroy/SSL_UnixSocket (1252 ms)
[ RUN ] Parameters/TestRpc.TestNegotiationDeadlock/SSL_UnixSocket
I20260927 02:04:16.468505 7920 acceptor_pool.cc:254] collecting diagnostics on the listening RPC socket unix:/tmp/dist-test-taskSBAZ9a/test-tmp/rpc-test-5552e4fe20944a219a891c4776235831.sock every 8 connection(s)
I20260927 02:04:16.470032 7921 acceptor_pool.cc:254] collecting diagnostics on the listening RPC socket unix:/tmp/dist-test-taskSBAZ9a/test-tmp/rpc-test-5552e4fe20944a219a891c4776235831.sock every 8 connection(s)
[ OK ] Parameters/TestRpc.TestNegotiationDeadlock/SSL_UnixSocket (91 ms)
[ RUN ] Parameters/TestRpc.TestCallWithChainCertAndChainCA/SSL_UnixSocket
I20260927 02:04:16.565407 7936 acceptor_pool.cc:254] collecting diagnostics on the listening RPC socket unix:/tmp/dist-test-taskSBAZ9a/test-tmp/rpc-test-2845393b951b455898a91bd88b9fbdbc.sock every 8 connection(s)
I20260927 02:04:16.567759 7937 acceptor_pool.cc:254] collecting diagnostics on the listening RPC socket unix:/tmp/dist-test-taskSBAZ9a/test-tmp/rpc-test-2845393b951b455898a91bd88b9fbdbc.sock every 8 connection(s)
/data0/somelongdirectorytoavoidrpathissues/src/kudu/src/kudu/rpc/rpc-test.cc:270: Failure
Failed
Bad status: Runtime error: could not verify certificate chain (error with cert: subject=CN = localhost, ST = sadfjas, C = AS, emailAddress = sdflkdsajf, O = lskdfjlsad, OU = sldfkja, issuer=C = AS, ST = ASDfkjdhf, L = lskdjf, O = saldfja, OU = skdjf, CN = localhost, emailAddress = sadjflkadsj): : certificate has expired
Google Test trace:
/data0/somelongdirectorytoavoidrpathissues/src/kudu/src/kudu/rpc/rpc-test.cc:267: Connecting to unix:/tmp/dist-test-taskSBAZ9a/test-tmp/rpc-test-2845393b951b455898a91bd88b9fbdbc.sock
I20260927 02:04:16.595861 7898 test_util.cc:175] -----------------------------------------------
I20260927 02:04:16.596112 7898 test_util.cc:176] Had fatal failures, leaving test files at /tmp/dist-test-taskSBAZ9a/test-tmp/rpc-test.6.Parameters_TestRpc.TestCallWithChainCertAndChainCA_SSL_UnixSocket.1790474655133323-7898-0
[ FAILED ] Parameters/TestRpc.TestCallWithChainCertAndChainCA/SSL_UnixSocket, where GetParam() = (true, true) (64 ms)
[ RUN ] Parameters/TestRpc.TestCallWithPasswordProtectedKey/SSL_UnixSocket
I20260927 02:04:16.612651 7961 acceptor_pool.cc:254] collecting diagnostics on the listening RPC socket unix:/tmp/dist-test-taskSBAZ9a/test-tmp/rpc-test-d3cb1513582b4de3b7b6d5e7de3474ed.sock every 8 connection(s)
I20260927 02:04:16.613394 7962 acceptor_pool.cc:254] collecting diagnostics on the listening RPC socket unix:/tmp/dist-test-taskSBAZ9a/test-tmp/rpc-test-d3cb1513582b4de3b7b6d5e7de3474ed.sock every 8 connection(s)
W20260927 02:04:16.657474 7958 connection.cc:196] Error closing socket: Network error: TlsSocket::Close: Broken pipe
[ OK ] Parameters/TestRpc.TestCallWithPasswordProtectedKey/SSL_UnixSocket (70 ms)
[ RUN ] Parameters/TestRpc.TestCallToBadServer/SSL_UnixSocket
I20260927 02:04:16.687515 7898 rpc-test.cc:394] Status: Network error: Client connection negotiation failed: client connection to 0.0.0.0:0: connect: Connection refused (error 111)
I20260927 02:04:16.688972 7898 rpc-test.cc:394] Status: Network error: Client connection negotiation failed: client connection to 0.0.0.0:0: connect: Connection refused (error 111)
I20260927 02:04:16.690296 7898 rpc-test.cc:394] Status: Network error: Client connection negotiation failed: client connection to 0.0.0.0:0: connect: Connection refused (error 111)
I20260927 02:04:16.691624 7898 rpc-test.cc:394] Status: Network error: Client connection negotiation failed: client connection to 0.0.0.0:0: connect: Connection refused (error 111)
I20260927 02:04:16.692947 7898 rpc-test.cc:394] Status: Network error: Client connection negotiation failed: client connection to 0.0.0.0:0: connect: Connection refused (error 111)
[ OK ] Parameters/TestRpc.TestCallToBadServer/SSL_UnixSocket (29 ms)
[ RUN ] Parameters/TestRpc.TestWrongService/SSL_UnixSocket
I20260927 02:04:16.712427 7996 acceptor_pool.cc:254] collecting diagnostics on the listening RPC socket unix:/tmp/dist-test-taskSBAZ9a/test-tmp/rpc-test-b22b2996e1ba4239bf66ec9d98ac6887.sock every 8 connection(s)
I20260927 02:04:16.713304 7997 acceptor_pool.cc:254] collecting diagnostics on the listening RPC socket unix:/tmp/dist-test-taskSBAZ9a/test-tmp/rpc-test-b22b2996e1ba4239bf66ec9d98ac6887.sock every 8 connection(s)
I20260927 02:04:16.745406 7993 messenger.cc:345] service WrongServiceName not registered on TestServer
W20260927 02:04:16.748052 7993 connection.cc:196] Error closing socket: Network error: TlsSocket::Close: Broken pipe
[ OK ] Parameters/TestRpc.TestWrongService/SSL_UnixSocket (58 ms)
[ RUN ] Parameters/TestRpc.TestConnectionKeepalive/SSL_UnixSocket
I20260927 02:04:16.771636 8019 acceptor_pool.cc:254] collecting diagnostics on the listening RPC socket unix:/tmp/dist-test-taskSBAZ9a/test-tmp/rpc-test-3b13f89121b14200bba8d354a11bc1c3.sock every 8 connection(s)
I20260927 02:04:16.772358 8020 acceptor_pool.cc:254] collecting diagnostics on the listening RPC socket unix:/tmp/dist-test-taskSBAZ9a/test-tmp/rpc-test-3b13f89121b14200bba8d354a11bc1c3.sock every 8 connection(s)
I20260927 02:04:16.775609 7898 rpc-test.cc:488] Connecting to unix:/tmp/dist-test-taskSBAZ9a/test-tmp/rpc-test-3b13f89121b14200bba8d354a11bc1c3.sock
W20260927 02:04:17.257050 8032 connection.cc:196] Error closing socket: Network error: TlsSocket::Close: Broken pipe
[ OK ] Parameters/TestRpc.TestConnectionKeepalive/SSL_UnixSocket (1066 ms)
[ RUN ] Parameters/TestRpc.TestClientConnectionMetrics/SSL_UnixSocket
I20260927 02:04:17.863595 8044 acceptor_pool.cc:254] collecting diagnostics on the listening RPC socket unix:/tmp/dist-test-taskSBAZ9a/test-tmp/rpc-test-957502ad3bd54130b9dd92e443b00c65.sock every 8 connection(s)
I20260927 02:04:17.864401 8045 acceptor_pool.cc:254] collecting diagnostics on the listening RPC socket unix:/tmp/dist-test-taskSBAZ9a/test-tmp/rpc-test-957502ad3bd54130b9dd92e443b00c65.sock every 8 connection(s)
I20260927 02:04:17.867928 7898 rpc-test.cc:569] Connecting to unix:/tmp/dist-test-taskSBAZ9a/test-tmp/rpc-test-957502ad3bd54130b9dd92e443b00c65.sock
W20260927 02:06:34.878536 8041 connection.cc:196] Error closing socket: Network error: TlsSocket::Close: Broken pipe
[ OK ] Parameters/TestRpc.TestClientConnectionMetrics/SSL_UnixSocket (137065 ms)
[ RUN ] Parameters/TestRpc.TestCredentialsPolicy/SSL_UnixSocket
I20260927 02:06:34.917780 8080 acceptor_pool.cc:254] collecting diagnostics on the listening RPC socket unix:/tmp/dist-test-taskSBAZ9a/test-tmp/rpc-test-c327d444ca74483e81bbc029ea3b1204.sock every 8 connection(s)
I20260927 02:06:34.918689 8081 acceptor_pool.cc:254] collecting diagnostics on the listening RPC socket unix:/tmp/dist-test-taskSBAZ9a/test-tmp/rpc-test-c327d444ca74483e81bbc029ea3b1204.sock every 8 connection(s)
I20260927 02:06:34.921976 7898 rpc-test.cc:700] Connecting to unix:/tmp/dist-test-taskSBAZ9a/test-tmp/rpc-test-c327d444ca74483e81bbc029ea3b1204.sock
W20260927 02:06:34.960719 8079 connection.cc:196] Error closing socket: Network error: TlsSocket::Close: Broken pipe
[ OK ] Parameters/TestRpc.TestCredentialsPolicy/SSL_UnixSocket (96 ms)
[ RUN ] Parameters/TestRpc.TestCallLongerThanKeepalive/SSL_UnixSocket
I20260927 02:06:35.004230 8105 acceptor_pool.cc:254] collecting diagnostics on the listening RPC socket unix:/tmp/dist-test-taskSBAZ9a/test-tmp/rpc-test-1c0583533436421da770cb218cc0c904.sock every 8 connection(s)
I20260927 02:06:35.004949 8106 acceptor_pool.cc:254] collecting diagnostics on the listening RPC socket unix:/tmp/dist-test-taskSBAZ9a/test-tmp/rpc-test-1c0583533436421da770cb218cc0c904.sock every 8 connection(s)
I20260927 02:06:35.038822 8109 rpc-test-base.h:222] got call: sleep_micros: 3000000 deferred: true
I20260927 02:06:38.043318 8109 rpcz_store.cc:275] Call kudu.rpc.GenericCalculatorService.Sleep from unix:<unnamed> (request call id 0) took 3004 ms. Trace:
I20260927 02:06:38.043738 8109 rpcz_store.cc:276] 0927 02:06:35.038640 (+ 0us) service_pool.cc:170] Inserting onto call queue
0927 02:06:35.038763 (+ 123us) service_pool.cc:227] Handling call
0927 02:06:38.043093 (+3004330us) inbound_call.cc:173] Queueing success response
Metrics: {}
W20260927 02:06:38.049005 8102 connection.cc:196] Error closing socket: Network error: TlsSocket::Close: Broken pipe
[ OK ] Parameters/TestRpc.TestCallLongerThanKeepalive/SSL_UnixSocket (3074 ms)
[ RUN ] Parameters/TestRpc.TestRpcSidecar/SSL_UnixSocket
I20260927 02:06:38.084043 8131 acceptor_pool.cc:254] collecting diagnostics on the listening RPC socket unix:/tmp/dist-test-taskSBAZ9a/test-tmp/rpc-test-b632275dba1d434ea45f4697224ac73e.sock every 8 connection(s)
I20260927 02:06:38.085219 8132 acceptor_pool.cc:254] collecting diagnostics on the listening RPC socket unix:/tmp/dist-test-taskSBAZ9a/test-tmp/rpc-test-b632275dba1d434ea45f4697224ac73e.sock every 8 connection(s)
W20260927 02:06:38.607579 8128 connection.cc:196] Error closing socket: Network error: TlsSocket::Close: Broken pipe
[ OK ] Parameters/TestRpc.TestRpcSidecar/SSL_UnixSocket (555 ms)
[ RUN ] Parameters/TestRpc.TestRpcSidecarLimits/SSL_UnixSocket
I20260927 02:06:56.260157 8158 acceptor_pool.cc:254] collecting diagnostics on the listening RPC socket unix:/tmp/dist-test-taskSBAZ9a/test-tmp/rpc-test-6a6d9c6fd70d4f0aadbee82563ce538c.sock every 8 connection(s)
I20260927 02:06:56.260874 8159 acceptor_pool.cc:254] collecting diagnostics on the listening RPC socket unix:/tmp/dist-test-taskSBAZ9a/test-tmp/rpc-test-6a6d9c6fd70d4f0aadbee82563ce538c.sock every 8 connection(s)
W20260927 02:06:56.279757 7898 serialization.cc:72] Serialized kudu.rpc_test.PushStringsRequestPB (2147483654 bytes) is larger than the maximum configured RPC message size (52428800 bytes). Sending anyway, but peer may reject the data.
W20260927 02:06:56.289891 8155 connection.cc:535] server connection from unix:<unnamed> recv error: Network error: RPC frame had a length of 2147483714, but we only support messages up to 52428800 bytes long.
W20260927 02:06:56.290256 8155 connection.cc:158] shutting down server connection from unix:<unnamed> with pending inbound data: 4/2147483714 bytes received; last active 0 ns ago: status Network error: RPC frame had a length of 2147483714, but we only support messages up to 52428800 bytes long.
W20260927 02:06:56.290961 8171 connection.cc:698] client connection to unix:/tmp/dist-test-taskSBAZ9a/test-tmp/rpc-test-6a6d9c6fd70d4f0aadbee82563ce538c.sock send error: Network error: failed to write to TLS socket: Broken pipe
W20260927 02:06:56.291527 8171 connection.cc:196] Error closing socket: Network error: TlsSocket::Close: Success
[ OK ] Parameters/TestRpc.TestRpcSidecarLimits/SSL_UnixSocket (18299 ms)
[ RUN ] Parameters/TestRpc.TestCallTimeoutDoesntAffectNegotiation/SSL_UnixSocket
I20260927 02:06:56.932101 8183 acceptor_pool.cc:254] collecting diagnostics on the listening RPC socket unix:/tmp/dist-test-taskSBAZ9a/test-tmp/rpc-test-17fa17fb7d444f60837f3d90f667652a.sock every 8 connection(s)
I20260927 02:06:56.934006 8184 acceptor_pool.cc:254] collecting diagnostics on the listening RPC socket unix:/tmp/dist-test-taskSBAZ9a/test-tmp/rpc-test-17fa17fb7d444f60837f3d90f667652a.sock every 8 connection(s)
W20260927 02:06:56.951422 8179 negotiation.cc:266] Injecting 500ms delay in negotiation
I20260927 02:06:57.001668 7898 rpc-test-base.h:595] status: Timed out: connection negotiation to unix:/tmp/dist-test-taskSBAZ9a/test-tmp/rpc-test-17fa17fb7d444f60837f3d90f667652a.sock for RPC Sleep timed out after 0.050s (ON_OUTBOUND_QUEUE), seconds elapsed: 0.0511933
W20260927 02:06:57.463862 8180 connection.cc:196] Error closing socket: Network error: TlsSocket::Close: Broken pipe
[ OK ] Parameters/TestRpc.TestCallTimeoutDoesntAffectNegotiation/SSL_UnixSocket (556 ms)
[ RUN ] Parameters/TestRpc.TestRpcHandlerLatencyMetric/SSL_UnixSocket
I20260927 02:06:57.502579 8208 acceptor_pool.cc:254] collecting diagnostics on the listening RPC socket unix:/tmp/dist-test-taskSBAZ9a/test-tmp/rpc-test-55386e5ba5b240d78d95fc74ae07ae70.sock every 8 connection(s)
I20260927 02:06:57.503315 8209 acceptor_pool.cc:254] collecting diagnostics on the listening RPC socket unix:/tmp/dist-test-taskSBAZ9a/test-tmp/rpc-test-55386e5ba5b240d78d95fc74ae07ae70.sock every 8 connection(s)
I20260927 02:06:57.580197 7898 rpc-test.cc:1236] Sleep() min lat: 21642
I20260927 02:06:57.580427 7898 rpc-test.cc:1237] Sleep() mean lat: 21642
I20260927 02:06:57.580615 7898 rpc-test.cc:1238] Sleep() max lat: 21642
I20260927 02:06:57.580777 7898 rpc-test.cc:1239] Sleep() #calls: 1
[ OK ] Parameters/TestRpc.TestRpcHandlerLatencyMetric/SSL_UnixSocket (119 ms)
[ RUN ] Parameters/TestRpc.TimedOutOnResponseMetricServiceQueue/SSL_UnixSocket
I20260927 02:06:57.629113 8234 acceptor_pool.cc:254] collecting diagnostics on the listening RPC socket unix:/tmp/dist-test-taskSBAZ9a/test-tmp/rpc-test-3f138ea925ef46be9ed4972275a51a05.sock every 8 connection(s)
I20260927 02:06:57.629868 8235 acceptor_pool.cc:254] collecting diagnostics on the listening RPC socket unix:/tmp/dist-test-taskSBAZ9a/test-tmp/rpc-test-3f138ea925ef46be9ed4972275a51a05.sock every 8 connection(s)
W20260927 02:06:57.709846 8236 rpcz_store.cc:267] Call kudu.rpc_test.CalculatorService.Sleep from unix:<unnamed> (request call id 2) took 20 ms (client timeout 20 ms). Trace:
W20260927 02:06:57.710274 8236 rpcz_store.cc:269] 0927 02:06:57.689329 (+ 0us) service_pool.cc:170] Inserting onto call queue
0927 02:06:57.709687 (+ 20358us) service_pool.cc:214] Skipping call since client already timed out
0927 02:06:57.709774 (+ 87us) inbound_call.cc:173] Queueing failure response
Metrics: {}
W20260927 02:06:57.712491 8231 connection.cc:196] Error closing socket: Network error: TlsSocket::Close: Broken pipe
[ OK ] Parameters/TestRpc.TimedOutOnResponseMetricServiceQueue/SSL_UnixSocket (128 ms)
[ RUN ] Parameters/TestRpc.RpcPendingConnectionsMetric/SSL_UnixSocket
I20260927 02:06:57.727398 8257 acceptor_pool.cc:254] collecting diagnostics on the listening RPC socket 0.0.0.0:35871 every 8 connection(s)
I20260927 02:06:57.728150 8258 acceptor_pool.cc:254] collecting diagnostics on the listening RPC socket 0.0.0.0:35871 every 8 connection(s)
W20260927 02:06:57.733323 8253 negotiation.cc:337] Failed RPC negotiation. Trace:
0927 02:06:57.732086 (+ 0us) reactor.cc:625] Submitting negotiation task for server connection from 127.0.0.1:52782 (local address 127.0.0.1:35871)
0927 02:06:57.732528 (+ 442us) server_negotiation.cc:206] Beginning negotiation
0927 02:06:57.732546 (+ 18us) server_negotiation.cc:399] Waiting for connection header
0927 02:06:57.732762 (+ 216us) negotiation.cc:327] Negotiation complete: Network error: Server connection negotiation failed: server connection from 127.0.0.1:52782: BlockingRecv error: recv got EOF from 127.0.0.1:52782 (error 108)
Metrics: {"server-negotiator.queue_time_us":130}
[ OK ] Parameters/TestRpc.RpcPendingConnectionsMetric/SSL_UnixSocket (29 ms)
[ RUN ] Parameters/TestRpc.TestRpcContextClientDeadline/SSL_UnixSocket
I20260927 02:06:57.768910 8273 acceptor_pool.cc:254] collecting diagnostics on the listening RPC socket unix:/tmp/dist-test-taskSBAZ9a/test-tmp/rpc-test-4095a1f53b1846b9af0bd2b0dfb60eb9.sock every 8 connection(s)
I20260927 02:06:57.769667 8274 acceptor_pool.cc:254] collecting diagnostics on the listening RPC socket unix:/tmp/dist-test-taskSBAZ9a/test-tmp/rpc-test-4095a1f53b1846b9af0bd2b0dfb60eb9.sock every 8 connection(s)
[ OK ] Parameters/TestRpc.TestRpcContextClientDeadline/SSL_UnixSocket (90 ms)
[ RUN ] Parameters/TestRpc.TestApplicationFeatureFlagUnsupportedServer/SSL_UnixSocket
I20260927 02:06:57.852098 8298 acceptor_pool.cc:254] collecting diagnostics on the listening RPC socket unix:/tmp/dist-test-taskSBAZ9a/test-tmp/rpc-test-c147605dd50a4734ab19755e4bf753e5.sock every 8 connection(s)
I20260927 02:06:57.852839 8299 acceptor_pool.cc:254] collecting diagnostics on the listening RPC socket unix:/tmp/dist-test-taskSBAZ9a/test-tmp/rpc-test-c147605dd50a4734ab19755e4bf753e5.sock every 8 connection(s)
W20260927 02:06:57.887029 8295 connection.cc:196] Error closing socket: Network error: TlsSocket::Close: Broken pipe
[ OK ] Parameters/TestRpc.TestApplicationFeatureFlagUnsupportedServer/SSL_UnixSocket (54 ms)
[ RUN ] Parameters/TestRpc.TestCancellationAsync/SSL_UnixSocket
I20260927 02:06:57.917296 8323 acceptor_pool.cc:254] collecting diagnostics on the listening RPC socket unix:/tmp/dist-test-taskSBAZ9a/test-tmp/rpc-test-e2e7241a2b934f2697cab471a21e4e59.sock every 8 connection(s)
I20260927 02:06:57.918066 8324 acceptor_pool.cc:254] collecting diagnostics on the listening RPC socket unix:/tmp/dist-test-taskSBAZ9a/test-tmp/rpc-test-e2e7241a2b934f2697cab471a21e4e59.sock every 8 connection(s)
I20260927 02:06:57.921273 7898 rpc-test.cc:1716] Connecting to unix:/tmp/dist-test-taskSBAZ9a/test-tmp/rpc-test-e2e7241a2b934f2697cab471a21e4e59.sock
I20260927 02:06:57.944381 7898 test_util.cc:268] Using random seed: 1736489769
I20260927 02:06:58.169956 8327 rpc-test-base.h:240] got call: sleep_micros: 500 pattern: 4294967295 num_repetitions: 2097152 sidecar_idx: 0
I20260927 02:06:58.387861 8326 rpc-test-base.h:240] got call: sleep_micros: 500 pattern: 4294967295 num_repetitions: 2097152 sidecar_idx: 0
I20260927 02:06:58.624526 8326 rpc-test-base.h:240] got call: sleep_micros: 500 pattern: 4294967295 num_repetitions: 2097152 sidecar_idx: 0
I20260927 02:06:58.850337 8326 rpc-test-base.h:240] got call: sleep_micros: 500 pattern: 4294967295 num_repetitions: 2097152 sidecar_idx: 0
I20260927 02:06:59.046741 8327 rpc-test-base.h:240] got call: sleep_micros: 500 pattern: 4294967295 num_repetitions: 2097152 sidecar_idx: 0
I20260927 02:06:59.257447 8327 rpc-test-base.h:240] got call: sleep_micros: 500 pattern: 4294967295 num_repetitions: 2097152 sidecar_idx: 0
I20260927 02:06:59.445015 8326 rpc-test-base.h:240] got call: sleep_micros: 500 pattern: 4294967295 num_repetitions: 2097152 sidecar_idx: 0
I20260927 02:06:59.647421 8327 rpc-test-base.h:240] got call: sleep_micros: 500 pattern: 4294967295 num_repetitions: 2097152 sidecar_idx: 0
I20260927 02:06:59.869829 8326 rpc-test-base.h:240] got call: sleep_micros: 500 pattern: 4294967295 num_repetitions: 2097152 sidecar_idx: 0
W20260927 02:06:59.894016 8320 connection.cc:196] Error closing socket: Network error: TlsSocket::Close: Broken pipe
W20260927 02:06:59.912055 8320 connection.cc:441] server connection from unix:<unnamed> torn down before Call kudu.rpc.GenericCalculatorService.SleepWithSidecar from unix:<unnamed> (request call id 8) could send its response
W20260927 02:07:00.009711 8320 connection.cc:441] server connection from unix:<unnamed> torn down before Call kudu.rpc.GenericCalculatorService.SleepWithSidecar from unix:<unnamed> (request call id 9) could send its response
[ OK ] Parameters/TestRpc.TestCancellationAsync/SSL_UnixSocket (2126 ms)
[ RUN ] Parameters/TestRpc.TestPerformanceBySocketType/SSL_UnixSocket
I20260927 02:07:00.112838 8348 acceptor_pool.cc:254] collecting diagnostics on the listening RPC socket unix:/tmp/dist-test-taskSBAZ9a/test-tmp/rpc-test-7f8aed458a7448339414e0ba621c21c0.sock every 8 connection(s)
I20260927 02:07:00.113543 8350 acceptor_pool.cc:254] collecting diagnostics on the listening RPC socket unix:/tmp/dist-test-taskSBAZ9a/test-tmp/rpc-test-7f8aed458a7448339414e0ba621c21c0.sock every 8 connection(s)
I20260927 02:07:00.116693 7898 rpc-test.cc:1846] Connecting to unix:/tmp/dist-test-taskSBAZ9a/test-tmp/rpc-test-7f8aed458a7448339414e0ba621c21c0.sock
I20260927 02:07:21.671101 7898 rpc-test.cc:1859] Sending 1024MB via ssl-enabled unix socket: real 21.529s user 18.900s sys 13.199s
I20260927 02:07:43.032577 7898 rpc-test.cc:1859] Sending 1024MB via ssl-enabled unix socket: real 21.361s user 18.847s sys 12.932s
I20260927 02:08:04.219815 7898 rpc-test.cc:1859] Sending 1024MB via ssl-enabled unix socket: real 21.187s user 18.686s sys 12.792s
I20260927 02:08:25.535650 7898 rpc-test.cc:1859] Sending 1024MB via ssl-enabled unix socket: real 21.315s user 18.380s sys 13.221s
I20260927 02:08:46.810067 7898 rpc-test.cc:1859] Sending 1024MB via ssl-enabled unix socket: real 21.274s user 18.623s sys 12.930s
W20260927 02:08:46.815968 8345 connection.cc:196] Error closing socket: Network error: TlsSocket::Close: Broken pipe
[ OK ] Parameters/TestRpc.TestPerformanceBySocketType/SSL_UnixSocket (106808 ms)
[----------] 20 tests from Parameters/TestRpc (271641 ms total)
[----------] 1 test from Parameters/TestRpcSocketTxRxQueue
[ RUN ] Parameters/TestRpcSocketTxRxQueue.AcceptorRxQueueSizeMetric/0
I20260927 02:08:46.839636 8385 acceptor_pool.cc:254] collecting diagnostics on the listening RPC socket 0.0.0.0:36031 every 1 connection(s)
I20260927 02:08:46.840572 8386 acceptor_pool.cc:254] collecting diagnostics on the listening RPC socket 0.0.0.0:36031 every 1 connection(s)
W20260927 02:08:46.846302 8381 negotiation.cc:337] Failed RPC negotiation. Trace:
0927 02:08:46.844596 (+ 0us) reactor.cc:625] Submitting negotiation task for server connection from 127.0.0.1:46418 (local address 127.0.0.1:36031)
0927 02:08:46.845081 (+ 485us) server_negotiation.cc:206] Beginning negotiation
0927 02:08:46.845106 (+ 25us) server_negotiation.cc:399] Waiting for connection header
0927 02:08:46.845354 (+ 248us) negotiation.cc:327] Negotiation complete: Network error: Server connection negotiation failed: server connection from 127.0.0.1:46418: BlockingRecv error: recv got EOF from 127.0.0.1:46418 (error 108)
Metrics: {"server-negotiator.queue_time_us":125}
[ OK ] Parameters/TestRpcSocketTxRxQueue.AcceptorRxQueueSizeMetric/0 (25 ms)
[----------] 1 test from Parameters/TestRpcSocketTxRxQueue (25 ms total)
[----------] Global test environment tear-down
[==========] 21 tests from 2 test suites ran. (271667 ms total)
[ PASSED ] 20 tests.
[ FAILED ] 1 test, listed below:
[ FAILED ] Parameters/TestRpc.TestCallWithChainCertAndChainCA/SSL_UnixSocket, where GetParam() = (true, true)
1 FAILED TEST