Diagnosed failure

Parameters/TestRpc.TestCallWithChainCertAndChainCA/SSL_TCP: /data0/somelongdirectorytoavoidrpathissues/src/kudu/src/kudu/rpc/rpc-test.cc:270: Failure
Failed
Bad status: Runtime error: could not verify certificate chain (error with cert: subject=CN = localhost, ST = sadfjas, C = AS, emailAddress = sdflkdsajf, O = lskdfjlsad, OU = sldfkja, issuer=C = AS, ST = ASDfkjdhf, L = lskdjf, O = saldfja, OU = skdjf, CN = localhost, emailAddress = sadjflkadsj): : certificate has expired
Google Test trace:
/data0/somelongdirectorytoavoidrpathissues/src/kudu/src/kudu/rpc/rpc-test.cc:267: Connecting to 0.0.0.0:42769
I20260927 13:35:27.567726  1204 test_util.cc:175] -----------------------------------------------
I20260927 13:35:27.567808  1204 test_util.cc:176] Had fatal failures, leaving test files at /tmp/dist-test-taskkmZ752/test-tmp/rpc-test.5.Parameters_TestRpc.TestCallWithChainCertAndChainCA_SSL_TCP.1790516127504718-1204-0

Full log

Note: This is test shard 6 of 8.
[==========] Running 21 tests from 2 test suites.
[----------] Global test environment set-up.
[----------] 20 tests from Parameters/TestRpc
[ RUN      ] Parameters/TestRpc.TestMessengerCreateDestroy/SSL_TCP
WARNING: Logging before InitGoogleLogging() is written to STDERR
I20260927 13:35:27.531880  1204 rpc-test.cc:169] started messenger TestCreateDestroy
[       OK ] Parameters/TestRpc.TestMessengerCreateDestroy/SSL_TCP (25 ms)
[ RUN      ] Parameters/TestRpc.TestNegotiationDeadlock/SSL_TCP
I20260927 13:35:27.543082  1225 acceptor_pool.cc:254] collecting diagnostics on the listening RPC socket 0.0.0.0:34467 every 8 connection(s)
I20260927 13:35:27.543094  1224 acceptor_pool.cc:254] collecting diagnostics on the listening RPC socket 0.0.0.0:34467 every 8 connection(s)
[       OK ] Parameters/TestRpc.TestNegotiationDeadlock/SSL_TCP (17 ms)
[ RUN      ] Parameters/TestRpc.TestCallWithChainCertAndChainCA/SSL_TCP
I20260927 13:35:27.563602  1240 acceptor_pool.cc:254] collecting diagnostics on the listening RPC socket 0.0.0.0:42769 every 8 connection(s)
I20260927 13:35:27.563637  1241 acceptor_pool.cc:254] collecting diagnostics on the listening RPC socket 0.0.0.0:42769 every 8 connection(s)
/data0/somelongdirectorytoavoidrpathissues/src/kudu/src/kudu/rpc/rpc-test.cc:270: Failure
Failed
Bad status: Runtime error: could not verify certificate chain (error with cert: subject=CN = localhost, ST = sadfjas, C = AS, emailAddress = sdflkdsajf, O = lskdfjlsad, OU = sldfkja, issuer=C = AS, ST = ASDfkjdhf, L = lskdjf, O = saldfja, OU = skdjf, CN = localhost, emailAddress = sadjflkadsj): : certificate has expired
Google Test trace:
/data0/somelongdirectorytoavoidrpathissues/src/kudu/src/kudu/rpc/rpc-test.cc:267: Connecting to 0.0.0.0:42769
I20260927 13:35:27.567726  1204 test_util.cc:175] -----------------------------------------------
I20260927 13:35:27.567808  1204 test_util.cc:176] Had fatal failures, leaving test files at /tmp/dist-test-taskkmZ752/test-tmp/rpc-test.5.Parameters_TestRpc.TestCallWithChainCertAndChainCA_SSL_TCP.1790516127504718-1204-0
[  FAILED  ] Parameters/TestRpc.TestCallWithChainCertAndChainCA/SSL_TCP, where GetParam() = (true, false) (16 ms)
[ RUN      ] Parameters/TestRpc.TestCallWithPasswordProtectedKey/SSL_TCP
I20260927 13:35:27.579928  1265 acceptor_pool.cc:254] collecting diagnostics on the listening RPC socket 0.0.0.0:36923 every 8 connection(s)
I20260927 13:35:27.579941  1266 acceptor_pool.cc:254] collecting diagnostics on the listening RPC socket 0.0.0.0:36923 every 8 connection(s)
[       OK ] Parameters/TestRpc.TestCallWithPasswordProtectedKey/SSL_TCP (25 ms)
[ RUN      ] Parameters/TestRpc.TestCallToBadServer/SSL_TCP
I20260927 13:35:27.619772  1204 rpc-test.cc:394] Status: Network error: Client connection negotiation failed: client connection to 0.0.0.0:0: connect: Connection refused (error 111)
I20260927 13:35:27.620217  1204 rpc-test.cc:394] Status: Network error: Client connection negotiation failed: client connection to 0.0.0.0:0: connect: Connection refused (error 111)
I20260927 13:35:27.620500  1204 rpc-test.cc:394] Status: Network error: Client connection negotiation failed: client connection to 0.0.0.0:0: connect: Connection refused (error 111)
I20260927 13:35:27.620725  1204 rpc-test.cc:394] Status: Network error: Client connection negotiation failed: client connection to 0.0.0.0:0: connect: Connection refused (error 111)
I20260927 13:35:27.620965  1204 rpc-test.cc:394] Status: Network error: Client connection negotiation failed: client connection to 0.0.0.0:0: connect: Connection refused (error 111)
[       OK ] Parameters/TestRpc.TestCallToBadServer/SSL_TCP (28 ms)
[ RUN      ] Parameters/TestRpc.TestWrongService/SSL_TCP
I20260927 13:35:27.631359  1300 acceptor_pool.cc:254] collecting diagnostics on the listening RPC socket 0.0.0.0:35663 every 8 connection(s)
I20260927 13:35:27.631399  1301 acceptor_pool.cc:254] collecting diagnostics on the listening RPC socket 0.0.0.0:35663 every 8 connection(s)
I20260927 13:35:27.645742  1297 messenger.cc:345] service WrongServiceName not registered on TestServer
[       OK ] Parameters/TestRpc.TestWrongService/SSL_TCP (25 ms)
[ RUN      ] Parameters/TestRpc.TestConnectionKeepalive/SSL_TCP
I20260927 13:35:27.654562  1323 acceptor_pool.cc:254] collecting diagnostics on the listening RPC socket 0.0.0.0:46283 every 8 connection(s)
I20260927 13:35:27.654611  1324 acceptor_pool.cc:254] collecting diagnostics on the listening RPC socket 0.0.0.0:46283 every 8 connection(s)
I20260927 13:35:27.654757  1204 rpc-test.cc:488] Connecting to 0.0.0.0:46283
[       OK ] Parameters/TestRpc.TestConnectionKeepalive/SSL_TCP (1039 ms)
[ RUN      ] Parameters/TestRpc.TestClientConnectionMetrics/SSL_TCP
I20260927 13:35:28.697579  1348 acceptor_pool.cc:254] collecting diagnostics on the listening RPC socket 0.0.0.0:38207 every 8 connection(s)
I20260927 13:35:28.697795  1349 acceptor_pool.cc:254] collecting diagnostics on the listening RPC socket 0.0.0.0:38207 every 8 connection(s)
I20260927 13:35:28.697775  1204 rpc-test.cc:569] Connecting to 0.0.0.0:38207
[       OK ] Parameters/TestRpc.TestClientConnectionMetrics/SSL_TCP (9838 ms)
[ RUN      ] Parameters/TestRpc.TestCredentialsPolicy/SSL_TCP
I20260927 13:35:38.543860  1372 acceptor_pool.cc:254] collecting diagnostics on the listening RPC socket 0.0.0.0:40273 every 8 connection(s)
I20260927 13:35:38.543860  1371 acceptor_pool.cc:254] collecting diagnostics on the listening RPC socket 0.0.0.0:40273 every 8 connection(s)
I20260927 13:35:38.544028  1204 rpc-test.cc:700] Connecting to 0.0.0.0:40273
[       OK ] Parameters/TestRpc.TestCredentialsPolicy/SSL_TCP (58 ms)
[ RUN      ] Parameters/TestRpc.TestCallLongerThanKeepalive/SSL_TCP
I20260927 13:35:38.598003  1397 acceptor_pool.cc:254] collecting diagnostics on the listening RPC socket 0.0.0.0:46505 every 8 connection(s)
I20260927 13:35:38.598004  1396 acceptor_pool.cc:254] collecting diagnostics on the listening RPC socket 0.0.0.0:46505 every 8 connection(s)
I20260927 13:35:38.624464  1400 rpc-test-base.h:222] got call: sleep_micros: 3000000 deferred: true
I20260927 13:35:41.625237  1400 rpcz_store.cc:275] Call kudu.rpc.GenericCalculatorService.Sleep from 127.0.0.1:47418 (request call id 0) took 3000 ms. Trace:
I20260927 13:35:41.625391  1400 rpcz_store.cc:276] 0927 13:35:38.624391 (+     0us) service_pool.cc:170] Inserting onto call queue
0927 13:35:38.624436 (+    45us) service_pool.cc:227] Handling call
0927 13:35:41.625220 (+3000784us) inbound_call.cc:173] Queueing success response
Metrics: {}
[       OK ] Parameters/TestRpc.TestCallLongerThanKeepalive/SSL_TCP (3043 ms)
[ RUN      ] Parameters/TestRpc.TestRpcSidecar/SSL_TCP
I20260927 13:35:41.649250  1421 acceptor_pool.cc:254] collecting diagnostics on the listening RPC socket 0.0.0.0:43963 every 8 connection(s)
I20260927 13:35:41.649300  1422 acceptor_pool.cc:254] collecting diagnostics on the listening RPC socket 0.0.0.0:43963 every 8 connection(s)
[       OK ] Parameters/TestRpc.TestRpcSidecar/SSL_TCP (62 ms)
[ RUN      ] Parameters/TestRpc.TestRpcSidecarLimits/SSL_TCP
I20260927 13:35:43.602180  1446 acceptor_pool.cc:254] collecting diagnostics on the listening RPC socket 0.0.0.0:39483 every 8 connection(s)
I20260927 13:35:43.602180  1447 acceptor_pool.cc:254] collecting diagnostics on the listening RPC socket 0.0.0.0:39483 every 8 connection(s)
W20260927 13:35:43.617215  1204 serialization.cc:72] Serialized kudu.rpc_test.PushStringsRequestPB (2147483654 bytes) is larger than the maximum configured RPC message size (52428800 bytes). Sending anyway, but peer may reject the data.
W20260927 13:35:43.621601  1443 connection.cc:535] server connection from 127.0.0.1:35700 recv error: Network error: RPC frame had a length of 2147483714, but we only support messages up to 52428800 bytes long.
W20260927 13:35:43.621716  1443 connection.cc:158] shutting down server connection from 127.0.0.1:35700 with pending inbound data: 4/2147483714 bytes received; last active 0 ns ago: status Network error: RPC frame had a length of 2147483714, but we only support messages up to 52428800 bytes long.
W20260927 13:35:43.622092  1459 connection.cc:196] Error closing socket: Network error: TlsSocket::Close: Connection reset by peer
I20260927 13:35:43.645391  1471 acceptor_pool.cc:254] collecting diagnostics on the listening RPC socket 0.0.0.0:42041 every 8 connection(s)
I20260927 13:35:43.645395  1472 acceptor_pool.cc:254] collecting diagnostics on the listening RPC socket 0.0.0.0:42041 every 8 connection(s)
W20260927 13:35:47.648630  1470 connection.cc:577] server connection from 127.0.0.1:37168: received bad data: 'Corruption: Invalid packet: message had a length of 2147483710, but we only support messages up to 2147483647 bytes
'
[       OK ] Parameters/TestRpc.TestRpcSidecarLimits/SSL_TCP (5960 ms)
[ RUN      ] Parameters/TestRpc.TestCallTimeoutDoesntAffectNegotiation/SSL_TCP
I20260927 13:35:47.664783  1496 acceptor_pool.cc:254] collecting diagnostics on the listening RPC socket 0.0.0.0:42479 every 8 connection(s)
I20260927 13:35:47.664924  1497 acceptor_pool.cc:254] collecting diagnostics on the listening RPC socket 0.0.0.0:42479 every 8 connection(s)
W20260927 13:35:47.687270  1492 negotiation.cc:266] Injecting 500ms delay in negotiation
I20260927 13:35:47.737569  1204 rpc-test-base.h:595] status: Timed out: connection negotiation to 0.0.0.0:42479 for RPC Sleep timed out after 0.050s (ON_OUTBOUND_QUEUE), seconds elapsed: 0.0507173
[       OK ] Parameters/TestRpc.TestCallTimeoutDoesntAffectNegotiation/SSL_TCP (541 ms)
[ RUN      ] Parameters/TestRpc.TestRpcHandlerLatencyMetric/SSL_TCP
I20260927 13:35:48.204743  1522 acceptor_pool.cc:254] collecting diagnostics on the listening RPC socket 0.0.0.0:45025 every 8 connection(s)
I20260927 13:35:48.204772  1521 acceptor_pool.cc:254] collecting diagnostics on the listening RPC socket 0.0.0.0:45025 every 8 connection(s)
I20260927 13:35:48.237484  1204 rpc-test.cc:1236] Sleep() min lat: 20434
I20260927 13:35:48.237555  1204 rpc-test.cc:1237] Sleep() mean lat: 20434
I20260927 13:35:48.237581  1204 rpc-test.cc:1238] Sleep() max lat: 20434
I20260927 13:35:48.237593  1204 rpc-test.cc:1239] Sleep() #calls: 1
[       OK ] Parameters/TestRpc.TestRpcHandlerLatencyMetric/SSL_TCP (46 ms)
[ RUN      ] Parameters/TestRpc.TimedOutOnResponseMetricServiceQueue/SSL_TCP
I20260927 13:35:48.256311  1547 acceptor_pool.cc:254] collecting diagnostics on the listening RPC socket 0.0.0.0:35669 every 8 connection(s)
I20260927 13:35:48.256325  1548 acceptor_pool.cc:254] collecting diagnostics on the listening RPC socket 0.0.0.0:35669 every 8 connection(s)
W20260927 13:35:48.308565  1549 rpcz_store.cc:267] Call kudu.rpc_test.CalculatorService.Sleep from 127.0.0.1:36634 (request call id 2) took 20 ms (client timeout 20 ms). Trace:
W20260927 13:35:48.308768  1549 rpcz_store.cc:269] 0927 13:35:48.288282 (+     0us) service_pool.cc:170] Inserting onto call queue
0927 13:35:48.308536 (+ 20254us) service_pool.cc:214] Skipping call since client already timed out
0927 13:35:48.308548 (+    12us) inbound_call.cc:173] Queueing failure response
Metrics: {}
[       OK ] Parameters/TestRpc.TimedOutOnResponseMetricServiceQueue/SSL_TCP (71 ms)
[ RUN      ] Parameters/TestRpc.RpcPendingConnectionsMetric/SSL_TCP
I20260927 13:35:48.312364  1570 acceptor_pool.cc:254] collecting diagnostics on the listening RPC socket 0.0.0.0:45515 every 8 connection(s)
I20260927 13:35:48.312423  1571 acceptor_pool.cc:254] collecting diagnostics on the listening RPC socket 0.0.0.0:45515 every 8 connection(s)
W20260927 13:35:48.321449  1566 negotiation.cc:337] Failed RPC negotiation. Trace:
0927 13:35:48.321147 (+     0us) reactor.cc:625] Submitting negotiation task for server connection from 127.0.0.1:49068 (local address 127.0.0.1:45515)
0927 13:35:48.321242 (+    95us) server_negotiation.cc:206] Beginning negotiation
0927 13:35:48.321245 (+     3us) server_negotiation.cc:399] Waiting for connection header
0927 13:35:48.321353 (+   108us) negotiation.cc:327] Negotiation complete: Network error: Server connection negotiation failed: server connection from 127.0.0.1:49068: BlockingRecv error: recv got EOF from 127.0.0.1:49068 (error 108)
Metrics: {"server-negotiator.queue_time_us":23}
[       OK ] Parameters/TestRpc.RpcPendingConnectionsMetric/SSL_TCP (21 ms)
[ RUN      ] Parameters/TestRpc.TestRpcContextClientDeadline/SSL_TCP
I20260927 13:35:48.351771  1586 acceptor_pool.cc:254] collecting diagnostics on the listening RPC socket 0.0.0.0:46437 every 8 connection(s)
I20260927 13:35:48.351784  1587 acceptor_pool.cc:254] collecting diagnostics on the listening RPC socket 0.0.0.0:46437 every 8 connection(s)
[       OK ] Parameters/TestRpc.TestRpcContextClientDeadline/SSL_TCP (64 ms)
[ RUN      ] Parameters/TestRpc.TestApplicationFeatureFlagUnsupportedServer/SSL_TCP
I20260927 13:35:48.402938  1611 acceptor_pool.cc:254] collecting diagnostics on the listening RPC socket 0.0.0.0:36133 every 8 connection(s)
I20260927 13:35:48.402974  1612 acceptor_pool.cc:254] collecting diagnostics on the listening RPC socket 0.0.0.0:36133 every 8 connection(s)
[       OK ] Parameters/TestRpc.TestApplicationFeatureFlagUnsupportedServer/SSL_TCP (17 ms)
[ RUN      ] Parameters/TestRpc.TestCancellationAsync/SSL_TCP
I20260927 13:35:48.425923  1636 acceptor_pool.cc:254] collecting diagnostics on the listening RPC socket 0.0.0.0:41161 every 8 connection(s)
I20260927 13:35:48.425959  1637 acceptor_pool.cc:254] collecting diagnostics on the listening RPC socket 0.0.0.0:41161 every 8 connection(s)
I20260927 13:35:48.426115  1204 rpc-test.cc:1716] Connecting to 0.0.0.0:41161
I20260927 13:35:48.440325  1204 test_util.cc:268] Using random seed: 117312771
I20260927 13:35:48.456045  1640 rpc-test-base.h:240] got call: sleep_micros: 500 pattern: 4294967295 num_repetitions: 2097152 sidecar_idx: 0
I20260927 13:35:48.468321  1640 rpc-test-base.h:240] got call: sleep_micros: 500 pattern: 4294967295 num_repetitions: 2097152 sidecar_idx: 0
I20260927 13:35:48.482043  1640 rpc-test-base.h:240] got call: sleep_micros: 500 pattern: 4294967295 num_repetitions: 2097152 sidecar_idx: 0
I20260927 13:35:48.494899  1640 rpc-test-base.h:240] got call: sleep_micros: 500 pattern: 4294967295 num_repetitions: 2097152 sidecar_idx: 0
I20260927 13:35:48.508147  1640 rpc-test-base.h:240] got call: sleep_micros: 500 pattern: 4294967295 num_repetitions: 2097152 sidecar_idx: 0
I20260927 13:35:48.522156  1640 rpc-test-base.h:240] got call: sleep_micros: 500 pattern: 4294967295 num_repetitions: 2097152 sidecar_idx: 0
I20260927 13:35:48.537725  1640 rpc-test-base.h:240] got call: sleep_micros: 500 pattern: 4294967295 num_repetitions: 2097152 sidecar_idx: 0
I20260927 13:35:48.553223  1640 rpc-test-base.h:240] got call: sleep_micros: 500 pattern: 4294967295 num_repetitions: 2097152 sidecar_idx: 0
W20260927 13:35:48.556948  1635 connection.cc:441] server connection from 127.0.0.1:38064 torn down before Call kudu.rpc.GenericCalculatorService.SleepWithSidecar from 127.0.0.1:38064 (request call id 9) could send its response
[       OK ] Parameters/TestRpc.TestCancellationAsync/SSL_TCP (143 ms)
[ RUN      ] Parameters/TestRpc.TestPerformanceBySocketType/SSL_TCP
I20260927 13:35:48.577349  1661 acceptor_pool.cc:254] collecting diagnostics on the listening RPC socket 0.0.0.0:37823 every 8 connection(s)
I20260927 13:35:48.577383  1662 acceptor_pool.cc:254] collecting diagnostics on the listening RPC socket 0.0.0.0:37823 every 8 connection(s)
I20260927 13:35:48.577525  1204 rpc-test.cc:1846] Connecting to 0.0.0.0:37823
I20260927 13:35:50.299140  1204 rpc-test.cc:1859] Sending 1024MB via ssl-enabled tcp socket: real 1.715s	user 1.647s	sys 1.390s
I20260927 13:35:51.928900  1204 rpc-test.cc:1859] Sending 1024MB via ssl-enabled tcp socket: real 1.630s	user 1.637s	sys 1.263s
I20260927 13:35:53.740036  1204 rpc-test.cc:1859] Sending 1024MB via ssl-enabled tcp socket: real 1.811s	user 1.705s	sys 1.488s
I20260927 13:35:55.588344  1204 rpc-test.cc:1859] Sending 1024MB via ssl-enabled tcp socket: real 1.848s	user 1.601s	sys 1.636s
I20260927 13:35:57.373329  1204 rpc-test.cc:1859] Sending 1024MB via ssl-enabled tcp socket: real 1.785s	user 1.766s	sys 1.387s
[       OK ] Parameters/TestRpc.TestPerformanceBySocketType/SSL_TCP (8816 ms)
[----------] 20 tests from Parameters/TestRpc (29867 ms total)

[----------] 1 test from Parameters/TestRpcSocketTxRxQueue
[ RUN      ] Parameters/TestRpcSocketTxRxQueue.OverCapacity/0
W20260927 13:35:57.642150  1696 negotiation.cc:337] Failed RPC negotiation. Trace:
0927 13:35:57.379024 (+     0us) reactor.cc:625] Submitting negotiation task for client connection to 0.0.0.0:33573 (local address 127.0.0.1:51340)
0927 13:35:57.379099 (+    75us) negotiation.cc:107] Waiting for socket to connect
0927 13:35:57.379109 (+    10us) client_negotiation.cc:174] Beginning negotiation
0927 13:35:57.379157 (+    48us) client_negotiation.cc:252] Sending NEGOTIATE NegotiatePB request
0927 13:35:57.642016 (+262859us) negotiation.cc:327] Negotiation complete: Network error: Client connection negotiation failed: client connection to 0.0.0.0:33573: BlockingRecv error: recv error from unknown peer: Transport endpoint is not connected (error 107)
Metrics: {"client-negotiator.queue_time_us":51}
W20260927 13:35:57.642278  1705 negotiation.cc:337] Failed RPC negotiation. Trace:
0927 13:35:57.380036 (+     0us) reactor.cc:625] Submitting negotiation task for client connection to 0.0.0.0:33573 (local address 127.0.0.1:51346)
0927 13:35:57.380079 (+    43us) negotiation.cc:107] Waiting for socket to connect
0927 13:35:57.380089 (+    10us) client_negotiation.cc:174] Beginning negotiation
0927 13:35:57.380136 (+    47us) client_negotiation.cc:252] Sending NEGOTIATE NegotiatePB request
0927 13:35:57.642016 (+261880us) negotiation.cc:327] Negotiation complete: Network error: Client connection negotiation failed: client connection to 0.0.0.0:33573: BlockingRecv error: recv error from unknown peer: Transport endpoint is not connected (error 107)
Metrics: {"client-negotiator.queue_time_us":19}
W20260927 13:35:57.642383  1687 negotiation.cc:337] Failed RPC negotiation. Trace:
0927 13:35:57.378030 (+     0us) reactor.cc:625] Submitting negotiation task for client connection to 0.0.0.0:33573 (local address 127.0.0.1:51330)
0927 13:35:57.378066 (+    36us) negotiation.cc:107] Waiting for socket to connect
0927 13:35:57.378074 (+     8us) client_negotiation.cc:174] Beginning negotiation
0927 13:35:57.378112 (+    38us) client_negotiation.cc:252] Sending NEGOTIATE NegotiatePB request
0927 13:35:57.642014 (+263902us) negotiation.cc:327] Negotiation complete: Network error: Client connection negotiation failed: client connection to 0.0.0.0:33573: BlockingRecv error: recv error from unknown peer: Transport endpoint is not connected (error 107)
Metrics: {"client-negotiator.queue_time_us":18}
W20260927 13:35:57.642464  1678 negotiation.cc:337] Failed RPC negotiation. Trace:
0927 13:35:57.377005 (+     0us) reactor.cc:625] Submitting negotiation task for client connection to 0.0.0.0:33573 (local address 127.0.0.1:51318)
0927 13:35:57.377045 (+    40us) negotiation.cc:107] Waiting for socket to connect
0927 13:35:57.377056 (+    11us) client_negotiation.cc:174] Beginning negotiation
0927 13:35:57.377164 (+   108us) client_negotiation.cc:252] Sending NEGOTIATE NegotiatePB request
0927 13:35:57.642014 (+264850us) negotiation.cc:327] Negotiation complete: Network error: Client connection negotiation failed: client connection to 0.0.0.0:33573: BlockingRecv error: recv error from unknown peer: Transport endpoint is not connected (error 107)
Metrics: {"client-negotiator.queue_time_us":20}
W20260927 13:35:57.642526  1714 negotiation.cc:337] Failed RPC negotiation. Trace:
0927 13:35:57.381191 (+     0us) reactor.cc:625] Submitting negotiation task for client connection to 0.0.0.0:33573 (local address 127.0.0.1:51348)
0927 13:35:57.381240 (+    49us) negotiation.cc:107] Waiting for socket to connect
0927 13:35:57.381249 (+     9us) client_negotiation.cc:174] Beginning negotiation
0927 13:35:57.381318 (+    69us) client_negotiation.cc:252] Sending NEGOTIATE NegotiatePB request
0927 13:35:57.642100 (+260782us) negotiation.cc:327] Negotiation complete: Network error: Client connection negotiation failed: client connection to 0.0.0.0:33573: BlockingRecv error: recv error from unknown peer: Transport endpoint is not connected (error 107)
Metrics: {"client-negotiator.queue_time_us":21}
W20260927 13:35:57.642578  1723 negotiation.cc:337] Failed RPC negotiation. Trace:
0927 13:35:57.382155 (+     0us) reactor.cc:625] Submitting negotiation task for client connection to 0.0.0.0:33573 (local address 127.0.0.1:51360)
0927 13:35:57.382192 (+    37us) negotiation.cc:107] Waiting for socket to connect
0927 13:35:57.382201 (+     9us) client_negotiation.cc:174] Beginning negotiation
0927 13:35:57.382271 (+    70us) client_negotiation.cc:252] Sending NEGOTIATE NegotiatePB request
0927 13:35:57.642100 (+259829us) negotiation.cc:327] Negotiation complete: Network error: Client connection negotiation failed: client connection to 0.0.0.0:33573: BlockingRecv error: recv error from unknown peer: Transport endpoint is not connected (error 107)
Metrics: {"client-negotiator.queue_time_us":18}
[       OK ] Parameters/TestRpcSocketTxRxQueue.OverCapacity/0 (1045 ms)
[----------] 1 test from Parameters/TestRpcSocketTxRxQueue (1045 ms total)

[----------] Global test environment tear-down
[==========] 21 tests from 2 test suites ran. (30913 ms total)
[  PASSED  ] 20 tests.
[  FAILED  ] 1 test, listed below:
[  FAILED  ] Parameters/TestRpc.TestCallWithChainCertAndChainCA/SSL_TCP, where GetParam() = (true, false)

 1 FAILED TEST