Diagnosed failure
Parameters/TestRpc.TestCallWithChainCertAndChainCA/SSL_TCP: /data0/somelongdirectorytoavoidrpathissues/src/kudu/src/kudu/rpc/rpc-test.cc:270: Failure
Failed
Bad status: Runtime error: could not verify certificate chain (error with cert: subject=CN = localhost, ST = sadfjas, C = AS, emailAddress = sdflkdsajf, O = lskdfjlsad, OU = sldfkja, issuer=C = AS, ST = ASDfkjdhf, L = lskdjf, O = saldfja, OU = skdjf, CN = localhost, emailAddress = sadjflkadsj): : certificate has expired
Google Test trace:
/data0/somelongdirectorytoavoidrpathissues/src/kudu/src/kudu/rpc/rpc-test.cc:267: Connecting to 0.0.0.0:34971
I20260928 02:56:54.860757 8237 test_util.cc:175] -----------------------------------------------
I20260928 02:56:54.860859 8237 test_util.cc:176] Had fatal failures, leaving test files at /tmp/dist-test-taskyRofoV/test-tmp/rpc-test.5.Parameters_TestRpc.TestCallWithChainCertAndChainCA_SSL_TCP.1790564214740163-8237-0
Full log
Note: This is test shard 6 of 8.
[==========] Running 21 tests from 2 test suites.
[----------] Global test environment set-up.
[----------] 20 tests from Parameters/TestRpc
[ RUN ] Parameters/TestRpc.TestMessengerCreateDestroy/SSL_TCP
WARNING: Logging before InitGoogleLogging() is written to STDERR
I20260928 02:56:54.791064 8237 rpc-test.cc:169] started messenger TestCreateDestroy
[ OK ] Parameters/TestRpc.TestMessengerCreateDestroy/SSL_TCP (34 ms)
[ RUN ] Parameters/TestRpc.TestNegotiationDeadlock/SSL_TCP
I20260928 02:56:54.802183 8257 acceptor_pool.cc:254] collecting diagnostics on the listening RPC socket 0.0.0.0:37913 every 8 connection(s)
I20260928 02:56:54.802538 8258 acceptor_pool.cc:254] collecting diagnostics on the listening RPC socket 0.0.0.0:37913 every 8 connection(s)
[ OK ] Parameters/TestRpc.TestNegotiationDeadlock/SSL_TCP (27 ms)
[ RUN ] Parameters/TestRpc.TestCallWithChainCertAndChainCA/SSL_TCP
I20260928 02:56:54.849823 8273 acceptor_pool.cc:254] collecting diagnostics on the listening RPC socket 0.0.0.0:34971 every 8 connection(s)
I20260928 02:56:54.850106 8274 acceptor_pool.cc:254] collecting diagnostics on the listening RPC socket 0.0.0.0:34971 every 8 connection(s)
/data0/somelongdirectorytoavoidrpathissues/src/kudu/src/kudu/rpc/rpc-test.cc:270: Failure
Failed
Bad status: Runtime error: could not verify certificate chain (error with cert: subject=CN = localhost, ST = sadfjas, C = AS, emailAddress = sdflkdsajf, O = lskdfjlsad, OU = sldfkja, issuer=C = AS, ST = ASDfkjdhf, L = lskdjf, O = saldfja, OU = skdjf, CN = localhost, emailAddress = sadjflkadsj): : certificate has expired
Google Test trace:
/data0/somelongdirectorytoavoidrpathissues/src/kudu/src/kudu/rpc/rpc-test.cc:267: Connecting to 0.0.0.0:34971
I20260928 02:56:54.860757 8237 test_util.cc:175] -----------------------------------------------
I20260928 02:56:54.860859 8237 test_util.cc:176] Had fatal failures, leaving test files at /tmp/dist-test-taskyRofoV/test-tmp/rpc-test.5.Parameters_TestRpc.TestCallWithChainCertAndChainCA_SSL_TCP.1790564214740163-8237-0
[ FAILED ] Parameters/TestRpc.TestCallWithChainCertAndChainCA/SSL_TCP, where GetParam() = (true, false) (38 ms)
[ RUN ] Parameters/TestRpc.TestCallWithPasswordProtectedKey/SSL_TCP
I20260928 02:56:54.880345 8298 acceptor_pool.cc:254] collecting diagnostics on the listening RPC socket 0.0.0.0:36419 every 8 connection(s)
I20260928 02:56:54.880553 8299 acceptor_pool.cc:254] collecting diagnostics on the listening RPC socket 0.0.0.0:36419 every 8 connection(s)
[ OK ] Parameters/TestRpc.TestCallWithPasswordProtectedKey/SSL_TCP (53 ms)
[ RUN ] Parameters/TestRpc.TestCallToBadServer/SSL_TCP
I20260928 02:56:54.939450 8237 rpc-test.cc:394] Status: Network error: Client connection negotiation failed: client connection to 0.0.0.0:0: connect: Connection refused (error 111)
I20260928 02:56:54.940127 8237 rpc-test.cc:394] Status: Network error: Client connection negotiation failed: client connection to 0.0.0.0:0: connect: Connection refused (error 111)
I20260928 02:56:54.940728 8237 rpc-test.cc:394] Status: Network error: Client connection negotiation failed: client connection to 0.0.0.0:0: connect: Connection refused (error 111)
I20260928 02:56:54.941298 8237 rpc-test.cc:394] Status: Network error: Client connection negotiation failed: client connection to 0.0.0.0:0: connect: Connection refused (error 111)
I20260928 02:56:54.941885 8237 rpc-test.cc:394] Status: Network error: Client connection negotiation failed: client connection to 0.0.0.0:0: connect: Connection refused (error 111)
[ OK ] Parameters/TestRpc.TestCallToBadServer/SSL_TCP (29 ms)
[ RUN ] Parameters/TestRpc.TestWrongService/SSL_TCP
I20260928 02:56:54.961903 8333 acceptor_pool.cc:254] collecting diagnostics on the listening RPC socket 0.0.0.0:44889 every 8 connection(s)
I20260928 02:56:54.962159 8334 acceptor_pool.cc:254] collecting diagnostics on the listening RPC socket 0.0.0.0:44889 every 8 connection(s)
I20260928 02:56:55.002614 8330 messenger.cc:345] service WrongServiceName not registered on TestServer
[ OK ] Parameters/TestRpc.TestWrongService/SSL_TCP (63 ms)
[ RUN ] Parameters/TestRpc.TestConnectionKeepalive/SSL_TCP
I20260928 02:56:55.028656 8356 acceptor_pool.cc:254] collecting diagnostics on the listening RPC socket 0.0.0.0:46409 every 8 connection(s)
I20260928 02:56:55.028900 8357 acceptor_pool.cc:254] collecting diagnostics on the listening RPC socket 0.0.0.0:46409 every 8 connection(s)
I20260928 02:56:55.029862 8237 rpc-test.cc:488] Connecting to 0.0.0.0:46409
[ OK ] Parameters/TestRpc.TestConnectionKeepalive/SSL_TCP (1067 ms)
[ RUN ] Parameters/TestRpc.TestClientConnectionMetrics/SSL_TCP
I20260928 02:56:56.083892 8381 acceptor_pool.cc:254] collecting diagnostics on the listening RPC socket 0.0.0.0:45503 every 8 connection(s)
I20260928 02:56:56.084160 8382 acceptor_pool.cc:254] collecting diagnostics on the listening RPC socket 0.0.0.0:45503 every 8 connection(s)
I20260928 02:56:56.085026 8237 rpc-test.cc:569] Connecting to 0.0.0.0:45503
[ OK ] Parameters/TestRpc.TestClientConnectionMetrics/SSL_TCP (18643 ms)
[ RUN ] Parameters/TestRpc.TestCredentialsPolicy/SSL_TCP
I20260928 02:57:14.733300 8404 acceptor_pool.cc:254] collecting diagnostics on the listening RPC socket 0.0.0.0:36113 every 8 connection(s)
I20260928 02:57:14.733533 8405 acceptor_pool.cc:254] collecting diagnostics on the listening RPC socket 0.0.0.0:36113 every 8 connection(s)
I20260928 02:57:14.734452 8237 rpc-test.cc:700] Connecting to 0.0.0.0:36113
[ OK ] Parameters/TestRpc.TestCredentialsPolicy/SSL_TCP (51 ms)
[ RUN ] Parameters/TestRpc.TestCallLongerThanKeepalive/SSL_TCP
I20260928 02:57:14.782754 8429 acceptor_pool.cc:254] collecting diagnostics on the listening RPC socket 0.0.0.0:46061 every 8 connection(s)
I20260928 02:57:14.782979 8430 acceptor_pool.cc:254] collecting diagnostics on the listening RPC socket 0.0.0.0:46061 every 8 connection(s)
I20260928 02:57:14.808581 8433 rpc-test-base.h:222] got call: sleep_micros: 3000000 deferred: true
I20260928 02:57:17.810243 8433 rpcz_store.cc:275] Call kudu.rpc.GenericCalculatorService.Sleep from 127.0.0.1:57160 (request call id 0) took 3001 ms. Trace:
I20260928 02:57:17.810423 8433 rpcz_store.cc:276] 0928 02:57:14.808475 (+ 0us) service_pool.cc:170] Inserting onto call queue
0928 02:57:14.808537 (+ 62us) service_pool.cc:227] Handling call
0928 02:57:17.810192 (+3001655us) inbound_call.cc:173] Queueing success response
Metrics: {}
[ OK ] Parameters/TestRpc.TestCallLongerThanKeepalive/SSL_TCP (3047 ms)
[ RUN ] Parameters/TestRpc.TestRpcSidecar/SSL_TCP
I20260928 02:57:17.841689 8454 acceptor_pool.cc:254] collecting diagnostics on the listening RPC socket 0.0.0.0:39403 every 8 connection(s)
I20260928 02:57:17.841897 8455 acceptor_pool.cc:254] collecting diagnostics on the listening RPC socket 0.0.0.0:39403 every 8 connection(s)
[ OK ] Parameters/TestRpc.TestRpcSidecar/SSL_TCP (118 ms)
[ RUN ] Parameters/TestRpc.TestRpcSidecarLimits/SSL_TCP
I20260928 02:57:19.838063 8479 acceptor_pool.cc:254] collecting diagnostics on the listening RPC socket 0.0.0.0:33821 every 8 connection(s)
I20260928 02:57:19.838357 8480 acceptor_pool.cc:254] collecting diagnostics on the listening RPC socket 0.0.0.0:33821 every 8 connection(s)
W20260928 02:57:19.862010 8237 serialization.cc:72] Serialized kudu.rpc_test.PushStringsRequestPB (2147483654 bytes) is larger than the maximum configured RPC message size (52428800 bytes). Sending anyway, but peer may reject the data.
W20260928 02:57:19.868126 8476 connection.cc:535] server connection from 127.0.0.1:41516 recv error: Network error: RPC frame had a length of 2147483714, but we only support messages up to 52428800 bytes long.
W20260928 02:57:19.868291 8476 connection.cc:158] shutting down server connection from 127.0.0.1:41516 with pending inbound data: 4/2147483714 bytes received; last active 0 ns ago: status Network error: RPC frame had a length of 2147483714, but we only support messages up to 52428800 bytes long.
W20260928 02:57:19.868870 8492 connection.cc:196] Error closing socket: Network error: TlsSocket::Close: Connection reset by peer
I20260928 02:57:19.899905 8504 acceptor_pool.cc:254] collecting diagnostics on the listening RPC socket 0.0.0.0:37345 every 8 connection(s)
I20260928 02:57:19.900090 8505 acceptor_pool.cc:254] collecting diagnostics on the listening RPC socket 0.0.0.0:37345 every 8 connection(s)
W20260928 02:57:24.667445 8502 connection.cc:577] server connection from 127.0.0.1:53158: received bad data: 'Corruption: Invalid packet: message had a length of 2147483710, but we only support messages up to 2147483647 bytes
'
[ OK ] Parameters/TestRpc.TestRpcSidecarLimits/SSL_TCP (7154 ms)
[ RUN ] Parameters/TestRpc.TestCallTimeoutDoesntAffectNegotiation/SSL_TCP
I20260928 02:57:25.103547 8529 acceptor_pool.cc:254] collecting diagnostics on the listening RPC socket 0.0.0.0:33075 every 8 connection(s)
I20260928 02:57:25.103809 8530 acceptor_pool.cc:254] collecting diagnostics on the listening RPC socket 0.0.0.0:33075 every 8 connection(s)
W20260928 02:57:25.140617 8525 negotiation.cc:266] Injecting 500ms delay in negotiation
I20260928 02:57:25.191063 8237 rpc-test-base.h:595] status: Timed out: connection negotiation to 0.0.0.0:33075 for RPC Sleep timed out after 0.050s (ON_OUTBOUND_QUEUE), seconds elapsed: 0.0511498
[ OK ] Parameters/TestRpc.TestCallTimeoutDoesntAffectNegotiation/SSL_TCP (563 ms)
[ RUN ] Parameters/TestRpc.TestRpcHandlerLatencyMetric/SSL_TCP
I20260928 02:57:25.671880 8554 acceptor_pool.cc:254] collecting diagnostics on the listening RPC socket 0.0.0.0:44625 every 8 connection(s)
I20260928 02:57:25.672071 8555 acceptor_pool.cc:254] collecting diagnostics on the listening RPC socket 0.0.0.0:44625 every 8 connection(s)
I20260928 02:57:25.735873 8237 rpc-test.cc:1236] Sleep() min lat: 20712
I20260928 02:57:25.735975 8237 rpc-test.cc:1237] Sleep() mean lat: 20712
I20260928 02:57:25.736024 8237 rpc-test.cc:1238] Sleep() max lat: 20712
I20260928 02:57:25.736065 8237 rpc-test.cc:1239] Sleep() #calls: 1
[ OK ] Parameters/TestRpc.TestRpcHandlerLatencyMetric/SSL_TCP (87 ms)
[ RUN ] Parameters/TestRpc.TimedOutOnResponseMetricServiceQueue/SSL_TCP
I20260928 02:57:25.755987 8580 acceptor_pool.cc:254] collecting diagnostics on the listening RPC socket 0.0.0.0:41795 every 8 connection(s)
I20260928 02:57:25.756196 8581 acceptor_pool.cc:254] collecting diagnostics on the listening RPC socket 0.0.0.0:41795 every 8 connection(s)
W20260928 02:57:25.824698 8582 rpcz_store.cc:267] Call kudu.rpc_test.CalculatorService.Sleep from 127.0.0.1:59512 (request call id 2) took 20 ms (client timeout 20 ms). Trace:
W20260928 02:57:25.824880 8582 rpcz_store.cc:269] 0928 02:57:25.804156 (+ 0us) service_pool.cc:170] Inserting onto call queue
0928 02:57:25.824558 (+ 20402us) service_pool.cc:214] Skipping call since client already timed out
0928 02:57:25.824646 (+ 88us) inbound_call.cc:173] Queueing failure response
Metrics: {}
[ OK ] Parameters/TestRpc.TimedOutOnResponseMetricServiceQueue/SSL_TCP (88 ms)
[ RUN ] Parameters/TestRpc.RpcPendingConnectionsMetric/SSL_TCP
I20260928 02:57:25.833988 8603 acceptor_pool.cc:254] collecting diagnostics on the listening RPC socket 0.0.0.0:41917 every 8 connection(s)
I20260928 02:57:25.834177 8604 acceptor_pool.cc:254] collecting diagnostics on the listening RPC socket 0.0.0.0:41917 every 8 connection(s)
W20260928 02:57:25.836124 8599 negotiation.cc:337] Failed RPC negotiation. Trace:
0928 02:57:25.835508 (+ 0us) reactor.cc:625] Submitting negotiation task for server connection from 127.0.0.1:34114 (local address 127.0.0.1:41917)
0928 02:57:25.835665 (+ 157us) server_negotiation.cc:206] Beginning negotiation
0928 02:57:25.835669 (+ 4us) server_negotiation.cc:399] Waiting for connection header
0928 02:57:25.835807 (+ 138us) negotiation.cc:327] Negotiation complete: Network error: Server connection negotiation failed: server connection from 127.0.0.1:34114: BlockingRecv error: recv got EOF from 127.0.0.1:34114 (error 108)
Metrics: {"server-negotiator.queue_time_us":49}
[ OK ] Parameters/TestRpc.RpcPendingConnectionsMetric/SSL_TCP (19 ms)
[ RUN ] Parameters/TestRpc.TestRpcContextClientDeadline/SSL_TCP
I20260928 02:57:25.867230 8619 acceptor_pool.cc:254] collecting diagnostics on the listening RPC socket 0.0.0.0:44633 every 8 connection(s)
I20260928 02:57:25.867452 8620 acceptor_pool.cc:254] collecting diagnostics on the listening RPC socket 0.0.0.0:44633 every 8 connection(s)
[ OK ] Parameters/TestRpc.TestRpcContextClientDeadline/SSL_TCP (71 ms)
[ RUN ] Parameters/TestRpc.TestApplicationFeatureFlagUnsupportedServer/SSL_TCP
I20260928 02:57:25.939265 8644 acceptor_pool.cc:254] collecting diagnostics on the listening RPC socket 0.0.0.0:42563 every 8 connection(s)
I20260928 02:57:25.939464 8645 acceptor_pool.cc:254] collecting diagnostics on the listening RPC socket 0.0.0.0:42563 every 8 connection(s)
[ OK ] Parameters/TestRpc.TestApplicationFeatureFlagUnsupportedServer/SSL_TCP (47 ms)
[ RUN ] Parameters/TestRpc.TestCancellationAsync/SSL_TCP
I20260928 02:57:25.990657 8669 acceptor_pool.cc:254] collecting diagnostics on the listening RPC socket 0.0.0.0:46313 every 8 connection(s)
I20260928 02:57:25.990877 8670 acceptor_pool.cc:254] collecting diagnostics on the listening RPC socket 0.0.0.0:46313 every 8 connection(s)
I20260928 02:57:25.991799 8237 rpc-test.cc:1716] Connecting to 0.0.0.0:46313
I20260928 02:57:25.999945 8237 test_util.cc:268] Using random seed: 970232109
I20260928 02:57:26.031798 8673 rpc-test-base.h:240] got call: sleep_micros: 500 pattern: 4294967295 num_repetitions: 2097152 sidecar_idx: 0
I20260928 02:57:26.056985 8672 rpc-test-base.h:240] got call: sleep_micros: 500 pattern: 4294967295 num_repetitions: 2097152 sidecar_idx: 0
I20260928 02:57:26.080698 8671 rpc-test-base.h:240] got call: sleep_micros: 500 pattern: 4294967295 num_repetitions: 2097152 sidecar_idx: 0
I20260928 02:57:26.110190 8672 rpc-test-base.h:240] got call: sleep_micros: 500 pattern: 4294967295 num_repetitions: 2097152 sidecar_idx: 0
I20260928 02:57:26.134953 8671 rpc-test-base.h:240] got call: sleep_micros: 500 pattern: 4294967295 num_repetitions: 2097152 sidecar_idx: 0
I20260928 02:57:26.159412 8673 rpc-test-base.h:240] got call: sleep_micros: 500 pattern: 4294967295 num_repetitions: 2097152 sidecar_idx: 0
W20260928 02:57:26.179977 8668 connection.cc:535] server connection from 127.0.0.1:35524 recv error: Network error: failed to read from TLS socket (remote: unknown): Connection reset by peer (error 104)
W20260928 02:57:26.180212 8668 connection.cc:158] shutting down server connection from 127.0.0.1:35524 with pending inbound data: 7159893/8388693 bytes received; last active 0 ns ago: status Network error: failed to read from TLS socket (remote: unknown): Connection reset by peer (error 104)
W20260928 02:57:26.180486 8668 connection.cc:196] Error closing socket: Network error: TlsSocket::Close: Broken pipe
W20260928 02:57:26.181123 8668 connection.cc:441] server connection from 127.0.0.1:35524 torn down before Call kudu.rpc.GenericCalculatorService.SleepWithSidecar from 127.0.0.1:35524 (request call id 7) could send its response
W20260928 02:57:26.200201 8668 connection.cc:441] server connection from 127.0.0.1:35524 torn down before Call kudu.rpc.GenericCalculatorService.SleepWithSidecar from 127.0.0.1:35524 (request call id 8) could send its response
[ OK ] Parameters/TestRpc.TestCancellationAsync/SSL_TCP (235 ms)
[ RUN ] Parameters/TestRpc.TestPerformanceBySocketType/SSL_TCP
I20260928 02:57:26.218945 8694 acceptor_pool.cc:254] collecting diagnostics on the listening RPC socket 0.0.0.0:42501 every 8 connection(s)
I20260928 02:57:26.219110 8695 acceptor_pool.cc:254] collecting diagnostics on the listening RPC socket 0.0.0.0:42501 every 8 connection(s)
I20260928 02:57:26.219998 8237 rpc-test.cc:1846] Connecting to 0.0.0.0:42501
I20260928 02:57:29.152582 8237 rpc-test.cc:1859] Sending 1024MB via ssl-enabled tcp socket: real 2.915s user 2.636s sys 2.206s
I20260928 02:57:31.989974 8237 rpc-test.cc:1859] Sending 1024MB via ssl-enabled tcp socket: real 2.837s user 2.651s sys 2.036s
I20260928 02:57:34.805094 8237 rpc-test.cc:1859] Sending 1024MB via ssl-enabled tcp socket: real 2.815s user 2.633s sys 2.019s
I20260928 02:57:37.678647 8237 rpc-test.cc:1859] Sending 1024MB via ssl-enabled tcp socket: real 2.873s user 2.713s sys 2.029s
I20260928 02:57:40.563609 8237 rpc-test.cc:1859] Sending 1024MB via ssl-enabled tcp socket: real 2.885s user 2.721s sys 2.053s
[ OK ] Parameters/TestRpc.TestPerformanceBySocketType/SSL_TCP (14367 ms)
[----------] 20 tests from Parameters/TestRpc (45811 ms total)
[----------] 1 test from Parameters/TestRpcSocketTxRxQueue
[ RUN ] Parameters/TestRpcSocketTxRxQueue.OverCapacity/0
W20260928 02:57:40.869670 8720 negotiation.cc:337] Failed RPC negotiation. Trace:
0928 02:57:40.577419 (+ 0us) reactor.cc:625] Submitting negotiation task for client connection to 0.0.0.0:45887 (local address 127.0.0.1:58284)
0928 02:57:40.577620 (+ 201us) negotiation.cc:107] Waiting for socket to connect
0928 02:57:40.577646 (+ 26us) client_negotiation.cc:174] Beginning negotiation
0928 02:57:40.577746 (+ 100us) client_negotiation.cc:252] Sending NEGOTIATE NegotiatePB request
0928 02:57:40.869346 (+291600us) negotiation.cc:327] Negotiation complete: Network error: Client connection negotiation failed: client connection to 0.0.0.0:45887: BlockingRecv error: recv error from unknown peer: Transport endpoint is not connected (error 107)
Metrics: {"client-negotiator.queue_time_us":63}
W20260928 02:57:40.869992 8729 negotiation.cc:337] Failed RPC negotiation. Trace:
0928 02:57:40.586338 (+ 0us) reactor.cc:625] Submitting negotiation task for client connection to 0.0.0.0:45887 (local address 127.0.0.1:58290)
0928 02:57:40.586521 (+ 183us) negotiation.cc:107] Waiting for socket to connect
0928 02:57:40.586538 (+ 17us) client_negotiation.cc:174] Beginning negotiation
0928 02:57:40.586648 (+ 110us) client_negotiation.cc:252] Sending NEGOTIATE NegotiatePB request
0928 02:57:40.869281 (+282633us) negotiation.cc:327] Negotiation complete: Network error: Client connection negotiation failed: client connection to 0.0.0.0:45887: BlockingRecv error: recv error from unknown peer: Transport endpoint is not connected (error 107)
Metrics: {"client-negotiator.queue_time_us":51}
W20260928 02:57:40.870052 8738 negotiation.cc:337] Failed RPC negotiation. Trace:
0928 02:57:40.588884 (+ 0us) reactor.cc:625] Submitting negotiation task for client connection to 0.0.0.0:45887 (local address 127.0.0.1:58292)
0928 02:57:40.589067 (+ 183us) negotiation.cc:107] Waiting for socket to connect
0928 02:57:40.589083 (+ 16us) client_negotiation.cc:174] Beginning negotiation
0928 02:57:40.589174 (+ 91us) client_negotiation.cc:252] Sending NEGOTIATE NegotiatePB request
0928 02:57:40.869285 (+280111us) negotiation.cc:327] Negotiation complete: Network error: Client connection negotiation failed: client connection to 0.0.0.0:45887: BlockingRecv error: recv error from unknown peer: Transport endpoint is not connected (error 107)
Metrics: {"client-negotiator.queue_time_us":62}
W20260928 02:57:40.870138 8756 negotiation.cc:337] Failed RPC negotiation. Trace:
0928 02:57:40.593727 (+ 0us) reactor.cc:625] Submitting negotiation task for client connection to 0.0.0.0:45887 (local address 127.0.0.1:58316)
0928 02:57:40.593952 (+ 225us) negotiation.cc:107] Waiting for socket to connect
0928 02:57:40.593969 (+ 17us) client_negotiation.cc:174] Beginning negotiation
0928 02:57:40.594063 (+ 94us) client_negotiation.cc:252] Sending NEGOTIATE NegotiatePB request
0928 02:57:40.869645 (+275582us) negotiation.cc:327] Negotiation complete: Network error: Client connection negotiation failed: client connection to 0.0.0.0:45887: BlockingRecv error: recv error from unknown peer: Transport endpoint is not connected (error 107)
Metrics: {"client-negotiator.queue_time_us":56}
W20260928 02:57:40.870286 8747 negotiation.cc:337] Failed RPC negotiation. Trace:
0928 02:57:40.591277 (+ 0us) reactor.cc:625] Submitting negotiation task for client connection to 0.0.0.0:45887 (local address 127.0.0.1:58306)
0928 02:57:40.591454 (+ 177us) negotiation.cc:107] Waiting for socket to connect
0928 02:57:40.591471 (+ 17us) client_negotiation.cc:174] Beginning negotiation
0928 02:57:40.591551 (+ 80us) client_negotiation.cc:252] Sending NEGOTIATE NegotiatePB request
0928 02:57:40.869672 (+278121us) negotiation.cc:327] Negotiation complete: Network error: Client connection negotiation failed: client connection to 0.0.0.0:45887: BlockingRecv error: recv error from unknown peer: Transport endpoint is not connected (error 107)
Metrics: {"client-negotiator.queue_time_us":65}
W20260928 02:57:40.870729 8711 negotiation.cc:337] Failed RPC negotiation. Trace:
0928 02:57:40.574634 (+ 0us) reactor.cc:625] Submitting negotiation task for client connection to 0.0.0.0:45887 (local address 127.0.0.1:58272)
0928 02:57:40.574816 (+ 182us) negotiation.cc:107] Waiting for socket to connect
0928 02:57:40.574838 (+ 22us) client_negotiation.cc:174] Beginning negotiation
0928 02:57:40.574988 (+ 150us) client_negotiation.cc:252] Sending NEGOTIATE NegotiatePB request
0928 02:57:40.869329 (+294341us) negotiation.cc:327] Negotiation complete: Network error: Client connection negotiation failed: client connection to 0.0.0.0:45887: BlockingRecv error: recv error from unknown peer: Transport endpoint is not connected (error 107)
Metrics: {"client-negotiator.queue_time_us":56}
[ OK ] Parameters/TestRpcSocketTxRxQueue.OverCapacity/0 (1058 ms)
[----------] 1 test from Parameters/TestRpcSocketTxRxQueue (1058 ms total)
[----------] Global test environment tear-down
[==========] 21 tests from 2 test suites ran. (46869 ms total)
[ PASSED ] 20 tests.
[ FAILED ] 1 test, listed below:
[ FAILED ] Parameters/TestRpc.TestCallWithChainCertAndChainCA/SSL_TCP, where GetParam() = (true, false)
1 FAILED TEST