Diagnosed failure

Parameters/TestRpc.TestCallWithChainCertAndChainCA/SSL_TCP: /data0/somelongdirectorytoavoidrpathissues/src/kudu/src/kudu/rpc/rpc-test.cc:270: Failure
Failed
Bad status: Runtime error: could not verify certificate chain (error with cert: subject=CN = localhost, ST = sadfjas, C = AS, emailAddress = sdflkdsajf, O = lskdfjlsad, OU = sldfkja, issuer=C = AS, ST = ASDfkjdhf, L = lskdjf, O = saldfja, OU = skdjf, CN = localhost, emailAddress = sadjflkadsj): : certificate has expired
Google Test trace:
/data0/somelongdirectorytoavoidrpathissues/src/kudu/src/kudu/rpc/rpc-test.cc:267: Connecting to 0.0.0.0:41869
I20260928 03:44:02.349783   390 test_util.cc:175] -----------------------------------------------
I20260928 03:44:02.349956   390 test_util.cc:176] Had fatal failures, leaving test files at /tmp/dist-test-taskmXyGpG/test-tmp/rpc-test.5.Parameters_TestRpc.TestCallWithChainCertAndChainCA_SSL_TCP.1790567041078144-390-0

Full log

Note: This is test shard 6 of 8.
[==========] Running 21 tests from 2 test suites.
[----------] Global test environment set-up.
[----------] 20 tests from Parameters/TestRpc
[ RUN      ] Parameters/TestRpc.TestMessengerCreateDestroy/SSL_TCP
WARNING: Logging before InitGoogleLogging() is written to STDERR
I20260928 03:44:01.174990   390 rpc-test.cc:169] started messenger TestCreateDestroy
[       OK ] Parameters/TestRpc.TestMessengerCreateDestroy/SSL_TCP (1086 ms)
[ RUN      ] Parameters/TestRpc.TestNegotiationDeadlock/SSL_TCP
I20260928 03:44:02.234019   412 acceptor_pool.cc:254] collecting diagnostics on the listening RPC socket 0.0.0.0:44767 every 8 connection(s)
I20260928 03:44:02.235226   413 acceptor_pool.cc:254] collecting diagnostics on the listening RPC socket 0.0.0.0:44767 every 8 connection(s)
[       OK ] Parameters/TestRpc.TestNegotiationDeadlock/SSL_TCP (68 ms)
[ RUN      ] Parameters/TestRpc.TestCallWithChainCertAndChainCA/SSL_TCP
I20260928 03:44:02.319391   428 acceptor_pool.cc:254] collecting diagnostics on the listening RPC socket 0.0.0.0:41869 every 8 connection(s)
I20260928 03:44:02.321499   429 acceptor_pool.cc:254] collecting diagnostics on the listening RPC socket 0.0.0.0:41869 every 8 connection(s)
/data0/somelongdirectorytoavoidrpathissues/src/kudu/src/kudu/rpc/rpc-test.cc:270: Failure
Failed
Bad status: Runtime error: could not verify certificate chain (error with cert: subject=CN = localhost, ST = sadfjas, C = AS, emailAddress = sdflkdsajf, O = lskdfjlsad, OU = sldfkja, issuer=C = AS, ST = ASDfkjdhf, L = lskdjf, O = saldfja, OU = skdjf, CN = localhost, emailAddress = sadjflkadsj): : certificate has expired
Google Test trace:
/data0/somelongdirectorytoavoidrpathissues/src/kudu/src/kudu/rpc/rpc-test.cc:267: Connecting to 0.0.0.0:41869
I20260928 03:44:02.349783   390 test_util.cc:175] -----------------------------------------------
I20260928 03:44:02.349956   390 test_util.cc:176] Had fatal failures, leaving test files at /tmp/dist-test-taskmXyGpG/test-tmp/rpc-test.5.Parameters_TestRpc.TestCallWithChainCertAndChainCA_SSL_TCP.1790567041078144-390-0
[  FAILED  ] Parameters/TestRpc.TestCallWithChainCertAndChainCA/SSL_TCP, where GetParam() = (true, false) (66 ms)
[ RUN      ] Parameters/TestRpc.TestCallWithPasswordProtectedKey/SSL_TCP
I20260928 03:44:02.379328   453 acceptor_pool.cc:254] collecting diagnostics on the listening RPC socket 0.0.0.0:43943 every 8 connection(s)
I20260928 03:44:02.379971   454 acceptor_pool.cc:254] collecting diagnostics on the listening RPC socket 0.0.0.0:43943 every 8 connection(s)
[       OK ] Parameters/TestRpc.TestCallWithPasswordProtectedKey/SSL_TCP (73 ms)
[ RUN      ] Parameters/TestRpc.TestCallToBadServer/SSL_TCP
I20260928 03:44:02.450548   390 rpc-test.cc:394] Status: Network error: Client connection negotiation failed: client connection to 0.0.0.0:0: connect: Connection refused (error 111)
I20260928 03:44:02.451772   390 rpc-test.cc:394] Status: Network error: Client connection negotiation failed: client connection to 0.0.0.0:0: connect: Connection refused (error 111)
I20260928 03:44:02.452947   390 rpc-test.cc:394] Status: Network error: Client connection negotiation failed: client connection to 0.0.0.0:0: connect: Connection refused (error 111)
I20260928 03:44:02.454046   390 rpc-test.cc:394] Status: Network error: Client connection negotiation failed: client connection to 0.0.0.0:0: connect: Connection refused (error 111)
I20260928 03:44:02.455130   390 rpc-test.cc:394] Status: Network error: Client connection negotiation failed: client connection to 0.0.0.0:0: connect: Connection refused (error 111)
[       OK ] Parameters/TestRpc.TestCallToBadServer/SSL_TCP (33 ms)
[ RUN      ] Parameters/TestRpc.TestWrongService/SSL_TCP
I20260928 03:44:02.473572   488 acceptor_pool.cc:254] collecting diagnostics on the listening RPC socket 0.0.0.0:33991 every 8 connection(s)
I20260928 03:44:02.474301   489 acceptor_pool.cc:254] collecting diagnostics on the listening RPC socket 0.0.0.0:33991 every 8 connection(s)
I20260928 03:44:02.520566   487 messenger.cc:345] service WrongServiceName not registered on TestServer
[       OK ] Parameters/TestRpc.TestWrongService/SSL_TCP (70 ms)
[ RUN      ] Parameters/TestRpc.TestConnectionKeepalive/SSL_TCP
I20260928 03:44:02.555132   511 acceptor_pool.cc:254] collecting diagnostics on the listening RPC socket 0.0.0.0:40979 every 8 connection(s)
I20260928 03:44:02.555790   512 acceptor_pool.cc:254] collecting diagnostics on the listening RPC socket 0.0.0.0:40979 every 8 connection(s)
I20260928 03:44:02.558746   390 rpc-test.cc:488] Connecting to 0.0.0.0:40979
[       OK ] Parameters/TestRpc.TestConnectionKeepalive/SSL_TCP (1076 ms)
[ RUN      ] Parameters/TestRpc.TestClientConnectionMetrics/SSL_TCP
I20260928 03:44:03.619716   536 acceptor_pool.cc:254] collecting diagnostics on the listening RPC socket 0.0.0.0:37263 every 8 connection(s)
I20260928 03:44:03.620379   537 acceptor_pool.cc:254] collecting diagnostics on the listening RPC socket 0.0.0.0:37263 every 8 connection(s)
I20260928 03:44:03.623265   390 rpc-test.cc:569] Connecting to 0.0.0.0:37263
[       OK ] Parameters/TestRpc.TestClientConnectionMetrics/SSL_TCP (109418 ms)
[ RUN      ] Parameters/TestRpc.TestCredentialsPolicy/SSL_TCP
I20260928 03:45:53.050863   570 acceptor_pool.cc:254] collecting diagnostics on the listening RPC socket 0.0.0.0:39359 every 8 connection(s)
I20260928 03:45:53.051601   571 acceptor_pool.cc:254] collecting diagnostics on the listening RPC socket 0.0.0.0:39359 every 8 connection(s)
I20260928 03:45:53.054463   390 rpc-test.cc:700] Connecting to 0.0.0.0:39359
[       OK ] Parameters/TestRpc.TestCredentialsPolicy/SSL_TCP (83 ms)
[ RUN      ] Parameters/TestRpc.TestCallLongerThanKeepalive/SSL_TCP
I20260928 03:45:53.127918   595 acceptor_pool.cc:254] collecting diagnostics on the listening RPC socket 0.0.0.0:46725 every 8 connection(s)
I20260928 03:45:53.128618   596 acceptor_pool.cc:254] collecting diagnostics on the listening RPC socket 0.0.0.0:46725 every 8 connection(s)
I20260928 03:45:53.162076   599 rpc-test-base.h:222] got call: sleep_micros: 3000000 deferred: true
I20260928 03:45:56.166109   599 rpcz_store.cc:275] Call kudu.rpc.GenericCalculatorService.Sleep from 127.0.0.1:45172 (request call id 0) took 3004 ms. Trace:
I20260928 03:45:56.166393   599 rpcz_store.cc:276] 0928 03:45:53.161859 (+     0us) service_pool.cc:170] Inserting onto call queue
0928 03:45:53.161946 (+    87us) service_pool.cc:227] Handling call
0928 03:45:56.166057 (+3004111us) inbound_call.cc:173] Queueing success response
Metrics: {}
[       OK ] Parameters/TestRpc.TestCallLongerThanKeepalive/SSL_TCP (3069 ms)
[ RUN      ] Parameters/TestRpc.TestRpcSidecar/SSL_TCP
I20260928 03:45:56.199088   620 acceptor_pool.cc:254] collecting diagnostics on the listening RPC socket 0.0.0.0:34309 every 8 connection(s)
I20260928 03:45:56.199777   621 acceptor_pool.cc:254] collecting diagnostics on the listening RPC socket 0.0.0.0:34309 every 8 connection(s)
[       OK ] Parameters/TestRpc.TestRpcSidecar/SSL_TCP (510 ms)
[ RUN      ] Parameters/TestRpc.TestRpcSidecarLimits/SSL_TCP
I20260928 03:46:12.652417   647 acceptor_pool.cc:254] collecting diagnostics on the listening RPC socket 0.0.0.0:43577 every 8 connection(s)
I20260928 03:46:12.653198   648 acceptor_pool.cc:254] collecting diagnostics on the listening RPC socket 0.0.0.0:43577 every 8 connection(s)
W20260928 03:46:12.680757   390 serialization.cc:72] Serialized kudu.rpc_test.PushStringsRequestPB (2147483654 bytes) is larger than the maximum configured RPC message size (52428800 bytes). Sending anyway, but peer may reject the data.
W20260928 03:46:12.690488   644 connection.cc:535] server connection from 127.0.0.1:35314 recv error: Network error: RPC frame had a length of 2147483714, but we only support messages up to 52428800 bytes long.
W20260928 03:46:12.690762   644 connection.cc:158] shutting down server connection from 127.0.0.1:35314 with pending inbound data: 4/2147483714 bytes received; last active 0 ns ago: status Network error: RPC frame had a length of 2147483714, but we only support messages up to 52428800 bytes long.
W20260928 03:46:12.691556   660 connection.cc:698] client connection to 0.0.0.0:43577 send error: Network error: failed to write to TLS socket: Connection reset by peer
W20260928 03:46:12.692063   660 connection.cc:196] Error closing socket: Network error: TlsSocket::Close: Success
[       OK ] Parameters/TestRpc.TestRpcSidecarLimits/SSL_TCP (16569 ms)
[ RUN      ] Parameters/TestRpc.TestCallTimeoutDoesntAffectNegotiation/SSL_TCP
I20260928 03:46:13.272984   672 acceptor_pool.cc:254] collecting diagnostics on the listening RPC socket 0.0.0.0:44131 every 8 connection(s)
I20260928 03:46:13.273631   673 acceptor_pool.cc:254] collecting diagnostics on the listening RPC socket 0.0.0.0:44131 every 8 connection(s)
W20260928 03:46:13.297942   668 negotiation.cc:266] Injecting 500ms delay in negotiation
I20260928 03:46:13.348430   390 rpc-test-base.h:595] status: Timed out: connection negotiation to 0.0.0.0:44131 for RPC Sleep timed out after 0.050s (ON_OUTBOUND_QUEUE), seconds elapsed: 0.0513255
[       OK ] Parameters/TestRpc.TestCallTimeoutDoesntAffectNegotiation/SSL_TCP (557 ms)
[ RUN      ] Parameters/TestRpc.TestRpcHandlerLatencyMetric/SSL_TCP
I20260928 03:46:13.835419   697 acceptor_pool.cc:254] collecting diagnostics on the listening RPC socket 0.0.0.0:43907 every 8 connection(s)
I20260928 03:46:13.836072   698 acceptor_pool.cc:254] collecting diagnostics on the listening RPC socket 0.0.0.0:43907 every 8 connection(s)
I20260928 03:46:13.898342   390 rpc-test.cc:1236] Sleep() min lat: 21492
I20260928 03:46:13.898550   390 rpc-test.cc:1237] Sleep() mean lat: 21492
I20260928 03:46:13.898725   390 rpc-test.cc:1238] Sleep() max lat: 21492
I20260928 03:46:13.898877   390 rpc-test.cc:1239] Sleep() #calls: 1
[       OK ] Parameters/TestRpc.TestRpcHandlerLatencyMetric/SSL_TCP (92 ms)
[ RUN      ] Parameters/TestRpc.TimedOutOnResponseMetricServiceQueue/SSL_TCP
I20260928 03:46:13.930547   723 acceptor_pool.cc:254] collecting diagnostics on the listening RPC socket 0.0.0.0:40847 every 8 connection(s)
I20260928 03:46:13.931264   724 acceptor_pool.cc:254] collecting diagnostics on the listening RPC socket 0.0.0.0:40847 every 8 connection(s)
W20260928 03:46:14.016763   725 rpcz_store.cc:267] Call kudu.rpc_test.CalculatorService.Sleep from 127.0.0.1:46744 (request call id 2) took 20 ms (client timeout 20 ms). Trace:
W20260928 03:46:14.017115   725 rpcz_store.cc:269] 0928 03:46:13.996349 (+     0us) service_pool.cc:170] Inserting onto call queue
0928 03:46:14.016644 (+ 20295us) service_pool.cc:214] Skipping call since client already timed out
0928 03:46:14.016718 (+    74us) inbound_call.cc:173] Queueing failure response
Metrics: {}
[       OK ] Parameters/TestRpc.TimedOutOnResponseMetricServiceQueue/SSL_TCP (116 ms)
[ RUN      ] Parameters/TestRpc.RpcPendingConnectionsMetric/SSL_TCP
I20260928 03:46:14.032071   746 acceptor_pool.cc:254] collecting diagnostics on the listening RPC socket 0.0.0.0:33987 every 8 connection(s)
I20260928 03:46:14.032771   747 acceptor_pool.cc:254] collecting diagnostics on the listening RPC socket 0.0.0.0:33987 every 8 connection(s)
W20260928 03:46:14.044170   742 negotiation.cc:337] Failed RPC negotiation. Trace:
0928 03:46:14.042851 (+     0us) reactor.cc:625] Submitting negotiation task for server connection from 127.0.0.1:37652 (local address 127.0.0.1:33987)
0928 03:46:14.043243 (+   392us) server_negotiation.cc:206] Beginning negotiation
0928 03:46:14.043260 (+    17us) server_negotiation.cc:399] Waiting for connection header
0928 03:46:14.043513 (+   253us) negotiation.cc:327] Negotiation complete: Network error: Server connection negotiation failed: server connection from 127.0.0.1:37652: BlockingRecv error: recv got EOF from 127.0.0.1:37652 (error 108)
Metrics: {"server-negotiator.queue_time_us":98}
[       OK ] Parameters/TestRpc.RpcPendingConnectionsMetric/SSL_TCP (33 ms)
[ RUN      ] Parameters/TestRpc.TestRpcContextClientDeadline/SSL_TCP
I20260928 03:46:14.078166   762 acceptor_pool.cc:254] collecting diagnostics on the listening RPC socket 0.0.0.0:43913 every 8 connection(s)
I20260928 03:46:14.078804   763 acceptor_pool.cc:254] collecting diagnostics on the listening RPC socket 0.0.0.0:43913 every 8 connection(s)
[       OK ] Parameters/TestRpc.TestRpcContextClientDeadline/SSL_TCP (80 ms)
[ RUN      ] Parameters/TestRpc.TestApplicationFeatureFlagUnsupportedServer/SSL_TCP
I20260928 03:46:14.152988   787 acceptor_pool.cc:254] collecting diagnostics on the listening RPC socket 0.0.0.0:44335 every 8 connection(s)
I20260928 03:46:14.153689   788 acceptor_pool.cc:254] collecting diagnostics on the listening RPC socket 0.0.0.0:44335 every 8 connection(s)
[       OK ] Parameters/TestRpc.TestApplicationFeatureFlagUnsupportedServer/SSL_TCP (57 ms)
[ RUN      ] Parameters/TestRpc.TestCancellationAsync/SSL_TCP
I20260928 03:46:14.216226   812 acceptor_pool.cc:254] collecting diagnostics on the listening RPC socket 0.0.0.0:41795 every 8 connection(s)
I20260928 03:46:14.216912   813 acceptor_pool.cc:254] collecting diagnostics on the listening RPC socket 0.0.0.0:41795 every 8 connection(s)
I20260928 03:46:14.219749   390 rpc-test.cc:1716] Connecting to 0.0.0.0:41795
I20260928 03:46:14.241513   390 test_util.cc:268] Using random seed: -396493615
I20260928 03:46:14.469365   816 rpc-test-base.h:240] got call: sleep_micros: 500 pattern: 4294967295 num_repetitions: 2097152 sidecar_idx: 0
I20260928 03:46:14.643359   815 rpc-test-base.h:240] got call: sleep_micros: 500 pattern: 4294967295 num_repetitions: 2097152 sidecar_idx: 0
I20260928 03:46:14.814014   816 rpc-test-base.h:240] got call: sleep_micros: 500 pattern: 4294967295 num_repetitions: 2097152 sidecar_idx: 0
I20260928 03:46:14.970875   815 rpc-test-base.h:240] got call: sleep_micros: 500 pattern: 4294967295 num_repetitions: 2097152 sidecar_idx: 0
I20260928 03:46:15.147918   816 rpc-test-base.h:240] got call: sleep_micros: 500 pattern: 4294967295 num_repetitions: 2097152 sidecar_idx: 0
I20260928 03:46:15.319870   815 rpc-test-base.h:240] got call: sleep_micros: 500 pattern: 4294967295 num_repetitions: 2097152 sidecar_idx: 0
I20260928 03:46:15.491660   816 rpc-test-base.h:240] got call: sleep_micros: 500 pattern: 4294967295 num_repetitions: 2097152 sidecar_idx: 0
I20260928 03:46:15.670238   815 rpc-test-base.h:240] got call: sleep_micros: 500 pattern: 4294967295 num_repetitions: 2097152 sidecar_idx: 0
W20260928 03:46:15.833814   810 connection.cc:196] Error closing socket: Network error: TlsSocket::Close: Broken pipe
W20260928 03:46:15.856251   810 connection.cc:441] server connection from 127.0.0.1:41846 torn down before Call kudu.rpc.GenericCalculatorService.SleepWithSidecar from 127.0.0.1:41846 (request call id 8) could send its response
[       OK ] Parameters/TestRpc.TestCancellationAsync/SSL_TCP (1670 ms)
[ RUN      ] Parameters/TestRpc.TestPerformanceBySocketType/SSL_TCP
I20260928 03:46:15.954217   837 acceptor_pool.cc:254] collecting diagnostics on the listening RPC socket 0.0.0.0:38607 every 8 connection(s)
I20260928 03:46:15.954903   838 acceptor_pool.cc:254] collecting diagnostics on the listening RPC socket 0.0.0.0:38607 every 8 connection(s)
I20260928 03:46:15.957716   390 rpc-test.cc:1846] Connecting to 0.0.0.0:38607
I20260928 03:46:34.163749   390 rpc-test.cc:1859] Sending 1024MB via ssl-enabled tcp socket: real 18.185s	user 16.043s	sys 10.006s
I20260928 03:46:52.020593   390 rpc-test.cc:1859] Sending 1024MB via ssl-enabled tcp socket: real 17.856s	user 15.706s	sys 9.767s
I20260928 03:47:09.843707   390 rpc-test.cc:1859] Sending 1024MB via ssl-enabled tcp socket: real 17.823s	user 15.691s	sys 9.658s
I20260928 03:47:27.838604   390 rpc-test.cc:1859] Sending 1024MB via ssl-enabled tcp socket: real 17.994s	user 15.723s	sys 9.952s
I20260928 03:47:45.749063   390 rpc-test.cc:1859] Sending 1024MB via ssl-enabled tcp socket: real 17.910s	user 15.832s	sys 9.741s
[       OK ] Parameters/TestRpc.TestPerformanceBySocketType/SSL_TCP (89900 ms)
[----------] 20 tests from Parameters/TestRpc (224638 ms total)

[----------] 1 test from Parameters/TestRpcSocketTxRxQueue
[ RUN      ] Parameters/TestRpcSocketTxRxQueue.OverCapacity/0
W20260928 03:47:46.179291   872 negotiation.cc:337] Failed RPC negotiation. Trace:
0928 03:47:45.781149 (+     0us) reactor.cc:625] Submitting negotiation task for client connection to 0.0.0.0:33057 (local address 127.0.0.1:48802)
0928 03:47:45.781665 (+   516us) negotiation.cc:107] Waiting for socket to connect
0928 03:47:45.781701 (+    36us) client_negotiation.cc:174] Beginning negotiation
0928 03:47:45.781932 (+   231us) client_negotiation.cc:252] Sending NEGOTIATE NegotiatePB request
0928 03:47:46.178249 (+396317us) negotiation.cc:327] Negotiation complete: Network error: Client connection negotiation failed: client connection to 0.0.0.0:33057: BlockingRecv error: recv error from unknown peer: Transport endpoint is not connected (error 107)
Metrics: {"client-negotiator.queue_time_us":112}
W20260928 03:47:46.179567   899 negotiation.cc:337] Failed RPC negotiation. Trace:
0928 03:47:45.809076 (+     0us) reactor.cc:625] Submitting negotiation task for client connection to 0.0.0.0:33057 (local address 127.0.0.1:48832)
0928 03:47:45.809559 (+   483us) negotiation.cc:107] Waiting for socket to connect
0928 03:47:45.809587 (+    28us) client_negotiation.cc:174] Beginning negotiation
0928 03:47:45.809750 (+   163us) client_negotiation.cc:252] Sending NEGOTIATE NegotiatePB request
0928 03:47:46.178643 (+368893us) negotiation.cc:327] Negotiation complete: Network error: Client connection negotiation failed: client connection to 0.0.0.0:33057: BlockingRecv error: recv error from unknown peer: Transport endpoint is not connected (error 107)
Metrics: {"client-negotiator.queue_time_us":113}
W20260928 03:47:46.179337   863 negotiation.cc:337] Failed RPC negotiation. Trace:
0928 03:47:45.775240 (+     0us) reactor.cc:625] Submitting negotiation task for client connection to 0.0.0.0:33057 (local address 127.0.0.1:48786)
0928 03:47:45.775862 (+   622us) negotiation.cc:107] Waiting for socket to connect
0928 03:47:45.775904 (+    42us) client_negotiation.cc:174] Beginning negotiation
0928 03:47:45.776316 (+   412us) client_negotiation.cc:252] Sending NEGOTIATE NegotiatePB request
0928 03:47:46.178237 (+401921us) negotiation.cc:327] Negotiation complete: Network error: Client connection negotiation failed: client connection to 0.0.0.0:33057: BlockingRecv error: recv error from unknown peer: Transport endpoint is not connected (error 107)
Metrics: {"client-negotiator.queue_time_us":108}
W20260928 03:47:46.179525   908 negotiation.cc:337] Failed RPC negotiation. Trace:
0928 03:47:45.819725 (+     0us) reactor.cc:625] Submitting negotiation task for client connection to 0.0.0.0:33057 (local address 127.0.0.1:48842)
0928 03:47:45.820203 (+   478us) negotiation.cc:107] Waiting for socket to connect
0928 03:47:45.820229 (+    26us) client_negotiation.cc:174] Beginning negotiation
0928 03:47:45.820394 (+   165us) client_negotiation.cc:252] Sending NEGOTIATE NegotiatePB request
0928 03:47:46.178569 (+358175us) negotiation.cc:327] Negotiation complete: Network error: Client connection negotiation failed: client connection to 0.0.0.0:33057: BlockingRecv error: recv error from unknown peer: Transport endpoint is not connected (error 107)
Metrics: {"client-negotiator.queue_time_us":119}
W20260928 03:47:46.180667   890 negotiation.cc:337] Failed RPC negotiation. Trace:
0928 03:47:45.798396 (+     0us) reactor.cc:625] Submitting negotiation task for client connection to 0.0.0.0:33057 (local address 127.0.0.1:48816)
0928 03:47:45.798901 (+   505us) negotiation.cc:107] Waiting for socket to connect
0928 03:47:45.798936 (+    35us) client_negotiation.cc:174] Beginning negotiation
0928 03:47:45.799157 (+   221us) client_negotiation.cc:252] Sending NEGOTIATE NegotiatePB request
0928 03:47:46.179734 (+380577us) negotiation.cc:327] Negotiation complete: Network error: Client connection negotiation failed: client connection to 0.0.0.0:33057: BlockingRecv error: recv error from unknown peer: Transport endpoint is not connected (error 107)
Metrics: {"client-negotiator.queue_time_us":115}
W20260928 03:47:46.180991   881 negotiation.cc:337] Failed RPC negotiation. Trace:
0928 03:47:45.787455 (+     0us) reactor.cc:625] Submitting negotiation task for client connection to 0.0.0.0:33057 (local address 127.0.0.1:48808)
0928 03:47:45.787919 (+   464us) negotiation.cc:107] Waiting for socket to connect
0928 03:47:45.787946 (+    27us) client_negotiation.cc:174] Beginning negotiation
0928 03:47:45.788109 (+   163us) client_negotiation.cc:252] Sending NEGOTIATE NegotiatePB request
0928 03:47:46.178239 (+390130us) negotiation.cc:327] Negotiation complete: Network error: Client connection negotiation failed: client connection to 0.0.0.0:33057: BlockingRecv error: recv error from unknown peer: Transport endpoint is not connected (error 107)
Metrics: {"client-negotiator.queue_time_us":112}
[       OK ] Parameters/TestRpcSocketTxRxQueue.OverCapacity/0 (1201 ms)
[----------] 1 test from Parameters/TestRpcSocketTxRxQueue (1201 ms total)

[----------] Global test environment tear-down
[==========] 21 tests from 2 test suites ran. (225840 ms total)
[  PASSED  ] 20 tests.
[  FAILED  ] 1 test, listed below:
[  FAILED  ] Parameters/TestRpc.TestCallWithChainCertAndChainCA/SSL_TCP, where GetParam() = (true, false)

 1 FAILED TEST