Diagnosed failure

Parameters/TestRpc.TestCallWithChainCertAndChainCA/SSL_TCP: /data0/somelongdirectorytoavoidrpathissues/src/kudu/src/kudu/rpc/rpc-test.cc:270: Failure
Failed
Bad status: Runtime error: could not verify certificate chain (error with cert: subject=CN = localhost, ST = sadfjas, C = AS, emailAddress = sdflkdsajf, O = lskdfjlsad, OU = sldfkja, issuer=C = AS, ST = ASDfkjdhf, L = lskdjf, O = saldfja, OU = skdjf, CN = localhost, emailAddress = sadjflkadsj): : certificate has expired
Google Test trace:
/data0/somelongdirectorytoavoidrpathissues/src/kudu/src/kudu/rpc/rpc-test.cc:267: Connecting to 0.0.0.0:45235
I20260926 13:43:38.459915 20125 test_util.cc:175] -----------------------------------------------
I20260926 13:43:38.459972 20125 test_util.cc:176] Had fatal failures, leaving test files at /tmp/dist-test-task1WhWxf/test-tmp/rpc-test.5.Parameters_TestRpc.TestCallWithChainCertAndChainCA_SSL_TCP.1790430218378792-20125-0

Full log

Note: This is test shard 6 of 8.
[==========] Running 21 tests from 2 test suites.
[----------] Global test environment set-up.
[----------] 20 tests from Parameters/TestRpc
[ RUN      ] Parameters/TestRpc.TestMessengerCreateDestroy/SSL_TCP
WARNING: Logging before InitGoogleLogging() is written to STDERR
I20260926 13:43:38.415555 20125 rpc-test.cc:169] started messenger TestCreateDestroy
[       OK ] Parameters/TestRpc.TestMessengerCreateDestroy/SSL_TCP (31 ms)
[ RUN      ] Parameters/TestRpc.TestNegotiationDeadlock/SSL_TCP
I20260926 13:43:38.433816 20145 acceptor_pool.cc:254] collecting diagnostics on the listening RPC socket 0.0.0.0:40165 every 8 connection(s)
I20260926 13:43:38.433846 20146 acceptor_pool.cc:254] collecting diagnostics on the listening RPC socket 0.0.0.0:40165 every 8 connection(s)
[       OK ] Parameters/TestRpc.TestNegotiationDeadlock/SSL_TCP (28 ms)
[ RUN      ] Parameters/TestRpc.TestCallWithChainCertAndChainCA/SSL_TCP
I20260926 13:43:38.454582 20161 acceptor_pool.cc:254] collecting diagnostics on the listening RPC socket 0.0.0.0:45235 every 8 connection(s)
I20260926 13:43:38.454615 20162 acceptor_pool.cc:254] collecting diagnostics on the listening RPC socket 0.0.0.0:45235 every 8 connection(s)
/data0/somelongdirectorytoavoidrpathissues/src/kudu/src/kudu/rpc/rpc-test.cc:270: Failure
Failed
Bad status: Runtime error: could not verify certificate chain (error with cert: subject=CN = localhost, ST = sadfjas, C = AS, emailAddress = sdflkdsajf, O = lskdfjlsad, OU = sldfkja, issuer=C = AS, ST = ASDfkjdhf, L = lskdjf, O = saldfja, OU = skdjf, CN = localhost, emailAddress = sadjflkadsj): : certificate has expired
Google Test trace:
/data0/somelongdirectorytoavoidrpathissues/src/kudu/src/kudu/rpc/rpc-test.cc:267: Connecting to 0.0.0.0:45235
I20260926 13:43:38.459915 20125 test_util.cc:175] -----------------------------------------------
I20260926 13:43:38.459972 20125 test_util.cc:176] Had fatal failures, leaving test files at /tmp/dist-test-task1WhWxf/test-tmp/rpc-test.5.Parameters_TestRpc.TestCallWithChainCertAndChainCA_SSL_TCP.1790430218378792-20125-0
[  FAILED  ] Parameters/TestRpc.TestCallWithChainCertAndChainCA/SSL_TCP, where GetParam() = (true, false) (14 ms)
[ RUN      ] Parameters/TestRpc.TestCallWithPasswordProtectedKey/SSL_TCP
I20260926 13:43:38.481168 20186 acceptor_pool.cc:254] collecting diagnostics on the listening RPC socket 0.0.0.0:45897 every 8 connection(s)
I20260926 13:43:38.481181 20187 acceptor_pool.cc:254] collecting diagnostics on the listening RPC socket 0.0.0.0:45897 every 8 connection(s)
[       OK ] Parameters/TestRpc.TestCallWithPasswordProtectedKey/SSL_TCP (37 ms)
[ RUN      ] Parameters/TestRpc.TestCallToBadServer/SSL_TCP
I20260926 13:43:38.515780 20125 rpc-test.cc:394] Status: Network error: Client connection negotiation failed: client connection to 0.0.0.0:0: connect: Connection refused (error 111)
I20260926 13:43:38.516273 20125 rpc-test.cc:394] Status: Network error: Client connection negotiation failed: client connection to 0.0.0.0:0: connect: Connection refused (error 111)
I20260926 13:43:38.516716 20125 rpc-test.cc:394] Status: Network error: Client connection negotiation failed: client connection to 0.0.0.0:0: connect: Connection refused (error 111)
I20260926 13:43:38.517117 20125 rpc-test.cc:394] Status: Network error: Client connection negotiation failed: client connection to 0.0.0.0:0: connect: Connection refused (error 111)
I20260926 13:43:38.517552 20125 rpc-test.cc:394] Status: Network error: Client connection negotiation failed: client connection to 0.0.0.0:0: connect: Connection refused (error 111)
[       OK ] Parameters/TestRpc.TestCallToBadServer/SSL_TCP (21 ms)
[ RUN      ] Parameters/TestRpc.TestWrongService/SSL_TCP
I20260926 13:43:38.529147 20221 acceptor_pool.cc:254] collecting diagnostics on the listening RPC socket 0.0.0.0:41439 every 8 connection(s)
I20260926 13:43:38.529179 20222 acceptor_pool.cc:254] collecting diagnostics on the listening RPC socket 0.0.0.0:41439 every 8 connection(s)
I20260926 13:43:38.551685 20219 messenger.cc:345] service WrongServiceName not registered on TestServer
[       OK ] Parameters/TestRpc.TestWrongService/SSL_TCP (36 ms)
[ RUN      ] Parameters/TestRpc.TestConnectionKeepalive/SSL_TCP
I20260926 13:43:38.594660 20244 acceptor_pool.cc:254] collecting diagnostics on the listening RPC socket 0.0.0.0:45193 every 8 connection(s)
I20260926 13:43:38.594662 20245 acceptor_pool.cc:254] collecting diagnostics on the listening RPC socket 0.0.0.0:45193 every 8 connection(s)
I20260926 13:43:38.595122 20125 rpc-test.cc:488] Connecting to 0.0.0.0:45193
[       OK ] Parameters/TestRpc.TestConnectionKeepalive/SSL_TCP (1072 ms)
[ RUN      ] Parameters/TestRpc.TestClientConnectionMetrics/SSL_TCP
I20260926 13:43:39.633281 20269 acceptor_pool.cc:254] collecting diagnostics on the listening RPC socket 0.0.0.0:37397 every 8 connection(s)
I20260926 13:43:39.633455 20270 acceptor_pool.cc:254] collecting diagnostics on the listening RPC socket 0.0.0.0:37397 every 8 connection(s)
I20260926 13:43:39.633710 20125 rpc-test.cc:569] Connecting to 0.0.0.0:37397
[       OK ] Parameters/TestRpc.TestClientConnectionMetrics/SSL_TCP (15167 ms)
[ RUN      ] Parameters/TestRpc.TestCredentialsPolicy/SSL_TCP
I20260926 13:43:54.819350 20293 acceptor_pool.cc:254] collecting diagnostics on the listening RPC socket 0.0.0.0:43015 every 8 connection(s)
I20260926 13:43:54.819531 20292 acceptor_pool.cc:254] collecting diagnostics on the listening RPC socket 0.0.0.0:43015 every 8 connection(s)
I20260926 13:43:54.819636 20125 rpc-test.cc:700] Connecting to 0.0.0.0:43015
[       OK ] Parameters/TestRpc.TestCredentialsPolicy/SSL_TCP (46 ms)
[ RUN      ] Parameters/TestRpc.TestCallLongerThanKeepalive/SSL_TCP
I20260926 13:43:54.869831 20317 acceptor_pool.cc:254] collecting diagnostics on the listening RPC socket 0.0.0.0:38331 every 8 connection(s)
I20260926 13:43:54.869861 20318 acceptor_pool.cc:254] collecting diagnostics on the listening RPC socket 0.0.0.0:38331 every 8 connection(s)
I20260926 13:43:54.883280 20321 rpc-test-base.h:222] got call: sleep_micros: 3000000 deferred: true
I20260926 13:43:57.884227 20321 rpcz_store.cc:275] Call kudu.rpc.GenericCalculatorService.Sleep from 127.0.0.1:35796 (request call id 0) took 3001 ms. Trace:
I20260926 13:43:57.884387 20321 rpcz_store.cc:276] 0926 13:43:54.883187 (+     0us) service_pool.cc:170] Inserting onto call queue
0926 13:43:54.883251 (+    64us) service_pool.cc:227] Handling call
0926 13:43:57.884206 (+3000955us) inbound_call.cc:173] Queueing success response
Metrics: {}
[       OK ] Parameters/TestRpc.TestCallLongerThanKeepalive/SSL_TCP (3046 ms)
[ RUN      ] Parameters/TestRpc.TestRpcSidecar/SSL_TCP
I20260926 13:43:57.905979 20342 acceptor_pool.cc:254] collecting diagnostics on the listening RPC socket 0.0.0.0:44097 every 8 connection(s)
I20260926 13:43:57.906147 20343 acceptor_pool.cc:254] collecting diagnostics on the listening RPC socket 0.0.0.0:44097 every 8 connection(s)
[       OK ] Parameters/TestRpc.TestRpcSidecar/SSL_TCP (87 ms)
[ RUN      ] Parameters/TestRpc.TestRpcSidecarLimits/SSL_TCP
I20260926 13:43:59.788686 20367 acceptor_pool.cc:254] collecting diagnostics on the listening RPC socket 0.0.0.0:38309 every 8 connection(s)
I20260926 13:43:59.788708 20368 acceptor_pool.cc:254] collecting diagnostics on the listening RPC socket 0.0.0.0:38309 every 8 connection(s)
W20260926 13:43:59.810490 20125 serialization.cc:72] Serialized kudu.rpc_test.PushStringsRequestPB (2147483654 bytes) is larger than the maximum configured RPC message size (52428800 bytes). Sending anyway, but peer may reject the data.
W20260926 13:43:59.815303 20365 connection.cc:535] server connection from 127.0.0.1:34226 recv error: Network error: RPC frame had a length of 2147483714, but we only support messages up to 52428800 bytes long.
W20260926 13:43:59.815375 20365 connection.cc:158] shutting down server connection from 127.0.0.1:34226 with pending inbound data: 4/2147483714 bytes received; last active 0 ns ago: status Network error: RPC frame had a length of 2147483714, but we only support messages up to 52428800 bytes long.
W20260926 13:43:59.815675 20380 connection.cc:196] Error closing socket: Network error: TlsSocket::Close: Connection reset by peer
I20260926 13:43:59.825809 20392 acceptor_pool.cc:254] collecting diagnostics on the listening RPC socket 0.0.0.0:38807 every 8 connection(s)
I20260926 13:43:59.825886 20393 acceptor_pool.cc:254] collecting diagnostics on the listening RPC socket 0.0.0.0:38807 every 8 connection(s)
W20260926 13:44:04.364814 20389 connection.cc:577] server connection from 127.0.0.1:53748: received bad data: 'Corruption: Invalid packet: message had a length of 2147483710, but we only support messages up to 2147483647 bytes
'
[       OK ] Parameters/TestRpc.TestRpcSidecarLimits/SSL_TCP (6392 ms)
[ RUN      ] Parameters/TestRpc.TestCallTimeoutDoesntAffectNegotiation/SSL_TCP
I20260926 13:44:04.406198 20417 acceptor_pool.cc:254] collecting diagnostics on the listening RPC socket 0.0.0.0:41799 every 8 connection(s)
I20260926 13:44:04.406224 20418 acceptor_pool.cc:254] collecting diagnostics on the listening RPC socket 0.0.0.0:41799 every 8 connection(s)
W20260926 13:44:04.437234 20413 negotiation.cc:266] Injecting 500ms delay in negotiation
I20260926 13:44:04.487643 20125 rpc-test-base.h:595] status: Timed out: connection negotiation to 0.0.0.0:41799 for RPC Sleep timed out after 0.050s (ON_OUTBOUND_QUEUE), seconds elapsed: 0.0509464
[       OK ] Parameters/TestRpc.TestCallTimeoutDoesntAffectNegotiation/SSL_TCP (576 ms)
[ RUN      ] Parameters/TestRpc.TestRpcHandlerLatencyMetric/SSL_TCP
I20260926 13:44:04.952723 20442 acceptor_pool.cc:254] collecting diagnostics on the listening RPC socket 0.0.0.0:36477 every 8 connection(s)
I20260926 13:44:04.952961 20443 acceptor_pool.cc:254] collecting diagnostics on the listening RPC socket 0.0.0.0:36477 every 8 connection(s)
I20260926 13:44:05.001585 20125 rpc-test.cc:1236] Sleep() min lat: 20416
I20260926 13:44:05.001711 20125 rpc-test.cc:1237] Sleep() mean lat: 20416
I20260926 13:44:05.001741 20125 rpc-test.cc:1238] Sleep() max lat: 20416
I20260926 13:44:05.001755 20125 rpc-test.cc:1239] Sleep() #calls: 1
[       OK ] Parameters/TestRpc.TestRpcHandlerLatencyMetric/SSL_TCP (59 ms)
[ RUN      ] Parameters/TestRpc.TimedOutOnResponseMetricServiceQueue/SSL_TCP
I20260926 13:44:05.010262 20469 acceptor_pool.cc:254] collecting diagnostics on the listening RPC socket 0.0.0.0:37189 every 8 connection(s)
I20260926 13:44:05.010257 20468 acceptor_pool.cc:254] collecting diagnostics on the listening RPC socket 0.0.0.0:37189 every 8 connection(s)
W20260926 13:44:05.070595 20470 rpcz_store.cc:267] Call kudu.rpc_test.CalculatorService.Sleep from 127.0.0.1:41384 (request call id 2) took 20 ms (client timeout 20 ms). Trace:
W20260926 13:44:05.070725 20470 rpcz_store.cc:269] 0926 13:44:05.050185 (+     0us) service_pool.cc:170] Inserting onto call queue
0926 13:44:05.070553 (+ 20368us) service_pool.cc:214] Skipping call since client already timed out
0926 13:44:05.070580 (+    27us) inbound_call.cc:173] Queueing failure response
Metrics: {}
[       OK ] Parameters/TestRpc.TimedOutOnResponseMetricServiceQueue/SSL_TCP (69 ms)
[ RUN      ] Parameters/TestRpc.RpcPendingConnectionsMetric/SSL_TCP
I20260926 13:44:05.076140 20491 acceptor_pool.cc:254] collecting diagnostics on the listening RPC socket 0.0.0.0:39867 every 8 connection(s)
I20260926 13:44:05.076208 20492 acceptor_pool.cc:254] collecting diagnostics on the listening RPC socket 0.0.0.0:39867 every 8 connection(s)
W20260926 13:44:05.077477 20487 negotiation.cc:337] Failed RPC negotiation. Trace:
0926 13:44:05.077024 (+     0us) reactor.cc:625] Submitting negotiation task for server connection from 127.0.0.1:44850 (local address 127.0.0.1:39867)
0926 13:44:05.077147 (+   123us) server_negotiation.cc:206] Beginning negotiation
0926 13:44:05.077151 (+     4us) server_negotiation.cc:399] Waiting for connection header
0926 13:44:05.077241 (+    90us) negotiation.cc:327] Negotiation complete: Network error: Server connection negotiation failed: server connection from 127.0.0.1:44850: BlockingRecv error: recv got EOF from 127.0.0.1:44850 (error 108)
Metrics: {"server-negotiator.queue_time_us":42}
[       OK ] Parameters/TestRpc.RpcPendingConnectionsMetric/SSL_TCP (15 ms)
[ RUN      ] Parameters/TestRpc.TestRpcContextClientDeadline/SSL_TCP
I20260926 13:44:05.103437 20507 acceptor_pool.cc:254] collecting diagnostics on the listening RPC socket 0.0.0.0:37751 every 8 connection(s)
I20260926 13:44:05.103508 20508 acceptor_pool.cc:254] collecting diagnostics on the listening RPC socket 0.0.0.0:37751 every 8 connection(s)
[       OK ] Parameters/TestRpc.TestRpcContextClientDeadline/SSL_TCP (57 ms)
[ RUN      ] Parameters/TestRpc.TestApplicationFeatureFlagUnsupportedServer/SSL_TCP
I20260926 13:44:05.155230 20532 acceptor_pool.cc:254] collecting diagnostics on the listening RPC socket 0.0.0.0:37115 every 8 connection(s)
I20260926 13:44:05.155251 20533 acceptor_pool.cc:254] collecting diagnostics on the listening RPC socket 0.0.0.0:37115 every 8 connection(s)
[       OK ] Parameters/TestRpc.TestApplicationFeatureFlagUnsupportedServer/SSL_TCP (22 ms)
[ RUN      ] Parameters/TestRpc.TestCancellationAsync/SSL_TCP
I20260926 13:44:05.182159 20557 acceptor_pool.cc:254] collecting diagnostics on the listening RPC socket 0.0.0.0:35473 every 8 connection(s)
I20260926 13:44:05.182174 20558 acceptor_pool.cc:254] collecting diagnostics on the listening RPC socket 0.0.0.0:35473 every 8 connection(s)
I20260926 13:44:05.182561 20125 rpc-test.cc:1716] Connecting to 0.0.0.0:35473
I20260926 13:44:05.208042 20125 test_util.cc:268] Using random seed: 113426406
I20260926 13:44:05.228358 20561 rpc-test-base.h:240] got call: sleep_micros: 500 pattern: 4294967295 num_repetitions: 2097152 sidecar_idx: 0
I20260926 13:44:05.246475 20560 rpc-test-base.h:240] got call: sleep_micros: 500 pattern: 4294967295 num_repetitions: 2097152 sidecar_idx: 0
I20260926 13:44:05.262456 20561 rpc-test-base.h:240] got call: sleep_micros: 500 pattern: 4294967295 num_repetitions: 2097152 sidecar_idx: 0
I20260926 13:44:05.281792 20560 rpc-test-base.h:240] got call: sleep_micros: 500 pattern: 4294967295 num_repetitions: 2097152 sidecar_idx: 0
I20260926 13:44:05.302125 20561 rpc-test-base.h:240] got call: sleep_micros: 500 pattern: 4294967295 num_repetitions: 2097152 sidecar_idx: 0
I20260926 13:44:05.321316 20560 rpc-test-base.h:240] got call: sleep_micros: 500 pattern: 4294967295 num_repetitions: 2097152 sidecar_idx: 0
I20260926 13:44:05.347249 20561 rpc-test-base.h:240] got call: sleep_micros: 500 pattern: 4294967295 num_repetitions: 2097152 sidecar_idx: 0
W20260926 13:44:05.351132 20554 connection.cc:441] server connection from 127.0.0.1:44136 torn down before Call kudu.rpc.GenericCalculatorService.SleepWithSidecar from 127.0.0.1:44136 (request call id 8) could send its response
W20260926 13:44:05.365648 20554 connection.cc:441] server connection from 127.0.0.1:44136 torn down before Call kudu.rpc.GenericCalculatorService.SleepWithSidecar from 127.0.0.1:44136 (request call id 9) could send its response
[       OK ] Parameters/TestRpc.TestCancellationAsync/SSL_TCP (197 ms)
[ RUN      ] Parameters/TestRpc.TestPerformanceBySocketType/SSL_TCP
I20260926 13:44:05.383687 20582 acceptor_pool.cc:254] collecting diagnostics on the listening RPC socket 0.0.0.0:35263 every 8 connection(s)
I20260926 13:44:05.383718 20583 acceptor_pool.cc:254] collecting diagnostics on the listening RPC socket 0.0.0.0:35263 every 8 connection(s)
I20260926 13:44:05.383992 20125 rpc-test.cc:1846] Connecting to 0.0.0.0:35263
I20260926 13:44:07.636194 20125 rpc-test.cc:1859] Sending 1024MB via ssl-enabled tcp socket: real 2.240s	user 2.347s	sys 1.612s
I20260926 13:44:10.023770 20125 rpc-test.cc:1859] Sending 1024MB via ssl-enabled tcp socket: real 2.387s	user 2.485s	sys 1.734s
I20260926 13:44:12.366148 20125 rpc-test.cc:1859] Sending 1024MB via ssl-enabled tcp socket: real 2.342s	user 2.455s	sys 1.673s
I20260926 13:44:14.642033 20125 rpc-test.cc:1859] Sending 1024MB via ssl-enabled tcp socket: real 2.276s	user 2.270s	sys 1.754s
I20260926 13:44:17.019737 20125 rpc-test.cc:1859] Sending 1024MB via ssl-enabled tcp socket: real 2.378s	user 2.603s	sys 1.601s
[       OK ] Parameters/TestRpc.TestPerformanceBySocketType/SSL_TCP (11655 ms)
[----------] 20 tests from Parameters/TestRpc (38637 ms total)

[----------] 1 test from Parameters/TestRpcSocketTxRxQueue
[ RUN      ] Parameters/TestRpcSocketTxRxQueue.OverCapacity/0
W20260926 13:44:17.297560 20617 negotiation.cc:337] Failed RPC negotiation. Trace:
0926 13:44:17.031975 (+     0us) reactor.cc:625] Submitting negotiation task for client connection to 0.0.0.0:40437 (local address 127.0.0.1:53312)
0926 13:44:17.032084 (+   109us) negotiation.cc:107] Waiting for socket to connect
0926 13:44:17.032097 (+    13us) client_negotiation.cc:174] Beginning negotiation
0926 13:44:17.032200 (+   103us) client_negotiation.cc:252] Sending NEGOTIATE NegotiatePB request
0926 13:44:17.297444 (+265244us) negotiation.cc:327] Negotiation complete: Network error: Client connection negotiation failed: client connection to 0.0.0.0:40437: BlockingRecv error: recv error from unknown peer: Transport endpoint is not connected (error 107)
Metrics: {"client-negotiator.queue_time_us":25}
W20260926 13:44:17.297564 20599 negotiation.cc:337] Failed RPC negotiation. Trace:
0926 13:44:17.029244 (+     0us) reactor.cc:625] Submitting negotiation task for client connection to 0.0.0.0:40437 (local address 127.0.0.1:53296)
0926 13:44:17.029368 (+   124us) negotiation.cc:107] Waiting for socket to connect
0926 13:44:17.029384 (+    16us) client_negotiation.cc:174] Beginning negotiation
0926 13:44:17.029492 (+   108us) client_negotiation.cc:252] Sending NEGOTIATE NegotiatePB request
0926 13:44:17.297405 (+267913us) negotiation.cc:327] Negotiation complete: Network error: Client connection negotiation failed: client connection to 0.0.0.0:40437: BlockingRecv error: recv error from unknown peer: Transport endpoint is not connected (error 107)
Metrics: {"client-negotiator.queue_time_us":30}
W20260926 13:44:17.297713 20626 negotiation.cc:337] Failed RPC negotiation. Trace:
0926 13:44:17.033096 (+     0us) reactor.cc:625] Submitting negotiation task for client connection to 0.0.0.0:40437 (local address 127.0.0.1:53322)
0926 13:44:17.033230 (+   134us) negotiation.cc:107] Waiting for socket to connect
0926 13:44:17.033242 (+    12us) client_negotiation.cc:174] Beginning negotiation
0926 13:44:17.033320 (+    78us) client_negotiation.cc:252] Sending NEGOTIATE NegotiatePB request
0926 13:44:17.297404 (+264084us) negotiation.cc:327] Negotiation complete: Network error: Client connection negotiation failed: client connection to 0.0.0.0:40437: BlockingRecv error: recv error from unknown peer: Transport endpoint is not connected (error 107)
Metrics: {"client-negotiator.queue_time_us":44}
W20260926 13:44:17.297649 20635 negotiation.cc:337] Failed RPC negotiation. Trace:
0926 13:44:17.034387 (+     0us) reactor.cc:625] Submitting negotiation task for client connection to 0.0.0.0:40437 (local address 127.0.0.1:53324)
0926 13:44:17.034476 (+    89us) negotiation.cc:107] Waiting for socket to connect
0926 13:44:17.034510 (+    34us) client_negotiation.cc:174] Beginning negotiation
0926 13:44:17.034589 (+    79us) client_negotiation.cc:252] Sending NEGOTIATE NegotiatePB request
0926 13:44:17.297514 (+262925us) negotiation.cc:327] Negotiation complete: Network error: Client connection negotiation failed: client connection to 0.0.0.0:40437: BlockingRecv error: recv error from unknown peer: Transport endpoint is not connected (error 107)
Metrics: {"client-negotiator.queue_time_us":25}
W20260926 13:44:17.297971 20644 negotiation.cc:337] Failed RPC negotiation. Trace:
0926 13:44:17.035509 (+     0us) reactor.cc:625] Submitting negotiation task for client connection to 0.0.0.0:40437 (local address 127.0.0.1:53330)
0926 13:44:17.035586 (+    77us) negotiation.cc:107] Waiting for socket to connect
0926 13:44:17.035620 (+    34us) client_negotiation.cc:174] Beginning negotiation
0926 13:44:17.035704 (+    84us) client_negotiation.cc:252] Sending NEGOTIATE NegotiatePB request
0926 13:44:17.297898 (+262194us) negotiation.cc:327] Negotiation complete: Network error: Client connection negotiation failed: client connection to 0.0.0.0:40437: BlockingRecv error: recv error from unknown peer: Transport endpoint is not connected (error 107)
Metrics: {"client-negotiator.queue_time_us":25}
W20260926 13:44:17.298189 20608 negotiation.cc:337] Failed RPC negotiation. Trace:
0926 13:44:17.030788 (+     0us) reactor.cc:625] Submitting negotiation task for client connection to 0.0.0.0:40437 (local address 127.0.0.1:53298)
0926 13:44:17.030931 (+   143us) negotiation.cc:107] Waiting for socket to connect
0926 13:44:17.030943 (+    12us) client_negotiation.cc:174] Beginning negotiation
0926 13:44:17.031050 (+   107us) client_negotiation.cc:252] Sending NEGOTIATE NegotiatePB request
0926 13:44:17.297404 (+266354us) negotiation.cc:327] Negotiation complete: Network error: Client connection negotiation failed: client connection to 0.0.0.0:40437: BlockingRecv error: recv error from unknown peer: Transport endpoint is not connected (error 107)
Metrics: {"client-negotiator.queue_time_us":46}
[       OK ] Parameters/TestRpcSocketTxRxQueue.OverCapacity/0 (1040 ms)
[----------] 1 test from Parameters/TestRpcSocketTxRxQueue (1040 ms total)

[----------] Global test environment tear-down
[==========] 21 tests from 2 test suites ran. (39678 ms total)
[  PASSED  ] 20 tests.
[  FAILED  ] 1 test, listed below:
[  FAILED  ] Parameters/TestRpc.TestCallWithChainCertAndChainCA/SSL_TCP, where GetParam() = (true, false)

 1 FAILED TEST