Diagnosed failure

Parameters/TestRpc.TestCallWithChainCertAndChainCA/SSL_UnixSocket: /data0/somelongdirectorytoavoidrpathissues/src/kudu/src/kudu/rpc/rpc-test.cc:270: Failure
Failed
Bad status: Runtime error: could not verify certificate chain (error with cert: subject=CN = localhost, ST = sadfjas, C = AS, emailAddress = sdflkdsajf, O = lskdfjlsad, OU = sldfkja, issuer=C = AS, ST = ASDfkjdhf, L = lskdjf, O = saldfja, OU = skdjf, CN = localhost, emailAddress = sadjflkadsj): : certificate has expired
Google Test trace:
/data0/somelongdirectorytoavoidrpathissues/src/kudu/src/kudu/rpc/rpc-test.cc:267: Connecting to unix:/tmp/dist-test-taskjGINZ9/test-tmp/rpc-test-0d97047fa46449da80dbde973363cdea.sock
I20260927 15:08:30.194201  3571 test_util.cc:175] -----------------------------------------------
I20260927 15:08:30.194275  3571 test_util.cc:176] Had fatal failures, leaving test files at /tmp/dist-test-taskjGINZ9/test-tmp/rpc-test.6.Parameters_TestRpc.TestCallWithChainCertAndChainCA_SSL_UnixSocket.1790521710129022-3571-0

Full log

Note: This is test shard 7 of 8.
[==========] Running 21 tests from 2 test suites.
[----------] Global test environment set-up.
[----------] 20 tests from Parameters/TestRpc
[ RUN      ] Parameters/TestRpc.TestMessengerCreateDestroy/SSL_UnixSocket
WARNING: Logging before InitGoogleLogging() is written to STDERR
I20260927 15:08:30.149639  3571 rpc-test.cc:169] started messenger TestCreateDestroy
[       OK ] Parameters/TestRpc.TestMessengerCreateDestroy/SSL_UnixSocket (15 ms)
[ RUN      ] Parameters/TestRpc.TestNegotiationDeadlock/SSL_UnixSocket
I20260927 15:08:30.167340  3592 acceptor_pool.cc:254] collecting diagnostics on the listening RPC socket unix:/tmp/dist-test-taskjGINZ9/test-tmp/rpc-test-4369800501df4a9d929ca43a8cede5a5.sock every 8 connection(s)
I20260927 15:08:30.167459  3591 acceptor_pool.cc:254] collecting diagnostics on the listening RPC socket unix:/tmp/dist-test-taskjGINZ9/test-tmp/rpc-test-4369800501df4a9d929ca43a8cede5a5.sock every 8 connection(s)
[       OK ] Parameters/TestRpc.TestNegotiationDeadlock/SSL_UnixSocket (26 ms)
[ RUN      ] Parameters/TestRpc.TestCallWithChainCertAndChainCA/SSL_UnixSocket
I20260927 15:08:30.189477  3607 acceptor_pool.cc:254] collecting diagnostics on the listening RPC socket unix:/tmp/dist-test-taskjGINZ9/test-tmp/rpc-test-0d97047fa46449da80dbde973363cdea.sock every 8 connection(s)
I20260927 15:08:30.189477  3608 acceptor_pool.cc:254] collecting diagnostics on the listening RPC socket unix:/tmp/dist-test-taskjGINZ9/test-tmp/rpc-test-0d97047fa46449da80dbde973363cdea.sock every 8 connection(s)
/data0/somelongdirectorytoavoidrpathissues/src/kudu/src/kudu/rpc/rpc-test.cc:270: Failure
Failed
Bad status: Runtime error: could not verify certificate chain (error with cert: subject=CN = localhost, ST = sadfjas, C = AS, emailAddress = sdflkdsajf, O = lskdfjlsad, OU = sldfkja, issuer=C = AS, ST = ASDfkjdhf, L = lskdjf, O = saldfja, OU = skdjf, CN = localhost, emailAddress = sadjflkadsj): : certificate has expired
Google Test trace:
/data0/somelongdirectorytoavoidrpathissues/src/kudu/src/kudu/rpc/rpc-test.cc:267: Connecting to unix:/tmp/dist-test-taskjGINZ9/test-tmp/rpc-test-0d97047fa46449da80dbde973363cdea.sock
I20260927 15:08:30.194201  3571 test_util.cc:175] -----------------------------------------------
I20260927 15:08:30.194275  3571 test_util.cc:176] Had fatal failures, leaving test files at /tmp/dist-test-taskjGINZ9/test-tmp/rpc-test.6.Parameters_TestRpc.TestCallWithChainCertAndChainCA_SSL_UnixSocket.1790521710129022-3571-0
[  FAILED  ] Parameters/TestRpc.TestCallWithChainCertAndChainCA/SSL_UnixSocket, where GetParam() = (true, true) (16 ms)
[ RUN      ] Parameters/TestRpc.TestCallWithPasswordProtectedKey/SSL_UnixSocket
I20260927 15:08:30.219226  3632 acceptor_pool.cc:254] collecting diagnostics on the listening RPC socket unix:/tmp/dist-test-taskjGINZ9/test-tmp/rpc-test-9899012b90cd47238968512809fcd2d8.sock every 8 connection(s)
I20260927 15:08:30.219264  3633 acceptor_pool.cc:254] collecting diagnostics on the listening RPC socket unix:/tmp/dist-test-taskjGINZ9/test-tmp/rpc-test-9899012b90cd47238968512809fcd2d8.sock every 8 connection(s)
W20260927 15:08:30.232553  3629 connection.cc:196] Error closing socket: Network error: TlsSocket::Close: Broken pipe
[       OK ] Parameters/TestRpc.TestCallWithPasswordProtectedKey/SSL_UnixSocket (40 ms)
[ RUN      ] Parameters/TestRpc.TestCallToBadServer/SSL_UnixSocket
I20260927 15:08:30.248308  3571 rpc-test.cc:394] Status: Network error: Client connection negotiation failed: client connection to 0.0.0.0:0: connect: Connection refused (error 111)
I20260927 15:08:30.248764  3571 rpc-test.cc:394] Status: Network error: Client connection negotiation failed: client connection to 0.0.0.0:0: connect: Connection refused (error 111)
I20260927 15:08:30.249171  3571 rpc-test.cc:394] Status: Network error: Client connection negotiation failed: client connection to 0.0.0.0:0: connect: Connection refused (error 111)
I20260927 15:08:30.249567  3571 rpc-test.cc:394] Status: Network error: Client connection negotiation failed: client connection to 0.0.0.0:0: connect: Connection refused (error 111)
I20260927 15:08:30.249980  3571 rpc-test.cc:394] Status: Network error: Client connection negotiation failed: client connection to 0.0.0.0:0: connect: Connection refused (error 111)
[       OK ] Parameters/TestRpc.TestCallToBadServer/SSL_UnixSocket (16 ms)
[ RUN      ] Parameters/TestRpc.TestWrongService/SSL_UnixSocket
I20260927 15:08:30.259279  3667 acceptor_pool.cc:254] collecting diagnostics on the listening RPC socket unix:/tmp/dist-test-taskjGINZ9/test-tmp/rpc-test-f9ddbe0c17f545dd81735b42e5f02f25.sock every 8 connection(s)
I20260927 15:08:30.259296  3668 acceptor_pool.cc:254] collecting diagnostics on the listening RPC socket unix:/tmp/dist-test-taskjGINZ9/test-tmp/rpc-test-f9ddbe0c17f545dd81735b42e5f02f25.sock every 8 connection(s)
I20260927 15:08:30.268360  3664 messenger.cc:345] service WrongServiceName not registered on TestServer
[       OK ] Parameters/TestRpc.TestWrongService/SSL_UnixSocket (19 ms)
[ RUN      ] Parameters/TestRpc.TestConnectionKeepalive/SSL_UnixSocket
I20260927 15:08:30.282472  3690 acceptor_pool.cc:254] collecting diagnostics on the listening RPC socket unix:/tmp/dist-test-taskjGINZ9/test-tmp/rpc-test-915d0b97ab1149a48954d5c402e6b5de.sock every 8 connection(s)
I20260927 15:08:30.282521  3691 acceptor_pool.cc:254] collecting diagnostics on the listening RPC socket unix:/tmp/dist-test-taskjGINZ9/test-tmp/rpc-test-915d0b97ab1149a48954d5c402e6b5de.sock every 8 connection(s)
I20260927 15:08:30.282792  3571 rpc-test.cc:488] Connecting to unix:/tmp/dist-test-taskjGINZ9/test-tmp/rpc-test-915d0b97ab1149a48954d5c402e6b5de.sock
W20260927 15:08:30.771943  3703 connection.cc:196] Error closing socket: Network error: TlsSocket::Close: Broken pipe
[       OK ] Parameters/TestRpc.TestConnectionKeepalive/SSL_UnixSocket (1038 ms)
[ RUN      ] Parameters/TestRpc.TestClientConnectionMetrics/SSL_UnixSocket
I20260927 15:08:31.331964  3715 acceptor_pool.cc:254] collecting diagnostics on the listening RPC socket unix:/tmp/dist-test-taskjGINZ9/test-tmp/rpc-test-8f161989706441b8b646ef3c323193e0.sock every 8 connection(s)
I20260927 15:08:31.331934  3716 acceptor_pool.cc:254] collecting diagnostics on the listening RPC socket unix:/tmp/dist-test-taskjGINZ9/test-tmp/rpc-test-8f161989706441b8b646ef3c323193e0.sock every 8 connection(s)
I20260927 15:08:31.332197  3571 rpc-test.cc:569] Connecting to unix:/tmp/dist-test-taskjGINZ9/test-tmp/rpc-test-8f161989706441b8b646ef3c323193e0.sock
W20260927 15:08:41.503548  3712 connection.cc:196] Error closing socket: Network error: TlsSocket::Close: Broken pipe
[       OK ] Parameters/TestRpc.TestClientConnectionMetrics/SSL_UnixSocket (10196 ms)
[ RUN      ] Parameters/TestRpc.TestCredentialsPolicy/SSL_UnixSocket
I20260927 15:08:41.515991  3738 acceptor_pool.cc:254] collecting diagnostics on the listening RPC socket unix:/tmp/dist-test-taskjGINZ9/test-tmp/rpc-test-76f52a8a264c4da295a9c9e3dfe99515.sock every 8 connection(s)
I20260927 15:08:41.516041  3739 acceptor_pool.cc:254] collecting diagnostics on the listening RPC socket unix:/tmp/dist-test-taskjGINZ9/test-tmp/rpc-test-76f52a8a264c4da295a9c9e3dfe99515.sock every 8 connection(s)
I20260927 15:08:41.516361  3571 rpc-test.cc:700] Connecting to unix:/tmp/dist-test-taskjGINZ9/test-tmp/rpc-test-76f52a8a264c4da295a9c9e3dfe99515.sock
W20260927 15:08:41.532508  3737 connection.cc:196] Error closing socket: Network error: TlsSocket::Close: Broken pipe
[       OK ] Parameters/TestRpc.TestCredentialsPolicy/SSL_UnixSocket (33 ms)
[ RUN      ] Parameters/TestRpc.TestCallLongerThanKeepalive/SSL_UnixSocket
I20260927 15:08:41.556236  3764 acceptor_pool.cc:254] collecting diagnostics on the listening RPC socket unix:/tmp/dist-test-taskjGINZ9/test-tmp/rpc-test-3281273f58784afa81e087a658ec8e70.sock every 8 connection(s)
I20260927 15:08:41.556236  3763 acceptor_pool.cc:254] collecting diagnostics on the listening RPC socket unix:/tmp/dist-test-taskjGINZ9/test-tmp/rpc-test-3281273f58784afa81e087a658ec8e70.sock every 8 connection(s)
I20260927 15:08:41.568940  3767 rpc-test-base.h:222] got call: sleep_micros: 3000000 deferred: true
I20260927 15:08:44.569751  3767 rpcz_store.cc:275] Call kudu.rpc.GenericCalculatorService.Sleep from unix:<unnamed> (request call id 0) took 3000 ms. Trace:
I20260927 15:08:44.569857  3767 rpcz_store.cc:276] 0927 15:08:41.568875 (+     0us) service_pool.cc:170] Inserting onto call queue
0927 15:08:41.568922 (+    47us) service_pool.cc:227] Handling call
0927 15:08:44.569731 (+3000809us) inbound_call.cc:173] Queueing success response
Metrics: {}
[       OK ] Parameters/TestRpc.TestCallLongerThanKeepalive/SSL_UnixSocket (3034 ms)
[ RUN      ] Parameters/TestRpc.TestRpcSidecar/SSL_UnixSocket
I20260927 15:08:44.589090  3788 acceptor_pool.cc:254] collecting diagnostics on the listening RPC socket unix:/tmp/dist-test-taskjGINZ9/test-tmp/rpc-test-85b3b8b15b004a84992bf6f3036e7b1a.sock every 8 connection(s)
I20260927 15:08:44.589152  3789 acceptor_pool.cc:254] collecting diagnostics on the listening RPC socket unix:/tmp/dist-test-taskjGINZ9/test-tmp/rpc-test-85b3b8b15b004a84992bf6f3036e7b1a.sock every 8 connection(s)
W20260927 15:08:44.680022  3785 connection.cc:196] Error closing socket: Network error: TlsSocket::Close: Broken pipe
[       OK ] Parameters/TestRpc.TestRpcSidecar/SSL_UnixSocket (108 ms)
[ RUN      ] Parameters/TestRpc.TestRpcSidecarLimits/SSL_UnixSocket
I20260927 15:08:46.387421  3813 acceptor_pool.cc:254] collecting diagnostics on the listening RPC socket unix:/tmp/dist-test-taskjGINZ9/test-tmp/rpc-test-4501f1bd770d4212aea1fa1f6ade9460.sock every 8 connection(s)
I20260927 15:08:46.387470  3814 acceptor_pool.cc:254] collecting diagnostics on the listening RPC socket unix:/tmp/dist-test-taskjGINZ9/test-tmp/rpc-test-4501f1bd770d4212aea1fa1f6ade9460.sock every 8 connection(s)
W20260927 15:08:46.395388  3571 serialization.cc:72] Serialized kudu.rpc_test.PushStringsRequestPB (2147483654 bytes) is larger than the maximum configured RPC message size (52428800 bytes). Sending anyway, but peer may reject the data.
W20260927 15:08:46.399279  3810 connection.cc:535] server connection from unix:<unnamed> recv error: Network error: RPC frame had a length of 2147483714, but we only support messages up to 52428800 bytes long.
W20260927 15:08:46.399350  3810 connection.cc:158] shutting down server connection from unix:<unnamed> with pending inbound data: 4/2147483714 bytes received; last active 0 ns ago: status Network error: RPC frame had a length of 2147483714, but we only support messages up to 52428800 bytes long.
W20260927 15:08:46.399609  3826 connection.cc:196] Error closing socket: Network error: TlsSocket::Close: Broken pipe
I20260927 15:08:46.412204  3838 acceptor_pool.cc:254] collecting diagnostics on the listening RPC socket unix:/tmp/dist-test-taskjGINZ9/test-tmp/rpc-test-4501f1bd770d4212aea1fa1f6ade9460.sock every 8 connection(s)
I20260927 15:08:46.412352  3839 acceptor_pool.cc:254] collecting diagnostics on the listening RPC socket unix:/tmp/dist-test-taskjGINZ9/test-tmp/rpc-test-4501f1bd770d4212aea1fa1f6ade9460.sock every 8 connection(s)
W20260927 15:08:51.316829  3835 connection.cc:577] server connection from unix:<unnamed>: received bad data: 'Corruption: Invalid packet: message had a length of 2147483710, but we only support messages up to 2147483647 bytes
'
W20260927 15:08:51.317170  3851 connection.cc:196] Error closing socket: Network error: TlsSocket::Close: Broken pipe
[       OK ] Parameters/TestRpc.TestRpcSidecarLimits/SSL_UnixSocket (6638 ms)
[ RUN      ] Parameters/TestRpc.TestCallTimeoutDoesntAffectNegotiation/SSL_UnixSocket
I20260927 15:08:51.340513  3863 acceptor_pool.cc:254] collecting diagnostics on the listening RPC socket unix:/tmp/dist-test-taskjGINZ9/test-tmp/rpc-test-9ebefa2b6f9e479da5b97fb4410bdb6d.sock every 8 connection(s)
I20260927 15:08:51.340658  3864 acceptor_pool.cc:254] collecting diagnostics on the listening RPC socket unix:/tmp/dist-test-taskjGINZ9/test-tmp/rpc-test-9ebefa2b6f9e479da5b97fb4410bdb6d.sock every 8 connection(s)
W20260927 15:08:51.348894  3859 negotiation.cc:266] Injecting 500ms delay in negotiation
I20260927 15:08:51.399240  3571 rpc-test-base.h:595] status: Timed out: connection negotiation to unix:/tmp/dist-test-taskjGINZ9/test-tmp/rpc-test-9ebefa2b6f9e479da5b97fb4410bdb6d.sock for RPC Sleep timed out after 0.050s (ON_OUTBOUND_QUEUE), seconds elapsed: 0.0507281
W20260927 15:08:51.854175  3860 connection.cc:196] Error closing socket: Network error: TlsSocket::Close: Broken pipe
[       OK ] Parameters/TestRpc.TestCallTimeoutDoesntAffectNegotiation/SSL_UnixSocket (535 ms)
[ RUN      ] Parameters/TestRpc.TestRpcHandlerLatencyMetric/SSL_UnixSocket
I20260927 15:08:51.869639  3888 acceptor_pool.cc:254] collecting diagnostics on the listening RPC socket unix:/tmp/dist-test-taskjGINZ9/test-tmp/rpc-test-5ffb299c97c64feab83ff17339fe1b2c.sock every 8 connection(s)
I20260927 15:08:51.869688  3889 acceptor_pool.cc:254] collecting diagnostics on the listening RPC socket unix:/tmp/dist-test-taskjGINZ9/test-tmp/rpc-test-5ffb299c97c64feab83ff17339fe1b2c.sock every 8 connection(s)
I20260927 15:08:51.911873  3571 rpc-test.cc:1236] Sleep() min lat: 20401
I20260927 15:08:51.911970  3571 rpc-test.cc:1237] Sleep() mean lat: 20401
I20260927 15:08:51.912011  3571 rpc-test.cc:1238] Sleep() max lat: 20401
I20260927 15:08:51.912040  3571 rpc-test.cc:1239] Sleep() #calls: 1
[       OK ] Parameters/TestRpc.TestRpcHandlerLatencyMetric/SSL_UnixSocket (58 ms)
[ RUN      ] Parameters/TestRpc.TimedOutOnResponseMetricServiceQueue/SSL_UnixSocket
I20260927 15:08:51.928151  3914 acceptor_pool.cc:254] collecting diagnostics on the listening RPC socket unix:/tmp/dist-test-taskjGINZ9/test-tmp/rpc-test-610c67093efe47a58c74d5327594348a.sock every 8 connection(s)
I20260927 15:08:51.928206  3915 acceptor_pool.cc:254] collecting diagnostics on the listening RPC socket unix:/tmp/dist-test-taskjGINZ9/test-tmp/rpc-test-610c67093efe47a58c74d5327594348a.sock every 8 connection(s)
W20260927 15:08:51.978715  3916 rpcz_store.cc:267] Call kudu.rpc_test.CalculatorService.Sleep from unix:<unnamed> (request call id 2) took 20 ms (client timeout 20 ms). Trace:
W20260927 15:08:51.978828  3916 rpcz_store.cc:269] 0927 15:08:51.958366 (+     0us) service_pool.cc:170] Inserting onto call queue
0927 15:08:51.978674 (+ 20308us) service_pool.cc:214] Skipping call since client already timed out
0927 15:08:51.978698 (+    24us) inbound_call.cc:173] Queueing failure response
Metrics: {}
W20260927 15:08:51.979557  3911 connection.cc:196] Error closing socket: Network error: TlsSocket::Close: Broken pipe
[       OK ] Parameters/TestRpc.TimedOutOnResponseMetricServiceQueue/SSL_UnixSocket (66 ms)
[ RUN      ] Parameters/TestRpc.RpcPendingConnectionsMetric/SSL_UnixSocket
I20260927 15:08:51.983234  3937 acceptor_pool.cc:254] collecting diagnostics on the listening RPC socket 0.0.0.0:41561 every 8 connection(s)
I20260927 15:08:51.983322  3938 acceptor_pool.cc:254] collecting diagnostics on the listening RPC socket 0.0.0.0:41561 every 8 connection(s)
W20260927 15:08:51.991834  3933 negotiation.cc:337] Failed RPC negotiation. Trace:
0927 15:08:51.991254 (+     0us) reactor.cc:625] Submitting negotiation task for server connection from 127.0.0.1:33752 (local address 127.0.0.1:41561)
0927 15:08:51.991411 (+   157us) server_negotiation.cc:206] Beginning negotiation
0927 15:08:51.991416 (+     5us) server_negotiation.cc:399] Waiting for connection header
0927 15:08:51.991558 (+   142us) negotiation.cc:327] Negotiation complete: Network error: Server connection negotiation failed: server connection from 127.0.0.1:33752: BlockingRecv error: recv got EOF from 127.0.0.1:33752 (error 108)
Metrics: {"server-negotiator.queue_time_us":47}
[       OK ] Parameters/TestRpc.RpcPendingConnectionsMetric/SSL_UnixSocket (21 ms)
[ RUN      ] Parameters/TestRpc.TestRpcContextClientDeadline/SSL_UnixSocket
I20260927 15:08:52.014923  3953 acceptor_pool.cc:254] collecting diagnostics on the listening RPC socket unix:/tmp/dist-test-taskjGINZ9/test-tmp/rpc-test-b0cb78b0d57b4e7f991f9dc90fbb6112.sock every 8 connection(s)
I20260927 15:08:52.014948  3954 acceptor_pool.cc:254] collecting diagnostics on the listening RPC socket unix:/tmp/dist-test-taskjGINZ9/test-tmp/rpc-test-b0cb78b0d57b4e7f991f9dc90fbb6112.sock every 8 connection(s)
[       OK ] Parameters/TestRpc.TestRpcContextClientDeadline/SSL_UnixSocket (54 ms)
[ RUN      ] Parameters/TestRpc.TestApplicationFeatureFlagUnsupportedServer/SSL_UnixSocket
I20260927 15:08:52.084832  3978 acceptor_pool.cc:254] collecting diagnostics on the listening RPC socket unix:/tmp/dist-test-taskjGINZ9/test-tmp/rpc-test-980991d47d594f2c929c4245b411c644.sock every 8 connection(s)
I20260927 15:08:52.084858  3979 acceptor_pool.cc:254] collecting diagnostics on the listening RPC socket unix:/tmp/dist-test-taskjGINZ9/test-tmp/rpc-test-980991d47d594f2c929c4245b411c644.sock every 8 connection(s)
[       OK ] Parameters/TestRpc.TestApplicationFeatureFlagUnsupportedServer/SSL_UnixSocket (51 ms)
[ RUN      ] Parameters/TestRpc.TestCancellationAsync/SSL_UnixSocket
I20260927 15:08:52.115674  4003 acceptor_pool.cc:254] collecting diagnostics on the listening RPC socket unix:/tmp/dist-test-taskjGINZ9/test-tmp/rpc-test-e2dbed8354bd492184608bfa37663dee.sock every 8 connection(s)
I20260927 15:08:52.115701  4004 acceptor_pool.cc:254] collecting diagnostics on the listening RPC socket unix:/tmp/dist-test-taskjGINZ9/test-tmp/rpc-test-e2dbed8354bd492184608bfa37663dee.sock every 8 connection(s)
I20260927 15:08:52.115991  3571 rpc-test.cc:1716] Connecting to unix:/tmp/dist-test-taskjGINZ9/test-tmp/rpc-test-e2dbed8354bd492184608bfa37663dee.sock
I20260927 15:08:52.123240  3571 test_util.cc:268] Using random seed: 1406028391
I20260927 15:08:52.140273  4007 rpc-test-base.h:240] got call: sleep_micros: 500 pattern: 4294967295 num_repetitions: 2097152 sidecar_idx: 0
I20260927 15:08:52.157373  4006 rpc-test-base.h:240] got call: sleep_micros: 500 pattern: 4294967295 num_repetitions: 2097152 sidecar_idx: 0
I20260927 15:08:52.173032  4007 rpc-test-base.h:240] got call: sleep_micros: 500 pattern: 4294967295 num_repetitions: 2097152 sidecar_idx: 0
I20260927 15:08:52.188023  4006 rpc-test-base.h:240] got call: sleep_micros: 500 pattern: 4294967295 num_repetitions: 2097152 sidecar_idx: 0
I20260927 15:08:52.203179  4007 rpc-test-base.h:240] got call: sleep_micros: 500 pattern: 4294967295 num_repetitions: 2097152 sidecar_idx: 0
I20260927 15:08:52.218535  4006 rpc-test-base.h:240] got call: sleep_micros: 500 pattern: 4294967295 num_repetitions: 2097152 sidecar_idx: 0
I20260927 15:08:52.234557  4007 rpc-test-base.h:240] got call: sleep_micros: 500 pattern: 4294967295 num_repetitions: 2097152 sidecar_idx: 0
W20260927 15:08:52.236351  4000 connection.cc:196] Error closing socket: Network error: TlsSocket::Close: Broken pipe
W20260927 15:08:52.242542  4000 connection.cc:441] server connection from unix:<unnamed> torn down before Call kudu.rpc.GenericCalculatorService.SleepWithSidecar from unix:<unnamed> (request call id 8) could send its response
W20260927 15:08:52.252697  4000 connection.cc:441] server connection from unix:<unnamed> torn down before Call kudu.rpc.GenericCalculatorService.SleepWithSidecar from unix:<unnamed> (request call id 9) could send its response
[       OK ] Parameters/TestRpc.TestCancellationAsync/SSL_UnixSocket (146 ms)
[ RUN      ] Parameters/TestRpc.TestPerformanceBySocketType/SSL_UnixSocket
I20260927 15:08:52.264263  4028 acceptor_pool.cc:254] collecting diagnostics on the listening RPC socket unix:/tmp/dist-test-taskjGINZ9/test-tmp/rpc-test-1f7f775ad1784ae99031e4cbfb4b7968.sock every 8 connection(s)
I20260927 15:08:52.264309  4029 acceptor_pool.cc:254] collecting diagnostics on the listening RPC socket unix:/tmp/dist-test-taskjGINZ9/test-tmp/rpc-test-1f7f775ad1784ae99031e4cbfb4b7968.sock every 8 connection(s)
I20260927 15:08:52.264597  3571 rpc-test.cc:1846] Connecting to unix:/tmp/dist-test-taskjGINZ9/test-tmp/rpc-test-1f7f775ad1784ae99031e4cbfb4b7968.sock
I20260927 15:08:53.784463  3571 rpc-test.cc:1859] Sending 1024MB via ssl-enabled unix socket: real 1.514s	user 1.916s	sys 0.856s
I20260927 15:08:55.229825  3571 rpc-test.cc:1859] Sending 1024MB via ssl-enabled unix socket: real 1.445s	user 1.802s	sys 0.846s
I20260927 15:08:56.728257  3571 rpc-test.cc:1859] Sending 1024MB via ssl-enabled unix socket: real 1.498s	user 1.813s	sys 0.936s
I20260927 15:08:58.167732  3571 rpc-test.cc:1859] Sending 1024MB via ssl-enabled unix socket: real 1.439s	user 1.738s	sys 0.894s
I20260927 15:08:59.657930  3571 rpc-test.cc:1859] Sending 1024MB via ssl-enabled unix socket: real 1.490s	user 1.945s	sys 0.790s
W20260927 15:08:59.658885  4025 connection.cc:196] Error closing socket: Network error: TlsSocket::Close: Broken pipe
[       OK ] Parameters/TestRpc.TestPerformanceBySocketType/SSL_UnixSocket (7405 ms)
[----------] 20 tests from Parameters/TestRpc (29524 ms total)

[----------] 1 test from Parameters/TestRpcSocketTxRxQueue
[ RUN      ] Parameters/TestRpcSocketTxRxQueue.AcceptorRxQueueSizeMetric/0
I20260927 15:08:59.662322  4053 acceptor_pool.cc:254] collecting diagnostics on the listening RPC socket 0.0.0.0:37867 every 1 connection(s)
I20260927 15:08:59.662410  4054 acceptor_pool.cc:254] collecting diagnostics on the listening RPC socket 0.0.0.0:37867 every 1 connection(s)
W20260927 15:08:59.663172  4049 negotiation.cc:337] Failed RPC negotiation. Trace:
0927 15:08:59.662941 (+     0us) reactor.cc:625] Submitting negotiation task for server connection from 127.0.0.1:39466 (local address 127.0.0.1:37867)
0927 15:08:59.663034 (+    93us) server_negotiation.cc:206] Beginning negotiation
0927 15:08:59.663037 (+     3us) server_negotiation.cc:399] Waiting for connection header
0927 15:08:59.663110 (+    73us) negotiation.cc:327] Negotiation complete: Network error: Server connection negotiation failed: server connection from 127.0.0.1:39466: BlockingRecv error: recv got EOF from 127.0.0.1:39466 (error 108)
Metrics: {"server-negotiator.queue_time_us":22}
[       OK ] Parameters/TestRpcSocketTxRxQueue.AcceptorRxQueueSizeMetric/0 (5 ms)
[----------] 1 test from Parameters/TestRpcSocketTxRxQueue (5 ms total)

[----------] Global test environment tear-down
[==========] 21 tests from 2 test suites ran. (29530 ms total)
[  PASSED  ] 20 tests.
[  FAILED  ] 1 test, listed below:
[  FAILED  ] Parameters/TestRpc.TestCallWithChainCertAndChainCA/SSL_UnixSocket, where GetParam() = (true, true)

 1 FAILED TEST