Diagnosed failure

Parameters/TestRpc.TestCallWithChainCertAndChainCA/SSL_UnixSocket: /data0/somelongdirectorytoavoidrpathissues/src/kudu/src/kudu/rpc/rpc-test.cc:270: Failure
Failed
Bad status: Runtime error: could not verify certificate chain (error with cert: subject=CN = localhost, ST = sadfjas, C = AS, emailAddress = sdflkdsajf, O = lskdfjlsad, OU = sldfkja, issuer=C = AS, ST = ASDfkjdhf, L = lskdjf, O = saldfja, OU = skdjf, CN = localhost, emailAddress = sadjflkadsj): : certificate has expired
Google Test trace:
/data0/somelongdirectorytoavoidrpathissues/src/kudu/src/kudu/rpc/rpc-test.cc:267: Connecting to unix:/tmp/dist-test-taskoAhsh_/test-tmp/rpc-test-4032b43065c048f694fff96232fd2867.sock
I20260928 06:31:57.412128 18446 test_util.cc:175] -----------------------------------------------
I20260928 06:31:57.412173 18446 test_util.cc:176] Had fatal failures, leaving test files at /tmp/dist-test-taskoAhsh_/test-tmp/rpc-test.6.Parameters_TestRpc.TestCallWithChainCertAndChainCA_SSL_UnixSocket.1790577117337425-18446-0

Full log

Note: This is test shard 7 of 8.
[==========] Running 21 tests from 2 test suites.
[----------] Global test environment set-up.
[----------] 20 tests from Parameters/TestRpc
[ RUN      ] Parameters/TestRpc.TestMessengerCreateDestroy/SSL_UnixSocket
WARNING: Logging before InitGoogleLogging() is written to STDERR
I20260928 06:31:57.375448 18446 rpc-test.cc:169] started messenger TestCreateDestroy
[       OK ] Parameters/TestRpc.TestMessengerCreateDestroy/SSL_UnixSocket (36 ms)
[ RUN      ] Parameters/TestRpc.TestNegotiationDeadlock/SSL_UnixSocket
I20260928 06:31:57.392231 18466 acceptor_pool.cc:254] collecting diagnostics on the listening RPC socket unix:/tmp/dist-test-taskoAhsh_/test-tmp/rpc-test-68a26251d6694be2b47164d6e9d97296.sock every 8 connection(s)
I20260928 06:31:57.392231 18467 acceptor_pool.cc:254] collecting diagnostics on the listening RPC socket unix:/tmp/dist-test-taskoAhsh_/test-tmp/rpc-test-68a26251d6694be2b47164d6e9d97296.sock every 8 connection(s)
[       OK ] Parameters/TestRpc.TestNegotiationDeadlock/SSL_UnixSocket (21 ms)
[ RUN      ] Parameters/TestRpc.TestCallWithChainCertAndChainCA/SSL_UnixSocket
I20260928 06:31:57.408231 18482 acceptor_pool.cc:254] collecting diagnostics on the listening RPC socket unix:/tmp/dist-test-taskoAhsh_/test-tmp/rpc-test-4032b43065c048f694fff96232fd2867.sock every 8 connection(s)
I20260928 06:31:57.408286 18483 acceptor_pool.cc:254] collecting diagnostics on the listening RPC socket unix:/tmp/dist-test-taskoAhsh_/test-tmp/rpc-test-4032b43065c048f694fff96232fd2867.sock every 8 connection(s)
/data0/somelongdirectorytoavoidrpathissues/src/kudu/src/kudu/rpc/rpc-test.cc:270: Failure
Failed
Bad status: Runtime error: could not verify certificate chain (error with cert: subject=CN = localhost, ST = sadfjas, C = AS, emailAddress = sdflkdsajf, O = lskdfjlsad, OU = sldfkja, issuer=C = AS, ST = ASDfkjdhf, L = lskdjf, O = saldfja, OU = skdjf, CN = localhost, emailAddress = sadjflkadsj): : certificate has expired
Google Test trace:
/data0/somelongdirectorytoavoidrpathissues/src/kudu/src/kudu/rpc/rpc-test.cc:267: Connecting to unix:/tmp/dist-test-taskoAhsh_/test-tmp/rpc-test-4032b43065c048f694fff96232fd2867.sock
I20260928 06:31:57.412128 18446 test_util.cc:175] -----------------------------------------------
I20260928 06:31:57.412173 18446 test_util.cc:176] Had fatal failures, leaving test files at /tmp/dist-test-taskoAhsh_/test-tmp/rpc-test.6.Parameters_TestRpc.TestCallWithChainCertAndChainCA_SSL_UnixSocket.1790577117337425-18446-0
[  FAILED  ] Parameters/TestRpc.TestCallWithChainCertAndChainCA/SSL_UnixSocket, where GetParam() = (true, true) (13 ms)
[ RUN      ] Parameters/TestRpc.TestCallWithPasswordProtectedKey/SSL_UnixSocket
I20260928 06:31:57.428776 18507 acceptor_pool.cc:254] collecting diagnostics on the listening RPC socket unix:/tmp/dist-test-taskoAhsh_/test-tmp/rpc-test-10c635115efb4147b8a5c174f9fd3ec6.sock every 8 connection(s)
I20260928 06:31:57.428779 18508 acceptor_pool.cc:254] collecting diagnostics on the listening RPC socket unix:/tmp/dist-test-taskoAhsh_/test-tmp/rpc-test-10c635115efb4147b8a5c174f9fd3ec6.sock every 8 connection(s)
W20260928 06:31:57.439926 18504 connection.cc:196] Error closing socket: Network error: TlsSocket::Close: Broken pipe
[       OK ] Parameters/TestRpc.TestCallWithPasswordProtectedKey/SSL_UnixSocket (28 ms)
[ RUN      ] Parameters/TestRpc.TestCallToBadServer/SSL_UnixSocket
I20260928 06:31:57.472201 18446 rpc-test.cc:394] Status: Network error: Client connection negotiation failed: client connection to 0.0.0.0:0: connect: Connection refused (error 111)
I20260928 06:31:57.472554 18446 rpc-test.cc:394] Status: Network error: Client connection negotiation failed: client connection to 0.0.0.0:0: connect: Connection refused (error 111)
I20260928 06:31:57.472826 18446 rpc-test.cc:394] Status: Network error: Client connection negotiation failed: client connection to 0.0.0.0:0: connect: Connection refused (error 111)
I20260928 06:31:57.473045 18446 rpc-test.cc:394] Status: Network error: Client connection negotiation failed: client connection to 0.0.0.0:0: connect: Connection refused (error 111)
I20260928 06:31:57.473254 18446 rpc-test.cc:394] Status: Network error: Client connection negotiation failed: client connection to 0.0.0.0:0: connect: Connection refused (error 111)
[       OK ] Parameters/TestRpc.TestCallToBadServer/SSL_UnixSocket (32 ms)
[ RUN      ] Parameters/TestRpc.TestWrongService/SSL_UnixSocket
I20260928 06:31:57.502854 18542 acceptor_pool.cc:254] collecting diagnostics on the listening RPC socket unix:/tmp/dist-test-taskoAhsh_/test-tmp/rpc-test-54c8c33f9ae041dea2035f20a0e95d6e.sock every 8 connection(s)
I20260928 06:31:57.502902 18543 acceptor_pool.cc:254] collecting diagnostics on the listening RPC socket unix:/tmp/dist-test-taskoAhsh_/test-tmp/rpc-test-54c8c33f9ae041dea2035f20a0e95d6e.sock every 8 connection(s)
I20260928 06:31:57.518366 18539 messenger.cc:345] service WrongServiceName not registered on TestServer
[       OK ] Parameters/TestRpc.TestWrongService/SSL_UnixSocket (46 ms)
[ RUN      ] Parameters/TestRpc.TestConnectionKeepalive/SSL_UnixSocket
I20260928 06:31:57.537770 18565 acceptor_pool.cc:254] collecting diagnostics on the listening RPC socket unix:/tmp/dist-test-taskoAhsh_/test-tmp/rpc-test-fab73dbc08e645ebb24384fffdd01aea.sock every 8 connection(s)
I20260928 06:31:57.537793 18566 acceptor_pool.cc:254] collecting diagnostics on the listening RPC socket unix:/tmp/dist-test-taskoAhsh_/test-tmp/rpc-test-fab73dbc08e645ebb24384fffdd01aea.sock every 8 connection(s)
I20260928 06:31:57.537971 18446 rpc-test.cc:488] Connecting to unix:/tmp/dist-test-taskoAhsh_/test-tmp/rpc-test-fab73dbc08e645ebb24384fffdd01aea.sock
W20260928 06:31:58.021552 18578 connection.cc:196] Error closing socket: Network error: TlsSocket::Close: Broken pipe
[       OK ] Parameters/TestRpc.TestConnectionKeepalive/SSL_UnixSocket (1065 ms)
[ RUN      ] Parameters/TestRpc.TestClientConnectionMetrics/SSL_UnixSocket
I20260928 06:31:58.600322 18590 acceptor_pool.cc:254] collecting diagnostics on the listening RPC socket unix:/tmp/dist-test-taskoAhsh_/test-tmp/rpc-test-1dd4df09c45345e287eadf81094f3fd7.sock every 8 connection(s)
I20260928 06:31:58.600375 18591 acceptor_pool.cc:254] collecting diagnostics on the listening RPC socket unix:/tmp/dist-test-taskoAhsh_/test-tmp/rpc-test-1dd4df09c45345e287eadf81094f3fd7.sock every 8 connection(s)
I20260928 06:31:58.600634 18446 rpc-test.cc:569] Connecting to unix:/tmp/dist-test-taskoAhsh_/test-tmp/rpc-test-1dd4df09c45345e287eadf81094f3fd7.sock
W20260928 06:32:07.108197 18587 connection.cc:196] Error closing socket: Network error: TlsSocket::Close: Broken pipe
[       OK ] Parameters/TestRpc.TestClientConnectionMetrics/SSL_UnixSocket (8523 ms)
[ RUN      ] Parameters/TestRpc.TestCredentialsPolicy/SSL_UnixSocket
I20260928 06:32:07.117077 18613 acceptor_pool.cc:254] collecting diagnostics on the listening RPC socket unix:/tmp/dist-test-taskoAhsh_/test-tmp/rpc-test-3224d24b34dc403fbc5f90331cd9a01b.sock every 8 connection(s)
I20260928 06:32:07.117136 18614 acceptor_pool.cc:254] collecting diagnostics on the listening RPC socket unix:/tmp/dist-test-taskoAhsh_/test-tmp/rpc-test-3224d24b34dc403fbc5f90331cd9a01b.sock every 8 connection(s)
I20260928 06:32:07.117300 18446 rpc-test.cc:700] Connecting to unix:/tmp/dist-test-taskoAhsh_/test-tmp/rpc-test-3224d24b34dc403fbc5f90331cd9a01b.sock
W20260928 06:32:07.134841 18612 connection.cc:196] Error closing socket: Network error: TlsSocket::Close: Broken pipe
W20260928 06:32:07.138175 18612 connection.cc:196] Error closing socket: Network error: TlsSocket::Close: Broken pipe
[       OK ] Parameters/TestRpc.TestCredentialsPolicy/SSL_UnixSocket (29 ms)
[ RUN      ] Parameters/TestRpc.TestCallLongerThanKeepalive/SSL_UnixSocket
I20260928 06:32:07.153115 18638 acceptor_pool.cc:254] collecting diagnostics on the listening RPC socket unix:/tmp/dist-test-taskoAhsh_/test-tmp/rpc-test-56dc5d6f15054b649b2b535001f3adc0.sock every 8 connection(s)
I20260928 06:32:07.153177 18639 acceptor_pool.cc:254] collecting diagnostics on the listening RPC socket unix:/tmp/dist-test-taskoAhsh_/test-tmp/rpc-test-56dc5d6f15054b649b2b535001f3adc0.sock every 8 connection(s)
I20260928 06:32:07.167776 18642 rpc-test-base.h:222] got call: sleep_micros: 3000000 deferred: true
I20260928 06:32:10.168447 18642 rpcz_store.cc:275] Call kudu.rpc.GenericCalculatorService.Sleep from unix:<unnamed> (request call id 0) took 3000 ms. Trace:
I20260928 06:32:10.168596 18642 rpcz_store.cc:276] 0928 06:32:07.167727 (+     0us) service_pool.cc:170] Inserting onto call queue
0928 06:32:07.167757 (+    30us) service_pool.cc:227] Handling call
0928 06:32:10.168422 (+3000665us) inbound_call.cc:173] Queueing success response
Metrics: {}
[       OK ] Parameters/TestRpc.TestCallLongerThanKeepalive/SSL_UnixSocket (3032 ms)
[ RUN      ] Parameters/TestRpc.TestRpcSidecar/SSL_UnixSocket
I20260928 06:32:10.184746 18663 acceptor_pool.cc:254] collecting diagnostics on the listening RPC socket unix:/tmp/dist-test-taskoAhsh_/test-tmp/rpc-test-aab47f0f7c26445dbda95f4061078841.sock every 8 connection(s)
I20260928 06:32:10.184811 18664 acceptor_pool.cc:254] collecting diagnostics on the listening RPC socket unix:/tmp/dist-test-taskoAhsh_/test-tmp/rpc-test-aab47f0f7c26445dbda95f4061078841.sock every 8 connection(s)
W20260928 06:32:10.233163 18660 connection.cc:196] Error closing socket: Network error: TlsSocket::Close: Broken pipe
[       OK ] Parameters/TestRpc.TestRpcSidecar/SSL_UnixSocket (62 ms)
[ RUN      ] Parameters/TestRpc.TestRpcSidecarLimits/SSL_UnixSocket
I20260928 06:32:12.363660 18688 acceptor_pool.cc:254] collecting diagnostics on the listening RPC socket unix:/tmp/dist-test-taskoAhsh_/test-tmp/rpc-test-f873c4181a46472cb1152a135ba19bae.sock every 8 connection(s)
I20260928 06:32:12.363689 18689 acceptor_pool.cc:254] collecting diagnostics on the listening RPC socket unix:/tmp/dist-test-taskoAhsh_/test-tmp/rpc-test-f873c4181a46472cb1152a135ba19bae.sock every 8 connection(s)
W20260928 06:32:12.392557 18446 serialization.cc:72] Serialized kudu.rpc_test.PushStringsRequestPB (2147483654 bytes) is larger than the maximum configured RPC message size (52428800 bytes). Sending anyway, but peer may reject the data.
W20260928 06:32:12.395454 18685 connection.cc:535] server connection from unix:<unnamed> recv error: Network error: RPC frame had a length of 2147483714, but we only support messages up to 52428800 bytes long.
W20260928 06:32:12.395519 18685 connection.cc:158] shutting down server connection from unix:<unnamed> with pending inbound data: 4/2147483714 bytes received; last active 0 ns ago: status Network error: RPC frame had a length of 2147483714, but we only support messages up to 52428800 bytes long.
W20260928 06:32:12.395735 18701 connection.cc:196] Error closing socket: Network error: TlsSocket::Close: Broken pipe
I20260928 06:32:12.408247 18714 acceptor_pool.cc:254] collecting diagnostics on the listening RPC socket unix:/tmp/dist-test-taskoAhsh_/test-tmp/rpc-test-f873c4181a46472cb1152a135ba19bae.sock every 8 connection(s)
I20260928 06:32:12.408161 18713 acceptor_pool.cc:254] collecting diagnostics on the listening RPC socket unix:/tmp/dist-test-taskoAhsh_/test-tmp/rpc-test-f873c4181a46472cb1152a135ba19bae.sock every 8 connection(s)
W20260928 06:32:17.450184 18710 connection.cc:577] server connection from unix:<unnamed>: received bad data: 'Corruption: Invalid packet: message had a length of 2147483710, but we only support messages up to 2147483647 bytes
'
W20260928 06:32:17.450464 18726 connection.cc:196] Error closing socket: Network error: TlsSocket::Close: Broken pipe
[       OK ] Parameters/TestRpc.TestRpcSidecarLimits/SSL_UnixSocket (7218 ms)
[ RUN      ] Parameters/TestRpc.TestCallTimeoutDoesntAffectNegotiation/SSL_UnixSocket
I20260928 06:32:17.488425 18738 acceptor_pool.cc:254] collecting diagnostics on the listening RPC socket unix:/tmp/dist-test-taskoAhsh_/test-tmp/rpc-test-132a09f336944c6c9ba642718f41385a.sock every 8 connection(s)
I20260928 06:32:17.488471 18739 acceptor_pool.cc:254] collecting diagnostics on the listening RPC socket unix:/tmp/dist-test-taskoAhsh_/test-tmp/rpc-test-132a09f336944c6c9ba642718f41385a.sock every 8 connection(s)
W20260928 06:32:17.514410 18734 negotiation.cc:266] Injecting 500ms delay in negotiation
I20260928 06:32:17.564555 18446 rpc-test-base.h:595] status: Timed out: connection negotiation to unix:/tmp/dist-test-taskoAhsh_/test-tmp/rpc-test-132a09f336944c6c9ba642718f41385a.sock for RPC Sleep timed out after 0.050s (ON_OUTBOUND_QUEUE), seconds elapsed: 0.0504489
W20260928 06:32:18.018425 18735 connection.cc:196] Error closing socket: Network error: TlsSocket::Close: Broken pipe
[       OK ] Parameters/TestRpc.TestCallTimeoutDoesntAffectNegotiation/SSL_UnixSocket (567 ms)
[ RUN      ] Parameters/TestRpc.TestRpcHandlerLatencyMetric/SSL_UnixSocket
I20260928 06:32:18.026439 18763 acceptor_pool.cc:254] collecting diagnostics on the listening RPC socket unix:/tmp/dist-test-taskoAhsh_/test-tmp/rpc-test-1c9bdf7f49ac47a89e212b374f3cd91e.sock every 8 connection(s)
I20260928 06:32:18.026523 18764 acceptor_pool.cc:254] collecting diagnostics on the listening RPC socket unix:/tmp/dist-test-taskoAhsh_/test-tmp/rpc-test-1c9bdf7f49ac47a89e212b374f3cd91e.sock every 8 connection(s)
I20260928 06:32:18.088694 18446 rpc-test.cc:1236] Sleep() min lat: 20275
I20260928 06:32:18.088755 18446 rpc-test.cc:1237] Sleep() mean lat: 20275
I20260928 06:32:18.088779 18446 rpc-test.cc:1238] Sleep() max lat: 20275
I20260928 06:32:18.088793 18446 rpc-test.cc:1239] Sleep() #calls: 1
W20260928 06:32:18.089368 18760 connection.cc:196] Error closing socket: Network error: TlsSocket::Close: Broken pipe
[       OK ] Parameters/TestRpc.TestRpcHandlerLatencyMetric/SSL_UnixSocket (69 ms)
[ RUN      ] Parameters/TestRpc.TimedOutOnResponseMetricServiceQueue/SSL_UnixSocket
I20260928 06:32:18.102999 18789 acceptor_pool.cc:254] collecting diagnostics on the listening RPC socket unix:/tmp/dist-test-taskoAhsh_/test-tmp/rpc-test-726e9ca270e145759718d8562d72d6a3.sock every 8 connection(s)
I20260928 06:32:18.103049 18790 acceptor_pool.cc:254] collecting diagnostics on the listening RPC socket unix:/tmp/dist-test-taskoAhsh_/test-tmp/rpc-test-726e9ca270e145759718d8562d72d6a3.sock every 8 connection(s)
W20260928 06:32:18.157325 18791 rpcz_store.cc:267] Call kudu.rpc_test.CalculatorService.Sleep from unix:<unnamed> (request call id 2) took 20 ms (client timeout 20 ms). Trace:
W20260928 06:32:18.157447 18791 rpcz_store.cc:269] 0928 06:32:18.137081 (+     0us) service_pool.cc:170] Inserting onto call queue
0928 06:32:18.157300 (+ 20219us) service_pool.cc:214] Skipping call since client already timed out
0928 06:32:18.157312 (+    12us) inbound_call.cc:173] Queueing failure response
Metrics: {}
[       OK ] Parameters/TestRpc.TimedOutOnResponseMetricServiceQueue/SSL_UnixSocket (68 ms)
[ RUN      ] Parameters/TestRpc.RpcPendingConnectionsMetric/SSL_UnixSocket
I20260928 06:32:18.160765 18812 acceptor_pool.cc:254] collecting diagnostics on the listening RPC socket 0.0.0.0:46833 every 8 connection(s)
I20260928 06:32:18.160830 18813 acceptor_pool.cc:254] collecting diagnostics on the listening RPC socket 0.0.0.0:46833 every 8 connection(s)
W20260928 06:32:18.161427 18808 negotiation.cc:337] Failed RPC negotiation. Trace:
0928 06:32:18.161221 (+     0us) reactor.cc:625] Submitting negotiation task for server connection from 127.0.0.1:48036 (local address 127.0.0.1:46833)
0928 06:32:18.161294 (+    73us) server_negotiation.cc:206] Beginning negotiation
0928 06:32:18.161296 (+     2us) server_negotiation.cc:399] Waiting for connection header
0928 06:32:18.161374 (+    78us) negotiation.cc:327] Negotiation complete: Network error: Server connection negotiation failed: server connection from 127.0.0.1:48036: BlockingRecv error: recv got EOF from 127.0.0.1:48036 (error 108)
Metrics: {"server-negotiator.queue_time_us":44}
[       OK ] Parameters/TestRpc.RpcPendingConnectionsMetric/SSL_UnixSocket (13 ms)
[ RUN      ] Parameters/TestRpc.TestRpcContextClientDeadline/SSL_UnixSocket
I20260928 06:32:18.180194 18828 acceptor_pool.cc:254] collecting diagnostics on the listening RPC socket unix:/tmp/dist-test-taskoAhsh_/test-tmp/rpc-test-8190d2097d45417fb03eefd27c24113e.sock every 8 connection(s)
I20260928 06:32:18.180241 18829 acceptor_pool.cc:254] collecting diagnostics on the listening RPC socket unix:/tmp/dist-test-taskoAhsh_/test-tmp/rpc-test-8190d2097d45417fb03eefd27c24113e.sock every 8 connection(s)
W20260928 06:32:18.222298 18825 connection.cc:196] Error closing socket: Network error: TlsSocket::Close: Broken pipe
[       OK ] Parameters/TestRpc.TestRpcContextClientDeadline/SSL_UnixSocket (50 ms)
[ RUN      ] Parameters/TestRpc.TestApplicationFeatureFlagUnsupportedServer/SSL_UnixSocket
I20260928 06:32:18.239787 18853 acceptor_pool.cc:254] collecting diagnostics on the listening RPC socket unix:/tmp/dist-test-taskoAhsh_/test-tmp/rpc-test-e57d6f18fd9b42a1b1a5bdaad3f83156.sock every 8 connection(s)
I20260928 06:32:18.239827 18854 acceptor_pool.cc:254] collecting diagnostics on the listening RPC socket unix:/tmp/dist-test-taskoAhsh_/test-tmp/rpc-test-e57d6f18fd9b42a1b1a5bdaad3f83156.sock every 8 connection(s)
[       OK ] Parameters/TestRpc.TestApplicationFeatureFlagUnsupportedServer/SSL_UnixSocket (30 ms)
[ RUN      ] Parameters/TestRpc.TestCancellationAsync/SSL_UnixSocket
I20260928 06:32:18.265295 18878 acceptor_pool.cc:254] collecting diagnostics on the listening RPC socket unix:/tmp/dist-test-taskoAhsh_/test-tmp/rpc-test-31336d0dc6b7446c8997872b6ed811c6.sock every 8 connection(s)
I20260928 06:32:18.265352 18879 acceptor_pool.cc:254] collecting diagnostics on the listening RPC socket unix:/tmp/dist-test-taskoAhsh_/test-tmp/rpc-test-31336d0dc6b7446c8997872b6ed811c6.sock every 8 connection(s)
I20260928 06:32:18.265522 18446 rpc-test.cc:1716] Connecting to unix:/tmp/dist-test-taskoAhsh_/test-tmp/rpc-test-31336d0dc6b7446c8997872b6ed811c6.sock
I20260928 06:32:18.277580 18446 test_util.cc:268] Using random seed: 977607882
I20260928 06:32:18.291247 18882 rpc-test-base.h:240] got call: sleep_micros: 500 pattern: 4294967295 num_repetitions: 2097152 sidecar_idx: 0
I20260928 06:32:18.301362 18882 rpc-test-base.h:240] got call: sleep_micros: 500 pattern: 4294967295 num_repetitions: 2097152 sidecar_idx: 0
I20260928 06:32:18.311425 18882 rpc-test-base.h:240] got call: sleep_micros: 500 pattern: 4294967295 num_repetitions: 2097152 sidecar_idx: 0
I20260928 06:32:18.321285 18882 rpc-test-base.h:240] got call: sleep_micros: 500 pattern: 4294967295 num_repetitions: 2097152 sidecar_idx: 0
I20260928 06:32:18.331573 18882 rpc-test-base.h:240] got call: sleep_micros: 500 pattern: 4294967295 num_repetitions: 2097152 sidecar_idx: 0
I20260928 06:32:18.341184 18882 rpc-test-base.h:240] got call: sleep_micros: 500 pattern: 4294967295 num_repetitions: 2097152 sidecar_idx: 0
I20260928 06:32:18.350901 18882 rpc-test-base.h:240] got call: sleep_micros: 500 pattern: 4294967295 num_repetitions: 2097152 sidecar_idx: 0
I20260928 06:32:18.360663 18882 rpc-test-base.h:240] got call: sleep_micros: 500 pattern: 4294967295 num_repetitions: 2097152 sidecar_idx: 0
W20260928 06:32:18.363564 18875 connection.cc:441] server connection from unix:<unnamed> torn down before Call kudu.rpc.GenericCalculatorService.SleepWithSidecar from unix:<unnamed> (request call id 9) could send its response
[       OK ] Parameters/TestRpc.TestCancellationAsync/SSL_UnixSocket (110 ms)
[ RUN      ] Parameters/TestRpc.TestPerformanceBySocketType/SSL_UnixSocket
I20260928 06:32:18.389394 18903 acceptor_pool.cc:254] collecting diagnostics on the listening RPC socket unix:/tmp/dist-test-taskoAhsh_/test-tmp/rpc-test-94e26fdcdc6b4534b32f0cbf7763fa2c.sock every 8 connection(s)
I20260928 06:32:18.389437 18904 acceptor_pool.cc:254] collecting diagnostics on the listening RPC socket unix:/tmp/dist-test-taskoAhsh_/test-tmp/rpc-test-94e26fdcdc6b4534b32f0cbf7763fa2c.sock every 8 connection(s)
I20260928 06:32:18.389663 18446 rpc-test.cc:1846] Connecting to unix:/tmp/dist-test-taskoAhsh_/test-tmp/rpc-test-94e26fdcdc6b4534b32f0cbf7763fa2c.sock
I20260928 06:32:19.548857 18446 rpc-test.cc:1859] Sending 1024MB via ssl-enabled unix socket: real 1.146s	user 1.202s	sys 0.882s
I20260928 06:32:20.692596 18446 rpc-test.cc:1859] Sending 1024MB via ssl-enabled unix socket: real 1.144s	user 1.228s	sys 0.849s
I20260928 06:32:21.840502 18446 rpc-test.cc:1859] Sending 1024MB via ssl-enabled unix socket: real 1.148s	user 1.267s	sys 0.815s
I20260928 06:32:23.039503 18446 rpc-test.cc:1859] Sending 1024MB via ssl-enabled unix socket: real 1.199s	user 1.306s	sys 0.867s
I20260928 06:32:24.179189 18446 rpc-test.cc:1859] Sending 1024MB via ssl-enabled unix socket: real 1.140s	user 1.314s	sys 0.760s
W20260928 06:32:24.179980 18900 connection.cc:196] Error closing socket: Network error: TlsSocket::Close: Broken pipe
[       OK ] Parameters/TestRpc.TestPerformanceBySocketType/SSL_UnixSocket (5816 ms)
[----------] 20 tests from Parameters/TestRpc (26841 ms total)

[----------] 1 test from Parameters/TestRpcSocketTxRxQueue
[ RUN      ] Parameters/TestRpcSocketTxRxQueue.AcceptorRxQueueSizeMetric/0
I20260928 06:32:24.182691 18928 acceptor_pool.cc:254] collecting diagnostics on the listening RPC socket 0.0.0.0:41927 every 1 connection(s)
I20260928 06:32:24.182761 18929 acceptor_pool.cc:254] collecting diagnostics on the listening RPC socket 0.0.0.0:41927 every 1 connection(s)
W20260928 06:32:24.183269 18924 negotiation.cc:337] Failed RPC negotiation. Trace:
0928 06:32:24.183124 (+     0us) reactor.cc:625] Submitting negotiation task for server connection from 127.0.0.1:42000 (local address 127.0.0.1:41927)
0928 06:32:24.183167 (+    43us) server_negotiation.cc:206] Beginning negotiation
0928 06:32:24.183168 (+     1us) server_negotiation.cc:399] Waiting for connection header
0928 06:32:24.183232 (+    64us) negotiation.cc:327] Negotiation complete: Network error: Server connection negotiation failed: server connection from 127.0.0.1:42000: BlockingRecv error: recv got EOF from 127.0.0.1:42000 (error 108)
Metrics: {"server-negotiator.queue_time_us":16}
[       OK ] Parameters/TestRpcSocketTxRxQueue.AcceptorRxQueueSizeMetric/0 (4 ms)
[----------] 1 test from Parameters/TestRpcSocketTxRxQueue (4 ms total)

[----------] Global test environment tear-down
[==========] 21 tests from 2 test suites ran. (26845 ms total)
[  PASSED  ] 20 tests.
[  FAILED  ] 1 test, listed below:
[  FAILED  ] Parameters/TestRpc.TestCallWithChainCertAndChainCA/SSL_UnixSocket, where GetParam() = (true, true)

 1 FAILED TEST