Parameters/TestRpc.TestCallWithChainCertAndRootCA/SSL_TCP: /data0/somelongdirectorytoavoidrpathissues/src/kudu/src/kudu/rpc/rpc-test.cc:303: Failure
Failed
Bad status: Runtime error: could not verify certificate chain (error with cert: subject=CN = localhost, ST = sadfjas, C = AS, emailAddress = sdflkdsajf, O = lskdfjlsad, OU = sldfkja, issuer=C = AS, ST = ASDfkjdhf, L = lskdjf, O = saldfja, OU = skdjf, CN = localhost, emailAddress = sadjflkadsj): : certificate has expired
Google Test trace:
/data0/somelongdirectorytoavoidrpathissues/src/kudu/src/kudu/rpc/rpc-test.cc:300: Connecting to 0.0.0.0:44451
I20260926 12:10:35.479116 808 test_util.cc:175] -----------------------------------------------
I20260926 12:10:35.479267 808 test_util.cc:176] Had fatal failures, leaving test files at /tmp/dist-test-taskJbz4WS/test-tmp/rpc-test.1.Parameters_TestRpc.TestCallWithChainCertAndRootCA_SSL_TCP.1790424634056340-808-0
Note: This is test shard 2 of 8.
[==========] Running 21 tests from 2 test suites.
[----------] Global test environment set-up.
[----------] 1 test from TestRpc
[ RUN ] TestRpc.TestMethodsByName
[ OK ] TestRpc.TestMethodsByName (6 ms)
[----------] 1 test from TestRpc (6 ms total)
[----------] 20 tests from Parameters/TestRpc
[ RUN ] Parameters/TestRpc.TestAcceptorPoolStartStop/SSL_TCP
WARNING: Logging before InitGoogleLogging() is written to STDERR
I20260926 12:10:34.159274 823 acceptor_pool.cc:254] collecting diagnostics on the listening RPC socket 0.0.0.0:33749 every 8 connection(s)
W20260926 12:10:35.161710 808 thread.cc:536] Waited for 1000ms trying to join with acceptor (tid 824)
I20260926 12:10:34.161156 824 acceptor_pool.cc:254] collecting diagnostics on the listening RPC socket 0.0.0.0:33749 every 8 connection(s)
I20260926 12:10:35.234651 835 acceptor_pool.cc:254] collecting diagnostics on the listening RPC socket 0.0.0.0:38259 every 8 connection(s)
I20260926 12:10:35.236478 836 acceptor_pool.cc:254] collecting diagnostics on the listening RPC socket 0.0.0.0:38259 every 8 connection(s)
I20260926 12:10:35.259454 846 acceptor_pool.cc:254] collecting diagnostics on the listening RPC socket 0.0.0.0:35065 every 8 connection(s)
I20260926 12:10:35.261283 847 acceptor_pool.cc:254] collecting diagnostics on the listening RPC socket 0.0.0.0:35065 every 8 connection(s)
I20260926 12:10:35.278512 857 acceptor_pool.cc:254] collecting diagnostics on the listening RPC socket 0.0.0.0:43473 every 8 connection(s)
I20260926 12:10:35.279243 858 acceptor_pool.cc:254] collecting diagnostics on the listening RPC socket 0.0.0.0:43473 every 8 connection(s)
I20260926 12:10:35.297973 868 acceptor_pool.cc:254] collecting diagnostics on the listening RPC socket 0.0.0.0:34981 every 8 connection(s)
I20260926 12:10:35.298746 869 acceptor_pool.cc:254] collecting diagnostics on the listening RPC socket 0.0.0.0:34981 every 8 connection(s)
[ OK ] Parameters/TestRpc.TestAcceptorPoolStartStop/SSL_TCP (1189 ms)
[ RUN ] Parameters/TestRpc.TestCall/SSL_TCP
I20260926 12:10:35.344221 881 acceptor_pool.cc:254] collecting diagnostics on the listening RPC socket 0.0.0.0:40645 every 8 connection(s)
I20260926 12:10:35.345527 882 acceptor_pool.cc:254] collecting diagnostics on the listening RPC socket 0.0.0.0:40645 every 8 connection(s)
I20260926 12:10:35.351020 808 rpc-test.cc:234] Connecting to 0.0.0.0:40645
[ OK ] Parameters/TestRpc.TestCall/SSL_TCP (141 ms)
[ RUN ] Parameters/TestRpc.TestCallWithChainCertAndRootCA/SSL_TCP
I20260926 12:10:35.459679 906 acceptor_pool.cc:254] collecting diagnostics on the listening RPC socket 0.0.0.0:44451 every 8 connection(s)
I20260926 12:10:35.460372 907 acceptor_pool.cc:254] collecting diagnostics on the listening RPC socket 0.0.0.0:44451 every 8 connection(s)
/data0/somelongdirectorytoavoidrpathissues/src/kudu/src/kudu/rpc/rpc-test.cc:303: Failure
Failed
Bad status: Runtime error: could not verify certificate chain (error with cert: subject=CN = localhost, ST = sadfjas, C = AS, emailAddress = sdflkdsajf, O = lskdfjlsad, OU = sldfkja, issuer=C = AS, ST = ASDfkjdhf, L = lskdjf, O = saldfja, OU = skdjf, CN = localhost, emailAddress = sadjflkadsj): : certificate has expired
Google Test trace:
/data0/somelongdirectorytoavoidrpathissues/src/kudu/src/kudu/rpc/rpc-test.cc:300: Connecting to 0.0.0.0:44451
I20260926 12:10:35.479116 808 test_util.cc:175] -----------------------------------------------
I20260926 12:10:35.479267 808 test_util.cc:176] Had fatal failures, leaving test files at /tmp/dist-test-taskJbz4WS/test-tmp/rpc-test.1.Parameters_TestRpc.TestCallWithChainCertAndRootCA_SSL_TCP.1790424634056340-808-0
[ FAILED ] Parameters/TestRpc.TestCallWithChainCertAndRootCA/SSL_TCP, where GetParam() = (true, false) (34 ms)
[ RUN ] Parameters/TestRpc.TestCallWithBadPasswordProtectedKey/SSL_TCP
[ OK ] Parameters/TestRpc.TestCallWithBadPasswordProtectedKey/SSL_TCP (45 ms)
[ RUN ] Parameters/TestRpc.TestInvalidMethodCall/SSL_TCP
I20260926 12:10:35.541672 943 acceptor_pool.cc:254] collecting diagnostics on the listening RPC socket 0.0.0.0:45355 every 8 connection(s)
I20260926 12:10:35.542520 944 acceptor_pool.cc:254] collecting diagnostics on the listening RPC socket 0.0.0.0:45355 every 8 connection(s)
I20260926 12:10:35.545686 808 rpc-test.cc:406] Connecting to 0.0.0.0:45355
[ OK ] Parameters/TestRpc.TestInvalidMethodCall/SSL_TCP (73 ms)
[ RUN ] Parameters/TestRpc.TestHighFDs/SSL_TCP
I20260926 12:10:35.818032 968 acceptor_pool.cc:254] collecting diagnostics on the listening RPC socket 0.0.0.0:46445 every 8 connection(s)
I20260926 12:10:35.818774 969 acceptor_pool.cc:254] collecting diagnostics on the listening RPC socket 0.0.0.0:46445 every 8 connection(s)
[ OK ] Parameters/TestRpc.TestHighFDs/SSL_TCP (283 ms)
[ RUN ] Parameters/TestRpc.TestConnectionAlwaysKeepalive/SSL_TCP
I20260926 12:10:35.907584 991 acceptor_pool.cc:254] collecting diagnostics on the listening RPC socket 0.0.0.0:45935 every 8 connection(s)
I20260926 12:10:35.908223 992 acceptor_pool.cc:254] collecting diagnostics on the listening RPC socket 0.0.0.0:45935 every 8 connection(s)
I20260926 12:10:35.911042 808 rpc-test.cc:532] Connecting to 0.0.0.0:45935
[ OK ] Parameters/TestRpc.TestConnectionAlwaysKeepalive/SSL_TCP (3068 ms)
[ RUN ] Parameters/TestRpc.TestReopenOutboundConnections/SSL_TCP
I20260926 12:10:38.967995 1014 acceptor_pool.cc:254] collecting diagnostics on the listening RPC socket 0.0.0.0:33281 every 8 connection(s)
I20260926 12:10:38.968662 1015 acceptor_pool.cc:254] collecting diagnostics on the listening RPC socket 0.0.0.0:33281 every 8 connection(s)
I20260926 12:10:38.971524 808 rpc-test.cc:658] Connecting to 0.0.0.0:33281
[ OK ] Parameters/TestRpc.TestReopenOutboundConnections/SSL_TCP (343 ms)
[ RUN ] Parameters/TestRpc.TestConnectionNetworkPlane/SSL_TCP
I20260926 12:10:39.310803 1037 acceptor_pool.cc:254] collecting diagnostics on the listening RPC socket 0.0.0.0:38119 every 8 connection(s)
I20260926 12:10:39.311406 1038 acceptor_pool.cc:254] collecting diagnostics on the listening RPC socket 0.0.0.0:38119 every 8 connection(s)
I20260926 12:10:39.314450 808 rpc-test.cc:772] Connecting to 0.0.0.0:38119
[ OK ] Parameters/TestRpc.TestConnectionNetworkPlane/SSL_TCP (78 ms)
[ RUN ] Parameters/TestRpc.TestTCPKeepalive/SSL_TCP
I20260926 12:10:39.391170 1062 acceptor_pool.cc:254] collecting diagnostics on the listening RPC socket 0.0.0.0:39189 every 8 connection(s)
I20260926 12:10:39.391902 1063 acceptor_pool.cc:254] collecting diagnostics on the listening RPC socket 0.0.0.0:39189 every 8 connection(s)
I20260926 12:10:39.414839 1066 rpc-test-base.h:222] got call: sleep_micros: 8000000 deferred: true
I20260926 12:10:47.418682 1066 rpcz_store.cc:275] Call kudu.rpc.GenericCalculatorService.Sleep from 127.0.0.1:59840 (request call id 0) took 8004 ms. Trace:
I20260926 12:10:47.419100 1066 rpcz_store.cc:276] 0926 12:10:39.414553 (+ 0us) service_pool.cc:170] Inserting onto call queue
0926 12:10:39.414671 (+ 118us) service_pool.cc:227] Handling call
0926 12:10:47.418524 (+8003853us) inbound_call.cc:173] Queueing success response
Metrics: {}
[ OK ] Parameters/TestRpc.TestTCPKeepalive/SSL_TCP (8061 ms)
[ RUN ] Parameters/TestRpc.TestMaxSmallSidecars/SSL_TCP
I20260926 12:10:47.470744 1088 acceptor_pool.cc:254] collecting diagnostics on the listening RPC socket 0.0.0.0:44163 every 8 connection(s)
I20260926 12:10:47.471560 1089 acceptor_pool.cc:254] collecting diagnostics on the listening RPC socket 0.0.0.0:44163 every 8 connection(s)
[ OK ] Parameters/TestRpc.TestMaxSmallSidecars/SSL_TCP (214 ms)
[ RUN ] Parameters/TestRpc.TestCallTimeout/SSL_TCP
I20260926 12:10:47.670847 1113 acceptor_pool.cc:254] collecting diagnostics on the listening RPC socket 0.0.0.0:39875 every 8 connection(s)
I20260926 12:10:47.671562 1114 acceptor_pool.cc:254] collecting diagnostics on the listening RPC socket 0.0.0.0:39875 every 8 connection(s)
I20260926 12:10:47.691918 808 rpc-test-base.h:595] status: Timed out: connection negotiation to 0.0.0.0:39875 for RPC Sleep timed out after 0.000s (ON_OUTBOUND_QUEUE), seconds elapsed: 0.00226224
I20260926 12:10:47.699640 1117 rpc-test-base.h:222] got call: sleep_micros: 700000
I20260926 12:10:47.893414 808 rpc-test-base.h:595] status: Timed out: Sleep RPC to 0.0.0.0:39875 timed out after 0.200s (SENT), seconds elapsed: 0.201188
I20260926 12:10:47.894804 1116 rpc-test-base.h:222] got call: sleep_micros: 2000000
W20260926 12:10:48.400195 1117 rpcz_store.cc:267] Call kudu.rpc.GenericCalculatorService.Sleep from 127.0.0.1:46962 (request call id 1) took 700 ms (client timeout 200 ms). Trace:
W20260926 12:10:48.400521 1117 rpcz_store.cc:269] 0926 12:10:47.699477 (+ 0us) service_pool.cc:170] Inserting onto call queue
0926 12:10:47.699579 (+ 102us) service_pool.cc:227] Handling call
0926 12:10:48.400135 (+700556us) inbound_call.cc:173] Queueing success response
Metrics: {}
I20260926 12:10:49.395274 808 rpc-test-base.h:595] status: Timed out: Sleep RPC to 0.0.0.0:39875 timed out after 1.500s (SENT), seconds elapsed: 1.50154
W20260926 12:10:49.895262 1116 rpcz_store.cc:267] Call kudu.rpc.GenericCalculatorService.Sleep from 127.0.0.1:46962 (request call id 2) took 2000 ms (client timeout 1500 ms). Trace:
W20260926 12:10:49.895569 1116 rpcz_store.cc:269] 0926 12:10:47.894529 (+ 0us) service_pool.cc:170] Inserting onto call queue
0926 12:10:47.894660 (+ 131us) service_pool.cc:227] Handling call
0926 12:10:49.895211 (+2000551us) inbound_call.cc:173] Queueing success response
Metrics: {}
W20260926 12:10:49.896055 1111 connection.cc:441] server connection from 127.0.0.1:46962 torn down before Call kudu.rpc.GenericCalculatorService.Sleep from 127.0.0.1:46962 (request call id 2) could send its response
[ OK ] Parameters/TestRpc.TestCallTimeout/SSL_TCP (2252 ms)
[ RUN ] Parameters/TestRpc.TestServerShutsDown/SSL_TCP
I20260926 12:10:49.902462 808 rpc-test.cc:1125] Connecting to 0.0.0.0:44983
W20260926 12:10:49.911013 1130 negotiation.cc:337] Failed RPC negotiation. Trace:
0926 12:10:49.909677 (+ 0us) reactor.cc:625] Submitting negotiation task for client connection to 0.0.0.0:44983 (local address 127.0.0.1:42724)
0926 12:10:49.910063 (+ 386us) negotiation.cc:107] Waiting for socket to connect
0926 12:10:49.910090 (+ 27us) client_negotiation.cc:174] Beginning negotiation
0926 12:10:49.910268 (+ 178us) client_negotiation.cc:252] Sending NEGOTIATE NegotiatePB request
0926 12:10:49.910532 (+ 264us) negotiation.cc:327] Negotiation complete: Network error: Client connection negotiation failed: client connection to 0.0.0.0:44983: BlockingWrite error: write error: Broken pipe (error 32)
Metrics: {"client-negotiator.queue_time_us":89}
[ OK ] Parameters/TestRpc.TestServerShutsDown/SSL_TCP (12 ms)
[ RUN ] Parameters/TestRpc.TimedOutOnResponseMetric/SSL_TCP
I20260926 12:10:49.930651 1147 acceptor_pool.cc:254] collecting diagnostics on the listening RPC socket 0.0.0.0:34193 every 8 connection(s)
I20260926 12:10:49.931300 1148 acceptor_pool.cc:254] collecting diagnostics on the listening RPC socket 0.0.0.0:34193 every 8 connection(s)
W20260926 12:10:50.172634 1151 rpcz_store.cc:267] Call kudu.rpc_test.CalculatorService.Sleep from 127.0.0.1:42656 (request call id 3) took 50 ms (client timeout 25 ms). Trace:
W20260926 12:10:50.172879 1151 rpcz_store.cc:269] 0926 12:10:50.122166 (+ 0us) service_pool.cc:170] Inserting onto call queue
0926 12:10:50.122249 (+ 83us) service_pool.cc:227] Handling call
0926 12:10:50.172578 (+ 50329us) inbound_call.cc:173] Queueing success response
Related trace 'test_child':
Metrics: {"test_sleep_us":50000,"child_traces":[["test_child",{"related_trace_metric":1}]]}
W20260926 12:10:50.231453 1151 rpcz_store.cc:267] Call kudu.rpc_test.CalculatorService.Sleep from 127.0.0.1:42656 (request call id 4) took 50 ms (client timeout 50 ms). Trace:
W20260926 12:10:50.231701 1151 rpcz_store.cc:269] 0926 12:10:50.181011 (+ 0us) service_pool.cc:170] Inserting onto call queue
0926 12:10:50.181100 (+ 89us) service_pool.cc:227] Handling call
0926 12:10:50.231395 (+ 50295us) inbound_call.cc:173] Queueing success response
Related trace 'test_child':
Metrics: {"test_sleep_us":50000,"child_traces":[["test_child",{"related_trace_metric":1}]]}
[ OK ] Parameters/TestRpc.TimedOutOnResponseMetric/SSL_TCP (326 ms)
[ RUN ] Parameters/TestRpc.AcceptorDispatchingTimesMetric/SSL_TCP
I20260926 12:10:50.249745 1172 acceptor_pool.cc:254] collecting diagnostics on the listening RPC socket 0.0.0.0:41043 every 8 connection(s)
I20260926 12:10:50.250377 1173 acceptor_pool.cc:254] collecting diagnostics on the listening RPC socket 0.0.0.0:41043 every 8 connection(s)
W20260926 12:10:50.255586 1168 negotiation.cc:337] Failed RPC negotiation. Trace:
0926 12:10:50.254448 (+ 0us) reactor.cc:625] Submitting negotiation task for server connection from 127.0.0.1:59010 (local address 127.0.0.1:41043)
0926 12:10:50.254969 (+ 521us) server_negotiation.cc:206] Beginning negotiation
0926 12:10:50.254986 (+ 17us) server_negotiation.cc:399] Waiting for connection header
0926 12:10:50.255181 (+ 195us) negotiation.cc:327] Negotiation complete: Network error: Server connection negotiation failed: server connection from 127.0.0.1:59010: BlockingRecv error: recv got EOF from 127.0.0.1:59010 (error 108)
Metrics: {"server-negotiator.queue_time_us":226}
[ OK ] Parameters/TestRpc.AcceptorDispatchingTimesMetric/SSL_TCP (19 ms)
[ RUN ] Parameters/TestRpc.TestRpcCallbackDestroysMessenger/SSL_TCP
[ OK ] Parameters/TestRpc.TestRpcCallbackDestroysMessenger/SSL_TCP (29 ms)
[ RUN ] Parameters/TestRpc.TestApplicationFeatureFlag/SSL_TCP
I20260926 12:10:50.309870 1197 acceptor_pool.cc:254] collecting diagnostics on the listening RPC socket 0.0.0.0:43427 every 8 connection(s)
I20260926 12:10:50.310523 1198 acceptor_pool.cc:254] collecting diagnostics on the listening RPC socket 0.0.0.0:43427 every 8 connection(s)
W20260926 12:10:50.351305 1195 messenger.cc:357] Unable to handle RPC call: Not implemented: call requires unsupported application feature flags: 99
[ OK ] Parameters/TestRpc.TestApplicationFeatureFlag/SSL_TCP (69 ms)
[ RUN ] Parameters/TestRpc.TestCancellation/SSL_TCP
I20260926 12:10:50.377646 1222 acceptor_pool.cc:254] collecting diagnostics on the listening RPC socket 0.0.0.0:45881 every 8 connection(s)
I20260926 12:10:50.378350 1223 acceptor_pool.cc:254] collecting diagnostics on the listening RPC socket 0.0.0.0:45881 every 8 connection(s)
I20260926 12:10:50.381172 808 rpc-test.cc:1648] Connecting to 0.0.0.0:45881
I20260926 12:10:50.485635 808 rpc-test-base.h:595] status: Aborted: Sleep RPC to 0.0.0.0:45881 is cancelled in state READY, seconds elapsed: 0.000394376
I20260926 12:10:50.621776 808 rpc-test-base.h:595] status: Aborted: Sleep RPC to 0.0.0.0:45881 is cancelled in state SENT, seconds elapsed: 0.000915843
I20260926 12:10:50.670691 1225 rpc-test-base.h:222] got call: sleep_micros: 510000
I20260926 12:10:50.803529 808 rpc-test-base.h:595] status: Aborted: Sleep RPC to 0.0.0.0:45881 is cancelled in state SENT, seconds elapsed: 0.000722281
I20260926 12:10:50.839880 1224 rpc-test-base.h:222] got call: sleep_micros: 510000
I20260926 12:10:50.958474 808 rpc-test-base.h:595] status: Aborted: Sleep RPC to 0.0.0.0:45881 is cancelled in state SENT, seconds elapsed: 0.000839035
W20260926 12:10:50.998252 1226 rpcz_store.cc:267] Call kudu.rpc.GenericCalculatorService.Sleep from 127.0.0.1:37536 (request call id 11) took 14 ms (client timeout 10 ms). Trace:
W20260926 12:10:50.998611 1226 rpcz_store.cc:269] 0926 12:10:50.983877 (+ 0us) service_pool.cc:170] Inserting onto call queue
0926 12:10:50.997992 (+ 14115us) service_pool.cc:214] Skipping call since client already timed out
0926 12:10:50.998092 (+ 100us) inbound_call.cc:173] Queueing failure response
Metrics: {}
I20260926 12:10:50.999123 1226 rpc-test-base.h:222] got call: sleep_micros: 1500000
W20260926 12:10:51.181357 1225 rpcz_store.cc:267] Call kudu.rpc.GenericCalculatorService.Sleep from 127.0.0.1:37536 (request call id 3) took 510 ms (client timeout 10 ms). Trace:
W20260926 12:10:51.181644 1225 rpcz_store.cc:269] 0926 12:10:50.670490 (+ 0us) service_pool.cc:170] Inserting onto call queue
0926 12:10:50.670622 (+ 132us) service_pool.cc:227] Handling call
0926 12:10:51.181290 (+510668us) inbound_call.cc:173] Queueing success response
Metrics: {}
W20260926 12:10:51.350559 1224 rpcz_store.cc:267] Call kudu.rpc.GenericCalculatorService.Sleep from 127.0.0.1:37536 (request call id 7) took 510 ms (client timeout 10 ms). Trace:
W20260926 12:10:51.350862 1224 rpcz_store.cc:269] 0926 12:10:50.839683 (+ 0us) service_pool.cc:170] Inserting onto call queue
0926 12:10:50.839812 (+ 129us) service_pool.cc:227] Handling call
0926 12:10:51.350498 (+510686us) inbound_call.cc:173] Queueing success response
Metrics: {}
I20260926 12:10:51.960361 808 rpc-test-base.h:595] status: Timed out: Sleep RPC to 0.0.0.0:45881 timed out after 1.000s (SENT), seconds elapsed: 1.00142
I20260926 12:10:51.961665 1224 rpc-test-base.h:222] got call: sleep_micros: 1500000
W20260926 12:10:52.499578 1226 rpcz_store.cc:267] Call kudu.rpc.GenericCalculatorService.Sleep from 127.0.0.1:37536 (request call id 12) took 1515 ms (client timeout 1000 ms). Trace:
W20260926 12:10:52.499866 1226 rpcz_store.cc:269] 0926 12:10:50.984094 (+ 0us) service_pool.cc:170] Inserting onto call queue
0926 12:10:50.999090 (+ 14996us) service_pool.cc:227] Handling call
0926 12:10:52.499530 (+1500440us) inbound_call.cc:173] Queueing success response
Metrics: {}
I20260926 12:10:52.962529 808 rpc-test-base.h:595] status: Timed out: Sleep RPC to 0.0.0.0:45881 timed out after 1.000s (SENT), seconds elapsed: 1.00187
W20260926 12:10:52.963850 1221 messenger.cc:357] Unable to handle RPC call: Not implemented: call requires unsupported application feature flags: 99, 1
W20260926 12:10:52.965291 1221 messenger.cc:357] Unable to handle RPC call: Not implemented: call requires unsupported application feature flags: 99, 1
W20260926 12:10:53.462102 1224 rpcz_store.cc:267] Call kudu.rpc.GenericCalculatorService.Sleep from 127.0.0.1:37536 (request call id 13) took 1500 ms (client timeout 1000 ms). Trace:
W20260926 12:10:53.462406 1224 rpcz_store.cc:269] 0926 12:10:51.961518 (+ 0us) service_pool.cc:170] Inserting onto call queue
0926 12:10:51.961622 (+ 104us) service_pool.cc:227] Handling call
0926 12:10:53.462048 (+1500426us) inbound_call.cc:173] Queueing success response
Metrics: {}
W20260926 12:10:53.462877 1221 connection.cc:441] server connection from 127.0.0.1:37536 torn down before Call kudu.rpc.GenericCalculatorService.Sleep from 127.0.0.1:37536 (request call id 13) could send its response
[ OK ] Parameters/TestRpc.TestCancellation/SSL_TCP (3109 ms)
[ RUN ] Parameters/TestRpc.TestCancellationMultiThreads/SSL_TCP
I20260926 12:10:53.493448 1247 acceptor_pool.cc:254] collecting diagnostics on the listening RPC socket 0.0.0.0:37453 every 8 connection(s)
I20260926 12:10:53.494163 1248 acceptor_pool.cc:254] collecting diagnostics on the listening RPC socket 0.0.0.0:37453 every 8 connection(s)
I20260926 12:10:53.497185 808 rpc-test.cc:1808] Connecting to 0.0.0.0:37453
I20260926 12:10:53.635533 1261 test_util.cc:268] Using random seed: -1183178830
I20260926 12:10:53.636571 1262 test_util.cc:268] Using random seed: -1183177787
I20260926 12:10:53.637887 1263 test_util.cc:268] Using random seed: -1183176473
I20260926 12:10:53.639261 1264 test_util.cc:268] Using random seed: -1183175118
I20260926 12:10:53.640887 1265 test_util.cc:268] Using random seed: -1183173620
I20260926 12:10:53.642127 1266 test_util.cc:268] Using random seed: -1183172346
I20260926 12:10:53.643694 1267 test_util.cc:268] Using random seed: -1183170806
I20260926 12:10:53.645154 1268 test_util.cc:268] Using random seed: -1183169363
I20260926 12:10:53.646857 1269 test_util.cc:268] Using random seed: -1183167604
I20260926 12:10:53.648607 1270 test_util.cc:268] Using random seed: -1183166307
I20260926 12:10:53.649752 1271 test_util.cc:268] Using random seed: -1183164724
I20260926 12:10:53.651702 1272 test_util.cc:268] Using random seed: -1183162767
I20260926 12:10:53.653594 1273 test_util.cc:268] Using random seed: -1183160884
I20260926 12:10:53.654820 1274 test_util.cc:268] Using random seed: -1183159671
I20260926 12:10:53.659415 1275 test_util.cc:268] Using random seed: -1183155097
I20260926 12:10:53.661397 1276 test_util.cc:268] Using random seed: -1183153106
I20260926 12:10:53.665565 1277 test_util.cc:268] Using random seed: -1183148884
I20260926 12:10:53.667303 1278 test_util.cc:268] Using random seed: -1183147190
I20260926 12:10:53.669028 1279 test_util.cc:268] Using random seed: -1183145477
I20260926 12:10:53.671662 1280 test_util.cc:268] Using random seed: -1183142839
I20260926 12:10:53.674221 1281 test_util.cc:268] Using random seed: -1183140300
I20260926 12:10:53.676210 1282 test_util.cc:268] Using random seed: -1183138781
I20260926 12:10:53.678542 1283 test_util.cc:268] Using random seed: -1183136035
I20260926 12:10:53.679886 1284 test_util.cc:268] Using random seed: -1183134601
I20260926 12:10:53.681545 1285 test_util.cc:268] Using random seed: -1183132937
I20260926 12:10:53.683228 1286 test_util.cc:268] Using random seed: -1183131240
I20260926 12:10:53.684932 1287 test_util.cc:268] Using random seed: -1183129967
I20260926 12:10:53.691193 1288 test_util.cc:268] Using random seed: -1183123738
I20260926 12:10:53.695441 1289 test_util.cc:268] Using random seed: -1183119061
I20260926 12:10:53.697314 1290 test_util.cc:268] Using random seed: -1183117190
[ OK ] Parameters/TestRpc.TestCancellationMultiThreads/SSL_TCP (17345 ms)
[ RUN ] Parameters/TestRpc.TestCallId/SSL_TCP
I20260926 12:11:10.845494 1304 acceptor_pool.cc:254] collecting diagnostics on the listening RPC socket 0.0.0.0:33129 every 8 connection(s)
I20260926 12:11:10.846282 1305 acceptor_pool.cc:254] collecting diagnostics on the listening RPC socket 0.0.0.0:33129 every 8 connection(s)
[ OK ] Parameters/TestRpc.TestCallId/SSL_TCP (112 ms)
[----------] 20 tests from Parameters/TestRpc (36815 ms total)
[----------] Global test environment tear-down
[==========] 21 tests from 2 test suites ran. (36822 ms total)
[ PASSED ] 20 tests.
[ FAILED ] 1 test, listed below:
[ FAILED ] Parameters/TestRpc.TestCallWithChainCertAndRootCA/SSL_TCP, where GetParam() = (true, false)
1 FAILED TEST