Diagnosed failure
Parameters/TestRpc.TestCallWithChainCertAndChainCA/SSL_UnixSocket: /data0/somelongdirectorytoavoidrpathissues/src/kudu/src/kudu/rpc/rpc-test.cc:270: Failure
Failed
Bad status: Runtime error: could not verify certificate chain (error with cert: subject=CN = localhost, ST = sadfjas, C = AS, emailAddress = sdflkdsajf, O = lskdfjlsad, OU = sldfkja, issuer=C = AS, ST = ASDfkjdhf, L = lskdjf, O = saldfja, OU = skdjf, CN = localhost, emailAddress = sadjflkadsj): : certificate has expired
Google Test trace:
/data0/somelongdirectorytoavoidrpathissues/src/kudu/src/kudu/rpc/rpc-test.cc:267: Connecting to unix:/tmp/dist-test-taskNJUyRE/test-tmp/rpc-test-2b6b2edb3e2844e795ea236510dcc3d8.sock
I20260927 06:54:13.368121 379 test_util.cc:175] -----------------------------------------------
I20260927 06:54:13.368207 379 test_util.cc:176] Had fatal failures, leaving test files at /tmp/dist-test-taskNJUyRE/test-tmp/rpc-test.6.Parameters_TestRpc.TestCallWithChainCertAndChainCA_SSL_UnixSocket.1790492053245249-379-0
Full log
Note: This is test shard 7 of 8.
[==========] Running 21 tests from 2 test suites.
[----------] Global test environment set-up.
[----------] 20 tests from Parameters/TestRpc
[ RUN ] Parameters/TestRpc.TestMessengerCreateDestroy/SSL_UnixSocket
WARNING: Logging before InitGoogleLogging() is written to STDERR
I20260927 06:54:13.303653 379 rpc-test.cc:169] started messenger TestCreateDestroy
[ OK ] Parameters/TestRpc.TestMessengerCreateDestroy/SSL_UnixSocket (42 ms)
[ RUN ] Parameters/TestRpc.TestNegotiationDeadlock/SSL_UnixSocket
I20260927 06:54:13.316159 399 acceptor_pool.cc:254] collecting diagnostics on the listening RPC socket unix:/tmp/dist-test-taskNJUyRE/test-tmp/rpc-test-1c7b05cd55f54cea9653098bb9dc7101.sock every 8 connection(s)
I20260927 06:54:13.316445 400 acceptor_pool.cc:254] collecting diagnostics on the listening RPC socket unix:/tmp/dist-test-taskNJUyRE/test-tmp/rpc-test-1c7b05cd55f54cea9653098bb9dc7101.sock every 8 connection(s)
[ OK ] Parameters/TestRpc.TestNegotiationDeadlock/SSL_UnixSocket (28 ms)
[ RUN ] Parameters/TestRpc.TestCallWithChainCertAndChainCA/SSL_UnixSocket
I20260927 06:54:13.356319 415 acceptor_pool.cc:254] collecting diagnostics on the listening RPC socket unix:/tmp/dist-test-taskNJUyRE/test-tmp/rpc-test-2b6b2edb3e2844e795ea236510dcc3d8.sock every 8 connection(s)
I20260927 06:54:13.356678 416 acceptor_pool.cc:254] collecting diagnostics on the listening RPC socket unix:/tmp/dist-test-taskNJUyRE/test-tmp/rpc-test-2b6b2edb3e2844e795ea236510dcc3d8.sock every 8 connection(s)
/data0/somelongdirectorytoavoidrpathissues/src/kudu/src/kudu/rpc/rpc-test.cc:270: Failure
Failed
Bad status: Runtime error: could not verify certificate chain (error with cert: subject=CN = localhost, ST = sadfjas, C = AS, emailAddress = sdflkdsajf, O = lskdfjlsad, OU = sldfkja, issuer=C = AS, ST = ASDfkjdhf, L = lskdjf, O = saldfja, OU = skdjf, CN = localhost, emailAddress = sadjflkadsj): : certificate has expired
Google Test trace:
/data0/somelongdirectorytoavoidrpathissues/src/kudu/src/kudu/rpc/rpc-test.cc:267: Connecting to unix:/tmp/dist-test-taskNJUyRE/test-tmp/rpc-test-2b6b2edb3e2844e795ea236510dcc3d8.sock
I20260927 06:54:13.368121 379 test_util.cc:175] -----------------------------------------------
I20260927 06:54:13.368207 379 test_util.cc:176] Had fatal failures, leaving test files at /tmp/dist-test-taskNJUyRE/test-tmp/rpc-test.6.Parameters_TestRpc.TestCallWithChainCertAndChainCA_SSL_UnixSocket.1790492053245249-379-0
[ FAILED ] Parameters/TestRpc.TestCallWithChainCertAndChainCA/SSL_UnixSocket, where GetParam() = (true, true) (33 ms)
[ RUN ] Parameters/TestRpc.TestCallWithPasswordProtectedKey/SSL_UnixSocket
I20260927 06:54:13.387979 440 acceptor_pool.cc:254] collecting diagnostics on the listening RPC socket unix:/tmp/dist-test-taskNJUyRE/test-tmp/rpc-test-4eeb58d073344a73b6852a36a2dd0f12.sock every 8 connection(s)
I20260927 06:54:13.388213 441 acceptor_pool.cc:254] collecting diagnostics on the listening RPC socket unix:/tmp/dist-test-taskNJUyRE/test-tmp/rpc-test-4eeb58d073344a73b6852a36a2dd0f12.sock every 8 connection(s)
[ OK ] Parameters/TestRpc.TestCallWithPasswordProtectedKey/SSL_UnixSocket (54 ms)
[ RUN ] Parameters/TestRpc.TestCallToBadServer/SSL_UnixSocket
I20260927 06:54:13.440390 379 rpc-test.cc:394] Status: Network error: Client connection negotiation failed: client connection to 0.0.0.0:0: connect: Connection refused (error 111)
I20260927 06:54:13.441100 379 rpc-test.cc:394] Status: Network error: Client connection negotiation failed: client connection to 0.0.0.0:0: connect: Connection refused (error 111)
I20260927 06:54:13.441663 379 rpc-test.cc:394] Status: Network error: Client connection negotiation failed: client connection to 0.0.0.0:0: connect: Connection refused (error 111)
I20260927 06:54:13.442227 379 rpc-test.cc:394] Status: Network error: Client connection negotiation failed: client connection to 0.0.0.0:0: connect: Connection refused (error 111)
I20260927 06:54:13.442787 379 rpc-test.cc:394] Status: Network error: Client connection negotiation failed: client connection to 0.0.0.0:0: connect: Connection refused (error 111)
[ OK ] Parameters/TestRpc.TestCallToBadServer/SSL_UnixSocket (22 ms)
[ RUN ] Parameters/TestRpc.TestWrongService/SSL_UnixSocket
I20260927 06:54:13.453958 475 acceptor_pool.cc:254] collecting diagnostics on the listening RPC socket unix:/tmp/dist-test-taskNJUyRE/test-tmp/rpc-test-709d8abcc3f540e89d52bbcca021c669.sock every 8 connection(s)
I20260927 06:54:13.454248 476 acceptor_pool.cc:254] collecting diagnostics on the listening RPC socket unix:/tmp/dist-test-taskNJUyRE/test-tmp/rpc-test-709d8abcc3f540e89d52bbcca021c669.sock every 8 connection(s)
I20260927 06:54:13.472334 472 messenger.cc:345] service WrongServiceName not registered on TestServer
W20260927 06:54:13.473858 472 connection.cc:196] Error closing socket: Network error: TlsSocket::Close: Broken pipe
[ OK ] Parameters/TestRpc.TestWrongService/SSL_UnixSocket (32 ms)
[ RUN ] Parameters/TestRpc.TestConnectionKeepalive/SSL_UnixSocket
I20260927 06:54:13.500504 498 acceptor_pool.cc:254] collecting diagnostics on the listening RPC socket unix:/tmp/dist-test-taskNJUyRE/test-tmp/rpc-test-a4bcbf48022b4b9e9d3234b32fb143b7.sock every 8 connection(s)
I20260927 06:54:13.500732 499 acceptor_pool.cc:254] collecting diagnostics on the listening RPC socket unix:/tmp/dist-test-taskNJUyRE/test-tmp/rpc-test-a4bcbf48022b4b9e9d3234b32fb143b7.sock every 8 connection(s)
I20260927 06:54:13.501669 379 rpc-test.cc:488] Connecting to unix:/tmp/dist-test-taskNJUyRE/test-tmp/rpc-test-a4bcbf48022b4b9e9d3234b32fb143b7.sock
W20260927 06:54:13.979631 511 connection.cc:196] Error closing socket: Network error: TlsSocket::Close: Broken pipe
[ OK ] Parameters/TestRpc.TestConnectionKeepalive/SSL_UnixSocket (1058 ms)
[ RUN ] Parameters/TestRpc.TestClientConnectionMetrics/SSL_UnixSocket
I20260927 06:54:14.561251 523 acceptor_pool.cc:254] collecting diagnostics on the listening RPC socket unix:/tmp/dist-test-taskNJUyRE/test-tmp/rpc-test-074aff3ff31d41e8bce2ea1c5cdb9d18.sock every 8 connection(s)
I20260927 06:54:14.561641 524 acceptor_pool.cc:254] collecting diagnostics on the listening RPC socket unix:/tmp/dist-test-taskNJUyRE/test-tmp/rpc-test-074aff3ff31d41e8bce2ea1c5cdb9d18.sock every 8 connection(s)
I20260927 06:54:14.562618 379 rpc-test.cc:569] Connecting to unix:/tmp/dist-test-taskNJUyRE/test-tmp/rpc-test-074aff3ff31d41e8bce2ea1c5cdb9d18.sock
[ OK ] Parameters/TestRpc.TestClientConnectionMetrics/SSL_UnixSocket (20465 ms)
[ RUN ] Parameters/TestRpc.TestCredentialsPolicy/SSL_UnixSocket
I20260927 06:54:35.025159 546 acceptor_pool.cc:254] collecting diagnostics on the listening RPC socket unix:/tmp/dist-test-taskNJUyRE/test-tmp/rpc-test-9e8c9a1293184fbe95623337ff8e1754.sock every 8 connection(s)
I20260927 06:54:35.025383 547 acceptor_pool.cc:254] collecting diagnostics on the listening RPC socket unix:/tmp/dist-test-taskNJUyRE/test-tmp/rpc-test-9e8c9a1293184fbe95623337ff8e1754.sock every 8 connection(s)
I20260927 06:54:35.026290 379 rpc-test.cc:700] Connecting to unix:/tmp/dist-test-taskNJUyRE/test-tmp/rpc-test-9e8c9a1293184fbe95623337ff8e1754.sock
W20260927 06:54:35.055572 545 connection.cc:196] Error closing socket: Network error: TlsSocket::Close: Broken pipe
[ OK ] Parameters/TestRpc.TestCredentialsPolicy/SSL_UnixSocket (63 ms)
[ RUN ] Parameters/TestRpc.TestCallLongerThanKeepalive/SSL_UnixSocket
I20260927 06:54:35.080147 571 acceptor_pool.cc:254] collecting diagnostics on the listening RPC socket unix:/tmp/dist-test-taskNJUyRE/test-tmp/rpc-test-89a40fe32fd54eea8ccd909a7766f77e.sock every 8 connection(s)
I20260927 06:54:35.080361 572 acceptor_pool.cc:254] collecting diagnostics on the listening RPC socket unix:/tmp/dist-test-taskNJUyRE/test-tmp/rpc-test-89a40fe32fd54eea8ccd909a7766f77e.sock every 8 connection(s)
I20260927 06:54:35.097864 575 rpc-test-base.h:222] got call: sleep_micros: 3000000 deferred: true
I20260927 06:54:38.099566 575 rpcz_store.cc:275] Call kudu.rpc.GenericCalculatorService.Sleep from unix:<unnamed> (request call id 0) took 3001 ms. Trace:
I20260927 06:54:38.099745 575 rpcz_store.cc:276] 0927 06:54:35.097773 (+ 0us) service_pool.cc:170] Inserting onto call queue
0927 06:54:35.097827 (+ 54us) service_pool.cc:227] Handling call
0927 06:54:38.099515 (+3001688us) inbound_call.cc:173] Queueing success response
Metrics: {}
[ OK ] Parameters/TestRpc.TestCallLongerThanKeepalive/SSL_UnixSocket (3040 ms)
[ RUN ] Parameters/TestRpc.TestRpcSidecar/SSL_UnixSocket
I20260927 06:54:38.122982 596 acceptor_pool.cc:254] collecting diagnostics on the listening RPC socket unix:/tmp/dist-test-taskNJUyRE/test-tmp/rpc-test-c07477292cd34ffc9a08a54eda2930a8.sock every 8 connection(s)
I20260927 06:54:38.123227 597 acceptor_pool.cc:254] collecting diagnostics on the listening RPC socket unix:/tmp/dist-test-taskNJUyRE/test-tmp/rpc-test-c07477292cd34ffc9a08a54eda2930a8.sock every 8 connection(s)
[ OK ] Parameters/TestRpc.TestRpcSidecar/SSL_UnixSocket (141 ms)
[ RUN ] Parameters/TestRpc.TestRpcSidecarLimits/SSL_UnixSocket
I20260927 06:54:40.345641 621 acceptor_pool.cc:254] collecting diagnostics on the listening RPC socket unix:/tmp/dist-test-taskNJUyRE/test-tmp/rpc-test-d7789748e5094e279911dbacdab4d0de.sock every 8 connection(s)
I20260927 06:54:40.345947 622 acceptor_pool.cc:254] collecting diagnostics on the listening RPC socket unix:/tmp/dist-test-taskNJUyRE/test-tmp/rpc-test-d7789748e5094e279911dbacdab4d0de.sock every 8 connection(s)
W20260927 06:54:40.360173 379 serialization.cc:72] Serialized kudu.rpc_test.PushStringsRequestPB (2147483654 bytes) is larger than the maximum configured RPC message size (52428800 bytes). Sending anyway, but peer may reject the data.
W20260927 06:54:40.366107 618 connection.cc:535] server connection from unix:<unnamed> recv error: Network error: RPC frame had a length of 2147483714, but we only support messages up to 52428800 bytes long.
W20260927 06:54:40.366232 618 connection.cc:158] shutting down server connection from unix:<unnamed> with pending inbound data: 4/2147483714 bytes received; last active 0 ns ago: status Network error: RPC frame had a length of 2147483714, but we only support messages up to 52428800 bytes long.
W20260927 06:54:40.366657 634 connection.cc:196] Error closing socket: Network error: TlsSocket::Close: Broken pipe
I20260927 06:54:40.390609 646 acceptor_pool.cc:254] collecting diagnostics on the listening RPC socket unix:/tmp/dist-test-taskNJUyRE/test-tmp/rpc-test-d7789748e5094e279911dbacdab4d0de.sock every 8 connection(s)
I20260927 06:54:40.390895 647 acceptor_pool.cc:254] collecting diagnostics on the listening RPC socket unix:/tmp/dist-test-taskNJUyRE/test-tmp/rpc-test-d7789748e5094e279911dbacdab4d0de.sock every 8 connection(s)
W20260927 06:54:45.838057 643 connection.cc:577] server connection from unix:<unnamed>: received bad data: 'Corruption: Invalid packet: message had a length of 2147483710, but we only support messages up to 2147483647 bytes
'
W20260927 06:54:45.838693 659 connection.cc:196] Error closing socket: Network error: TlsSocket::Close: Broken pipe
[ OK ] Parameters/TestRpc.TestRpcSidecarLimits/SSL_UnixSocket (8050 ms)
[ RUN ] Parameters/TestRpc.TestCallTimeoutDoesntAffectNegotiation/SSL_UnixSocket
I20260927 06:54:46.326679 671 acceptor_pool.cc:254] collecting diagnostics on the listening RPC socket unix:/tmp/dist-test-taskNJUyRE/test-tmp/rpc-test-821c21b1fe8043f0a2e2aafebc7a31e7.sock every 8 connection(s)
I20260927 06:54:46.326944 672 acceptor_pool.cc:254] collecting diagnostics on the listening RPC socket unix:/tmp/dist-test-taskNJUyRE/test-tmp/rpc-test-821c21b1fe8043f0a2e2aafebc7a31e7.sock every 8 connection(s)
W20260927 06:54:46.343649 667 negotiation.cc:266] Injecting 500ms delay in negotiation
I20260927 06:54:46.394055 379 rpc-test-base.h:595] status: Timed out: connection negotiation to unix:/tmp/dist-test-taskNJUyRE/test-tmp/rpc-test-821c21b1fe8043f0a2e2aafebc7a31e7.sock for RPC Sleep timed out after 0.050s (ON_OUTBOUND_QUEUE), seconds elapsed: 0.050919
[ OK ] Parameters/TestRpc.TestCallTimeoutDoesntAffectNegotiation/SSL_UnixSocket (555 ms)
[ RUN ] Parameters/TestRpc.TestRpcHandlerLatencyMetric/SSL_UnixSocket
I20260927 06:54:46.864118 696 acceptor_pool.cc:254] collecting diagnostics on the listening RPC socket unix:/tmp/dist-test-taskNJUyRE/test-tmp/rpc-test-a0d3e14fb61e4bb0b862a1f69ba6d99a.sock every 8 connection(s)
I20260927 06:54:46.864374 697 acceptor_pool.cc:254] collecting diagnostics on the listening RPC socket unix:/tmp/dist-test-taskNJUyRE/test-tmp/rpc-test-a0d3e14fb61e4bb0b862a1f69ba6d99a.sock every 8 connection(s)
I20260927 06:54:46.908542 379 rpc-test.cc:1236] Sleep() min lat: 20558
I20260927 06:54:46.908643 379 rpc-test.cc:1237] Sleep() mean lat: 20558
I20260927 06:54:46.908684 379 rpc-test.cc:1238] Sleep() max lat: 20558
I20260927 06:54:46.908701 379 rpc-test.cc:1239] Sleep() #calls: 1
W20260927 06:54:46.909868 693 connection.cc:196] Error closing socket: Network error: TlsSocket::Close: Broken pipe
[ OK ] Parameters/TestRpc.TestRpcHandlerLatencyMetric/SSL_UnixSocket (60 ms)
[ RUN ] Parameters/TestRpc.TimedOutOnResponseMetricServiceQueue/SSL_UnixSocket
I20260927 06:54:46.928128 722 acceptor_pool.cc:254] collecting diagnostics on the listening RPC socket unix:/tmp/dist-test-taskNJUyRE/test-tmp/rpc-test-a0ee8cf07bcc4fae8820b4ed0e6317be.sock every 8 connection(s)
I20260927 06:54:46.928365 723 acceptor_pool.cc:254] collecting diagnostics on the listening RPC socket unix:/tmp/dist-test-taskNJUyRE/test-tmp/rpc-test-a0ee8cf07bcc4fae8820b4ed0e6317be.sock every 8 connection(s)
W20260927 06:54:46.983354 724 rpcz_store.cc:267] Call kudu.rpc_test.CalculatorService.Sleep from unix:<unnamed> (request call id 2) took 20 ms (client timeout 20 ms). Trace:
W20260927 06:54:46.983489 724 rpcz_store.cc:269] 0927 06:54:46.962941 (+ 0us) service_pool.cc:170] Inserting onto call queue
0927 06:54:46.983287 (+ 20346us) service_pool.cc:214] Skipping call since client already timed out
0927 06:54:46.983338 (+ 51us) inbound_call.cc:173] Queueing failure response
Metrics: {}
[ OK ] Parameters/TestRpc.TimedOutOnResponseMetricServiceQueue/SSL_UnixSocket (73 ms)
[ RUN ] Parameters/TestRpc.RpcPendingConnectionsMetric/SSL_UnixSocket
I20260927 06:54:46.992475 745 acceptor_pool.cc:254] collecting diagnostics on the listening RPC socket 0.0.0.0:45115 every 8 connection(s)
I20260927 06:54:46.992681 746 acceptor_pool.cc:254] collecting diagnostics on the listening RPC socket 0.0.0.0:45115 every 8 connection(s)
W20260927 06:54:47.002709 741 negotiation.cc:337] Failed RPC negotiation. Trace:
0927 06:54:47.001849 (+ 0us) reactor.cc:625] Submitting negotiation task for server connection from 127.0.0.1:59132 (local address 127.0.0.1:45115)
0927 06:54:47.002047 (+ 198us) server_negotiation.cc:206] Beginning negotiation
0927 06:54:47.002053 (+ 6us) server_negotiation.cc:399] Waiting for connection header
0927 06:54:47.002269 (+ 216us) negotiation.cc:327] Negotiation complete: Network error: Server connection negotiation failed: server connection from 127.0.0.1:59132: BlockingRecv error: recv got EOF from 127.0.0.1:59132 (error 108)
Metrics: {"server-negotiator.queue_time_us":36}
[ OK ] Parameters/TestRpc.RpcPendingConnectionsMetric/SSL_UnixSocket (27 ms)
[ RUN ] Parameters/TestRpc.TestRpcContextClientDeadline/SSL_UnixSocket
I20260927 06:54:47.023923 761 acceptor_pool.cc:254] collecting diagnostics on the listening RPC socket unix:/tmp/dist-test-taskNJUyRE/test-tmp/rpc-test-a90d059528324526b98c2eb5da5c1250.sock every 8 connection(s)
I20260927 06:54:47.024102 762 acceptor_pool.cc:254] collecting diagnostics on the listening RPC socket unix:/tmp/dist-test-taskNJUyRE/test-tmp/rpc-test-a90d059528324526b98c2eb5da5c1250.sock every 8 connection(s)
[ OK ] Parameters/TestRpc.TestRpcContextClientDeadline/SSL_UnixSocket (52 ms)
[ RUN ] Parameters/TestRpc.TestApplicationFeatureFlagUnsupportedServer/SSL_UnixSocket
I20260927 06:54:47.096865 786 acceptor_pool.cc:254] collecting diagnostics on the listening RPC socket unix:/tmp/dist-test-taskNJUyRE/test-tmp/rpc-test-3c03e396199b49b18ad96a748c73d325.sock every 8 connection(s)
I20260927 06:54:47.097102 787 acceptor_pool.cc:254] collecting diagnostics on the listening RPC socket unix:/tmp/dist-test-taskNJUyRE/test-tmp/rpc-test-3c03e396199b49b18ad96a748c73d325.sock every 8 connection(s)
W20260927 06:54:47.115999 783 connection.cc:196] Error closing socket: Network error: TlsSocket::Close: Broken pipe
[ OK ] Parameters/TestRpc.TestApplicationFeatureFlagUnsupportedServer/SSL_UnixSocket (52 ms)
[ RUN ] Parameters/TestRpc.TestCancellationAsync/SSL_UnixSocket
I20260927 06:54:47.156312 811 acceptor_pool.cc:254] collecting diagnostics on the listening RPC socket unix:/tmp/dist-test-taskNJUyRE/test-tmp/rpc-test-f6fa282789794d6fbb1e26fc126f50dd.sock every 8 connection(s)
I20260927 06:54:47.156534 812 acceptor_pool.cc:254] collecting diagnostics on the listening RPC socket unix:/tmp/dist-test-taskNJUyRE/test-tmp/rpc-test-f6fa282789794d6fbb1e26fc126f50dd.sock every 8 connection(s)
I20260927 06:54:47.157393 379 rpc-test.cc:1716] Connecting to unix:/tmp/dist-test-taskNJUyRE/test-tmp/rpc-test-f6fa282789794d6fbb1e26fc126f50dd.sock
I20260927 06:54:47.174463 379 test_util.cc:268] Using random seed: 1825850671
I20260927 06:54:47.207649 815 rpc-test-base.h:240] got call: sleep_micros: 500 pattern: 4294967295 num_repetitions: 2097152 sidecar_idx: 0
I20260927 06:54:47.227161 814 rpc-test-base.h:240] got call: sleep_micros: 500 pattern: 4294967295 num_repetitions: 2097152 sidecar_idx: 0
I20260927 06:54:47.258383 813 rpc-test-base.h:240] got call: sleep_micros: 500 pattern: 4294967295 num_repetitions: 2097152 sidecar_idx: 0
I20260927 06:54:47.294562 814 rpc-test-base.h:240] got call: sleep_micros: 500 pattern: 4294967295 num_repetitions: 2097152 sidecar_idx: 0
I20260927 06:54:47.319167 813 rpc-test-base.h:240] got call: sleep_micros: 500 pattern: 4294967295 num_repetitions: 2097152 sidecar_idx: 0
I20260927 06:54:47.351567 815 rpc-test-base.h:240] got call: sleep_micros: 500 pattern: 4294967295 num_repetitions: 2097152 sidecar_idx: 0
I20260927 06:54:47.383846 814 rpc-test-base.h:240] got call: sleep_micros: 500 pattern: 4294967295 num_repetitions: 2097152 sidecar_idx: 0
W20260927 06:54:47.391343 808 connection.cc:698] server connection from unix:<unnamed> send error: Network error: failed to write to TLS socket: Broken pipe
W20260927 06:54:47.391582 808 connection.cc:441] server connection from unix:<unnamed> torn down before Call kudu.rpc.GenericCalculatorService.SleepWithSidecar from unix:<unnamed> (request call id 7) could send its response
W20260927 06:54:47.392253 808 connection.cc:196] Error closing socket: Network error: TlsSocket::Close: Success
W20260927 06:54:47.413280 808 connection.cc:441] server connection from unix:<unnamed> torn down before Call kudu.rpc.GenericCalculatorService.SleepWithSidecar from unix:<unnamed> (request call id 8) could send its response
W20260927 06:54:47.428978 808 connection.cc:441] server connection from unix:<unnamed> torn down before Call kudu.rpc.GenericCalculatorService.SleepWithSidecar from unix:<unnamed> (request call id 9) could send its response
[ OK ] Parameters/TestRpc.TestCancellationAsync/SSL_UnixSocket (312 ms)
[ RUN ] Parameters/TestRpc.TestPerformanceBySocketType/SSL_UnixSocket
I20260927 06:54:47.446568 836 acceptor_pool.cc:254] collecting diagnostics on the listening RPC socket unix:/tmp/dist-test-taskNJUyRE/test-tmp/rpc-test-d24a5e65eaf04b4a9eed08a8f713cf09.sock every 8 connection(s)
I20260927 06:54:47.446789 837 acceptor_pool.cc:254] collecting diagnostics on the listening RPC socket unix:/tmp/dist-test-taskNJUyRE/test-tmp/rpc-test-d24a5e65eaf04b4a9eed08a8f713cf09.sock every 8 connection(s)
I20260927 06:54:47.447641 379 rpc-test.cc:1846] Connecting to unix:/tmp/dist-test-taskNJUyRE/test-tmp/rpc-test-d24a5e65eaf04b4a9eed08a8f713cf09.sock
I20260927 06:54:50.342017 379 rpc-test.cc:1859] Sending 1024MB via ssl-enabled unix socket: real 2.882s user 2.727s sys 2.190s
I20260927 06:54:53.284936 379 rpc-test.cc:1859] Sending 1024MB via ssl-enabled unix socket: real 2.943s user 2.820s sys 2.201s
I20260927 06:54:56.277046 379 rpc-test.cc:1859] Sending 1024MB via ssl-enabled unix socket: real 2.992s user 3.012s sys 2.094s
I20260927 06:54:59.317605 379 rpc-test.cc:1859] Sending 1024MB via ssl-enabled unix socket: real 3.040s user 2.991s sys 2.204s
I20260927 06:55:02.298805 379 rpc-test.cc:1859] Sending 1024MB via ssl-enabled unix socket: real 2.981s user 2.968s sys 2.105s
W20260927 06:55:02.300424 833 connection.cc:196] Error closing socket: Network error: TlsSocket::Close: Broken pipe
[ OK ] Parameters/TestRpc.TestPerformanceBySocketType/SSL_UnixSocket (14877 ms)
[----------] 20 tests from Parameters/TestRpc (49045 ms total)
[----------] 1 test from Parameters/TestRpcSocketTxRxQueue
[ RUN ] Parameters/TestRpcSocketTxRxQueue.AcceptorRxQueueSizeMetric/0
I20260927 06:55:02.324608 861 acceptor_pool.cc:254] collecting diagnostics on the listening RPC socket 0.0.0.0:35047 every 1 connection(s)
I20260927 06:55:02.324841 862 acceptor_pool.cc:254] collecting diagnostics on the listening RPC socket 0.0.0.0:35047 every 1 connection(s)
W20260927 06:55:02.326715 857 negotiation.cc:337] Failed RPC negotiation. Trace:
0927 06:55:02.326203 (+ 0us) reactor.cc:625] Submitting negotiation task for server connection from 127.0.0.1:54638 (local address 127.0.0.1:35047)
0927 06:55:02.326469 (+ 266us) server_negotiation.cc:206] Beginning negotiation
0927 06:55:02.326473 (+ 4us) server_negotiation.cc:399] Waiting for connection header
0927 06:55:02.326599 (+ 126us) negotiation.cc:327] Negotiation complete: Network error: Server connection negotiation failed: server connection from 127.0.0.1:54638: BlockingRecv error: recv got EOF from 127.0.0.1:54638 (error 108)
Metrics: {"server-negotiator.queue_time_us":71}
[ OK ] Parameters/TestRpcSocketTxRxQueue.AcceptorRxQueueSizeMetric/0 (20 ms)
[----------] 1 test from Parameters/TestRpcSocketTxRxQueue (20 ms total)
[----------] Global test environment tear-down
[==========] 21 tests from 2 test suites ran. (49066 ms total)
[ PASSED ] 20 tests.
[ FAILED ] 1 test, listed below:
[ FAILED ] Parameters/TestRpc.TestCallWithChainCertAndChainCA/SSL_UnixSocket, where GetParam() = (true, true)
1 FAILED TEST