Parameters/TestRpc.TestCallWithChainCertAndRootCA/SSL_UnixSocket: /data0/somelongdirectorytoavoidrpathissues/src/kudu/src/kudu/rpc/rpc-test.cc:303: Failure
Failed
Bad status: Runtime error: could not verify certificate chain (error with cert: subject=CN = localhost, ST = sadfjas, C = AS, emailAddress = sdflkdsajf, O = lskdfjlsad, OU = sldfkja, issuer=C = AS, ST = ASDfkjdhf, L = lskdjf, O = saldfja, OU = skdjf, CN = localhost, emailAddress = sadjflkadsj): : certificate has expired
Google Test trace:
/data0/somelongdirectorytoavoidrpathissues/src/kudu/src/kudu/rpc/rpc-test.cc:300: Connecting to unix:/tmp/dist-test-taskf0znoS/test-tmp/rpc-test-230c59503f35490eb41ccc5502c5d720.sock
I20260924 14:28:54.516800 31352 test_util.cc:175] -----------------------------------------------
I20260924 14:28:54.516958 31352 test_util.cc:176] Had fatal failures, leaving test files at /tmp/dist-test-taskf0znoS/test-tmp/rpc-test.2.Parameters_TestRpc.TestCallWithChainCertAndRootCA_SSL_UnixSocket.1790260130925046-31352-0
Note: This is test shard 3 of 8.
[==========] Running 21 tests from 2 test suites.
[----------] Global test environment set-up.
[----------] 1 test from TestRpc
[ RUN ] TestRpc.TestNegotiationTimeout
WARNING: Logging before InitGoogleLogging() is written to STDERR
I20260924 14:28:51.117077 31352 rpc-test-base.h:595] status: Timed out: connection negotiation to 0.0.0.0:46575 for RPC Sleep timed out after 0.100s (ON_OUTBOUND_QUEUE), seconds elapsed: 0.101682
W20260924 14:28:54.210256 31362 negotiation.cc:337] Failed RPC negotiation. Trace:
0924 14:28:51.016232 (+ 0us) reactor.cc:625] Submitting negotiation task for client connection to 0.0.0.0:46575 (local address 127.0.0.1:51322)
0924 14:28:51.016958 (+ 726us) negotiation.cc:107] Waiting for socket to connect
0924 14:28:51.017006 (+ 48us) client_negotiation.cc:174] Beginning negotiation
0924 14:28:51.029220 (+ 12214us) client_negotiation.cc:252] Sending NEGOTIATE NegotiatePB request
0924 14:28:54.209117 (+3179897us) negotiation.cc:327] Negotiation complete: Timed out: Client connection negotiation failed: client connection to 0.0.0.0:46575: received 0 of 4 requested bytes
Metrics: {"client-negotiator.queue_time_us":267}
[ OK ] TestRpc.TestNegotiationTimeout (3236 ms)
[----------] 1 test from TestRpc (3236 ms total)
[----------] 20 tests from Parameters/TestRpc
[ RUN ] Parameters/TestRpc.TestAcceptorPoolStartStop/SSL_UnixSocket
I20260924 14:28:54.251652 31379 acceptor_pool.cc:254] collecting diagnostics on the listening RPC socket unix:/tmp/dist-test-taskf0znoS/test-tmp/rpc-test-c544876411e4425ebb536cfc3b6c2333.sock every 8 connection(s)
I20260924 14:28:54.253384 31380 acceptor_pool.cc:254] collecting diagnostics on the listening RPC socket unix:/tmp/dist-test-taskf0znoS/test-tmp/rpc-test-c544876411e4425ebb536cfc3b6c2333.sock every 8 connection(s)
I20260924 14:28:54.310573 31390 acceptor_pool.cc:254] collecting diagnostics on the listening RPC socket unix:/tmp/dist-test-taskf0znoS/test-tmp/rpc-test-c544876411e4425ebb536cfc3b6c2333.sock every 8 connection(s)
I20260924 14:28:54.312014 31391 acceptor_pool.cc:254] collecting diagnostics on the listening RPC socket unix:/tmp/dist-test-taskf0znoS/test-tmp/rpc-test-c544876411e4425ebb536cfc3b6c2333.sock every 8 connection(s)
I20260924 14:28:54.332020 31401 acceptor_pool.cc:254] collecting diagnostics on the listening RPC socket unix:/tmp/dist-test-taskf0znoS/test-tmp/rpc-test-c544876411e4425ebb536cfc3b6c2333.sock every 8 connection(s)
I20260924 14:28:54.332751 31402 acceptor_pool.cc:254] collecting diagnostics on the listening RPC socket unix:/tmp/dist-test-taskf0znoS/test-tmp/rpc-test-c544876411e4425ebb536cfc3b6c2333.sock every 8 connection(s)
I20260924 14:28:54.376431 31412 acceptor_pool.cc:254] collecting diagnostics on the listening RPC socket unix:/tmp/dist-test-taskf0znoS/test-tmp/rpc-test-c544876411e4425ebb536cfc3b6c2333.sock every 8 connection(s)
I20260924 14:28:54.377158 31413 acceptor_pool.cc:254] collecting diagnostics on the listening RPC socket unix:/tmp/dist-test-taskf0znoS/test-tmp/rpc-test-c544876411e4425ebb536cfc3b6c2333.sock every 8 connection(s)
I20260924 14:28:54.396705 31423 acceptor_pool.cc:254] collecting diagnostics on the listening RPC socket unix:/tmp/dist-test-taskf0znoS/test-tmp/rpc-test-c544876411e4425ebb536cfc3b6c2333.sock every 8 connection(s)
I20260924 14:28:54.397459 31424 acceptor_pool.cc:254] collecting diagnostics on the listening RPC socket unix:/tmp/dist-test-taskf0znoS/test-tmp/rpc-test-c544876411e4425ebb536cfc3b6c2333.sock every 8 connection(s)
[ OK ] Parameters/TestRpc.TestAcceptorPoolStartStop/SSL_UnixSocket (186 ms)
[ RUN ] Parameters/TestRpc.TestCall/SSL_UnixSocket
I20260924 14:28:54.419739 31436 acceptor_pool.cc:254] collecting diagnostics on the listening RPC socket unix:/tmp/dist-test-taskf0znoS/test-tmp/rpc-test-b1d6cd117a6f4c9f85c8219137e64899.sock every 8 connection(s)
I20260924 14:28:54.421877 31437 acceptor_pool.cc:254] collecting diagnostics on the listening RPC socket unix:/tmp/dist-test-taskf0znoS/test-tmp/rpc-test-b1d6cd117a6f4c9f85c8219137e64899.sock every 8 connection(s)
I20260924 14:28:54.426709 31352 rpc-test.cc:234] Connecting to unix:/tmp/dist-test-taskf0znoS/test-tmp/rpc-test-b1d6cd117a6f4c9f85c8219137e64899.sock
W20260924 14:28:54.475196 31433 connection.cc:196] Error closing socket: Network error: TlsSocket::Close: Broken pipe
[ OK ] Parameters/TestRpc.TestCall/SSL_UnixSocket (78 ms)
[ RUN ] Parameters/TestRpc.TestCallWithChainCertAndRootCA/SSL_UnixSocket
I20260924 14:28:54.496740 31461 acceptor_pool.cc:254] collecting diagnostics on the listening RPC socket unix:/tmp/dist-test-taskf0znoS/test-tmp/rpc-test-230c59503f35490eb41ccc5502c5d720.sock every 8 connection(s)
I20260924 14:28:54.497493 31462 acceptor_pool.cc:254] collecting diagnostics on the listening RPC socket unix:/tmp/dist-test-taskf0znoS/test-tmp/rpc-test-230c59503f35490eb41ccc5502c5d720.sock every 8 connection(s)
/data0/somelongdirectorytoavoidrpathissues/src/kudu/src/kudu/rpc/rpc-test.cc:303: Failure
Failed
Bad status: Runtime error: could not verify certificate chain (error with cert: subject=CN = localhost, ST = sadfjas, C = AS, emailAddress = sdflkdsajf, O = lskdfjlsad, OU = sldfkja, issuer=C = AS, ST = ASDfkjdhf, L = lskdjf, O = saldfja, OU = skdjf, CN = localhost, emailAddress = sadjflkadsj): : certificate has expired
Google Test trace:
/data0/somelongdirectorytoavoidrpathissues/src/kudu/src/kudu/rpc/rpc-test.cc:300: Connecting to unix:/tmp/dist-test-taskf0znoS/test-tmp/rpc-test-230c59503f35490eb41ccc5502c5d720.sock
I20260924 14:28:54.516800 31352 test_util.cc:175] -----------------------------------------------
I20260924 14:28:54.516958 31352 test_util.cc:176] Had fatal failures, leaving test files at /tmp/dist-test-taskf0znoS/test-tmp/rpc-test.2.Parameters_TestRpc.TestCallWithChainCertAndRootCA_SSL_UnixSocket.1790260130925046-31352-0
[ FAILED ] Parameters/TestRpc.TestCallWithChainCertAndRootCA/SSL_UnixSocket, where GetParam() = (true, true) (37 ms)
[ RUN ] Parameters/TestRpc.TestCallWithBadPasswordProtectedKey/SSL_UnixSocket
[ OK ] Parameters/TestRpc.TestCallWithBadPasswordProtectedKey/SSL_UnixSocket (31 ms)
[ RUN ] Parameters/TestRpc.TestInvalidMethodCall/SSL_UnixSocket
I20260924 14:28:54.576224 31498 acceptor_pool.cc:254] collecting diagnostics on the listening RPC socket unix:/tmp/dist-test-taskf0znoS/test-tmp/rpc-test-1207c414e9df4ec2ada341dacdccfa29.sock every 8 connection(s)
I20260924 14:28:54.577095 31499 acceptor_pool.cc:254] collecting diagnostics on the listening RPC socket unix:/tmp/dist-test-taskf0znoS/test-tmp/rpc-test-1207c414e9df4ec2ada341dacdccfa29.sock every 8 connection(s)
I20260924 14:28:54.580497 31352 rpc-test.cc:406] Connecting to unix:/tmp/dist-test-taskf0znoS/test-tmp/rpc-test-1207c414e9df4ec2ada341dacdccfa29.sock
[ OK ] Parameters/TestRpc.TestInvalidMethodCall/SSL_UnixSocket (88 ms)
[ RUN ] Parameters/TestRpc.TestHighFDs/SSL_UnixSocket
I20260924 14:28:54.850742 31524 acceptor_pool.cc:254] collecting diagnostics on the listening RPC socket unix:/tmp/dist-test-taskf0znoS/test-tmp/rpc-test-bc0d2195bc8d4b8b985cf4b8d8895d11.sock every 8 connection(s)
I20260924 14:28:54.851478 31525 acceptor_pool.cc:254] collecting diagnostics on the listening RPC socket unix:/tmp/dist-test-taskf0znoS/test-tmp/rpc-test-bc0d2195bc8d4b8b985cf4b8d8895d11.sock every 8 connection(s)
[ OK ] Parameters/TestRpc.TestHighFDs/SSL_UnixSocket (259 ms)
[ RUN ] Parameters/TestRpc.TestConnectionAlwaysKeepalive/SSL_UnixSocket
I20260924 14:28:54.921732 31547 acceptor_pool.cc:254] collecting diagnostics on the listening RPC socket unix:/tmp/dist-test-taskf0znoS/test-tmp/rpc-test-2ae3fd8c3c574509a072acef2cc88cf4.sock every 8 connection(s)
I20260924 14:28:54.922451 31548 acceptor_pool.cc:254] collecting diagnostics on the listening RPC socket unix:/tmp/dist-test-taskf0znoS/test-tmp/rpc-test-2ae3fd8c3c574509a072acef2cc88cf4.sock every 8 connection(s)
I20260924 14:28:54.925530 31352 rpc-test.cc:532] Connecting to unix:/tmp/dist-test-taskf0znoS/test-tmp/rpc-test-2ae3fd8c3c574509a072acef2cc88cf4.sock
W20260924 14:28:57.962250 31546 connection.cc:196] Error closing socket: Network error: TlsSocket::Close: Broken pipe
[ OK ] Parameters/TestRpc.TestConnectionAlwaysKeepalive/SSL_UnixSocket (3070 ms)
[ RUN ] Parameters/TestRpc.TestReopenOutboundConnections/SSL_UnixSocket
I20260924 14:28:57.992759 31570 acceptor_pool.cc:254] collecting diagnostics on the listening RPC socket unix:/tmp/dist-test-taskf0znoS/test-tmp/rpc-test-6f666d38ada24bd283d464aec6b851a4.sock every 8 connection(s)
I20260924 14:28:57.993521 31571 acceptor_pool.cc:254] collecting diagnostics on the listening RPC socket unix:/tmp/dist-test-taskf0znoS/test-tmp/rpc-test-6f666d38ada24bd283d464aec6b851a4.sock every 8 connection(s)
I20260924 14:28:57.996634 31352 rpc-test.cc:658] Connecting to unix:/tmp/dist-test-taskf0znoS/test-tmp/rpc-test-6f666d38ada24bd283d464aec6b851a4.sock
W20260924 14:28:58.029827 31569 connection.cc:196] Error closing socket: Network error: TlsSocket::Close: Broken pipe
W20260924 14:28:58.039405 31569 connection.cc:196] Error closing socket: Network error: TlsSocket::Close: Broken pipe
W20260924 14:28:58.048501 31569 connection.cc:196] Error closing socket: Network error: TlsSocket::Close: Broken pipe
W20260924 14:28:58.057420 31569 connection.cc:196] Error closing socket: Network error: TlsSocket::Close: Broken pipe
W20260924 14:28:58.066354 31569 connection.cc:196] Error closing socket: Network error: TlsSocket::Close: Broken pipe
W20260924 14:28:58.075363 31569 connection.cc:196] Error closing socket: Network error: TlsSocket::Close: Broken pipe
W20260924 14:28:58.084972 31569 connection.cc:196] Error closing socket: Network error: TlsSocket::Close: Broken pipe
W20260924 14:28:58.094627 31569 connection.cc:196] Error closing socket: Network error: TlsSocket::Close: Broken pipe
W20260924 14:28:58.104907 31569 connection.cc:196] Error closing socket: Network error: TlsSocket::Close: Broken pipe
W20260924 14:28:58.119841 31569 connection.cc:196] Error closing socket: Network error: TlsSocket::Close: Broken pipe
W20260924 14:28:58.129305 31569 connection.cc:196] Error closing socket: Network error: TlsSocket::Close: Broken pipe
W20260924 14:28:58.139133 31569 connection.cc:196] Error closing socket: Network error: TlsSocket::Close: Broken pipe
W20260924 14:28:58.148442 31569 connection.cc:196] Error closing socket: Network error: TlsSocket::Close: Broken pipe
W20260924 14:28:58.157755 31569 connection.cc:196] Error closing socket: Network error: TlsSocket::Close: Broken pipe
W20260924 14:28:58.157915 31570 acceptor_pool.cc:285] unable to collect diagnostics on RPC socket unix:/tmp/dist-test-taskf0znoS/test-tmp/rpc-test-6f666d38ada24bd283d464aec6b851a4.sock: Not implemented: netlink diagnostics is currently supported only on IPv4 TCP sockets
W20260924 14:28:58.167322 31569 connection.cc:196] Error closing socket: Network error: TlsSocket::Close: Broken pipe
W20260924 14:28:58.177404 31569 connection.cc:196] Error closing socket: Network error: TlsSocket::Close: Broken pipe
W20260924 14:28:58.187570 31569 connection.cc:196] Error closing socket: Network error: TlsSocket::Close: Broken pipe
W20260924 14:28:58.197876 31569 connection.cc:196] Error closing socket: Network error: TlsSocket::Close: Broken pipe
W20260924 14:28:58.208194 31569 connection.cc:196] Error closing socket: Network error: TlsSocket::Close: Broken pipe
W20260924 14:28:58.218762 31569 connection.cc:196] Error closing socket: Network error: TlsSocket::Close: Broken pipe
W20260924 14:28:58.229789 31569 connection.cc:196] Error closing socket: Network error: TlsSocket::Close: Broken pipe
W20260924 14:28:58.240252 31569 connection.cc:196] Error closing socket: Network error: TlsSocket::Close: Broken pipe
W20260924 14:28:58.250537 31569 connection.cc:196] Error closing socket: Network error: TlsSocket::Close: Broken pipe
W20260924 14:28:58.264103 31569 connection.cc:196] Error closing socket: Network error: TlsSocket::Close: Broken pipe
W20260924 14:28:58.274488 31569 connection.cc:196] Error closing socket: Network error: TlsSocket::Close: Broken pipe
W20260924 14:28:58.284397 31569 connection.cc:196] Error closing socket: Network error: TlsSocket::Close: Broken pipe
W20260924 14:28:58.294133 31569 connection.cc:196] Error closing socket: Network error: TlsSocket::Close: Broken pipe
W20260924 14:28:58.303421 31569 connection.cc:196] Error closing socket: Network error: TlsSocket::Close: Broken pipe
W20260924 14:28:58.312791 31569 connection.cc:196] Error closing socket: Network error: TlsSocket::Close: Broken pipe
W20260924 14:28:58.322032 31569 connection.cc:196] Error closing socket: Network error: TlsSocket::Close: Broken pipe
W20260924 14:28:58.331264 31569 connection.cc:196] Error closing socket: Network error: TlsSocket::Close: Broken pipe
W20260924 14:28:58.342087 31569 connection.cc:196] Error closing socket: Network error: TlsSocket::Close: Broken pipe
[ OK ] Parameters/TestRpc.TestReopenOutboundConnections/SSL_UnixSocket (379 ms)
[ RUN ] Parameters/TestRpc.TestConnectionNetworkPlane/SSL_UnixSocket
I20260924 14:28:58.381443 31593 acceptor_pool.cc:254] collecting diagnostics on the listening RPC socket unix:/tmp/dist-test-taskf0znoS/test-tmp/rpc-test-b3e08afe327d42c5af30abe5d01ad962.sock every 8 connection(s)
I20260924 14:28:58.382156 31594 acceptor_pool.cc:254] collecting diagnostics on the listening RPC socket unix:/tmp/dist-test-taskf0znoS/test-tmp/rpc-test-b3e08afe327d42c5af30abe5d01ad962.sock every 8 connection(s)
I20260924 14:28:58.385309 31352 rpc-test.cc:772] Connecting to unix:/tmp/dist-test-taskf0znoS/test-tmp/rpc-test-b3e08afe327d42c5af30abe5d01ad962.sock
[ OK ] Parameters/TestRpc.TestConnectionNetworkPlane/SSL_UnixSocket (83 ms)
[ RUN ] Parameters/TestRpc.TestTCPKeepalive/SSL_UnixSocket
I20260924 14:28:58.450114 31618 acceptor_pool.cc:254] collecting diagnostics on the listening RPC socket unix:/tmp/dist-test-taskf0znoS/test-tmp/rpc-test-c2baa05a25ef49cda5e88024b640ab67.sock every 8 connection(s)
I20260924 14:28:58.450836 31619 acceptor_pool.cc:254] collecting diagnostics on the listening RPC socket unix:/tmp/dist-test-taskf0znoS/test-tmp/rpc-test-c2baa05a25ef49cda5e88024b640ab67.sock every 8 connection(s)
I20260924 14:28:58.481663 31622 rpc-test-base.h:222] got call: sleep_micros: 8000000 deferred: true
I20260924 14:29:06.485772 31622 rpcz_store.cc:275] Call kudu.rpc.GenericCalculatorService.Sleep from unix:<unnamed> (request call id 0) took 8004 ms. Trace:
I20260924 14:29:06.486225 31622 rpcz_store.cc:276] 0924 14:28:58.481512 (+ 0us) service_pool.cc:170] Inserting onto call queue
0924 14:28:58.481612 (+ 100us) service_pool.cc:227] Handling call
0924 14:29:06.485557 (+8003945us) inbound_call.cc:173] Queueing success response
Metrics: {}
[ OK ] Parameters/TestRpc.TestTCPKeepalive/SSL_UnixSocket (8070 ms)
[ RUN ] Parameters/TestRpc.TestMaxSmallSidecars/SSL_UnixSocket
I20260924 14:29:06.530565 31644 acceptor_pool.cc:254] collecting diagnostics on the listening RPC socket unix:/tmp/dist-test-taskf0znoS/test-tmp/rpc-test-1ef6f65c7b19470ba5b3124614c9f57a.sock every 8 connection(s)
I20260924 14:29:06.531471 31645 acceptor_pool.cc:254] collecting diagnostics on the listening RPC socket unix:/tmp/dist-test-taskf0znoS/test-tmp/rpc-test-1ef6f65c7b19470ba5b3124614c9f57a.sock every 8 connection(s)
W20260924 14:29:06.708153 31641 connection.cc:196] Error closing socket: Network error: TlsSocket::Close: Broken pipe
[ OK ] Parameters/TestRpc.TestMaxSmallSidecars/SSL_UnixSocket (212 ms)
[ RUN ] Parameters/TestRpc.TestCallTimeout/SSL_UnixSocket
I20260924 14:29:06.735939 31669 acceptor_pool.cc:254] collecting diagnostics on the listening RPC socket unix:/tmp/dist-test-taskf0znoS/test-tmp/rpc-test-1b9606b40c234200940431d7d42be394.sock every 8 connection(s)
I20260924 14:29:06.736725 31670 acceptor_pool.cc:254] collecting diagnostics on the listening RPC socket unix:/tmp/dist-test-taskf0znoS/test-tmp/rpc-test-1b9606b40c234200940431d7d42be394.sock every 8 connection(s)
I20260924 14:29:06.753793 31352 rpc-test-base.h:595] status: Timed out: connection negotiation to unix:/tmp/dist-test-taskf0znoS/test-tmp/rpc-test-1b9606b40c234200940431d7d42be394.sock for RPC Sleep timed out after 0.000s (ON_OUTBOUND_QUEUE), seconds elapsed: 0.00283941
I20260924 14:29:06.760951 31673 rpc-test-base.h:222] got call: sleep_micros: 700000
I20260924 14:29:06.954594 31352 rpc-test-base.h:595] status: Timed out: Sleep RPC to unix:/tmp/dist-test-taskf0znoS/test-tmp/rpc-test-1b9606b40c234200940431d7d42be394.sock timed out after 0.200s (SENT), seconds elapsed: 0.200465
I20260924 14:29:06.956140 31672 rpc-test-base.h:222] got call: sleep_micros: 2000000
W20260924 14:29:07.461560 31673 rpcz_store.cc:267] Call kudu.rpc.GenericCalculatorService.Sleep from unix:<unnamed> (request call id 1) took 700 ms (client timeout 200 ms). Trace:
W20260924 14:29:07.461966 31673 rpcz_store.cc:269] 0924 14:29:06.760811 (+ 0us) service_pool.cc:170] Inserting onto call queue
0924 14:29:06.760909 (+ 98us) service_pool.cc:227] Handling call
0924 14:29:07.461502 (+700593us) inbound_call.cc:173] Queueing success response
Metrics: {}
I20260924 14:29:08.456970 31352 rpc-test-base.h:595] status: Timed out: Sleep RPC to unix:/tmp/dist-test-taskf0znoS/test-tmp/rpc-test-1b9606b40c234200940431d7d42be394.sock timed out after 1.500s (SENT), seconds elapsed: 1.50202
W20260924 14:29:08.956825 31672 rpcz_store.cc:267] Call kudu.rpc.GenericCalculatorService.Sleep from unix:<unnamed> (request call id 2) took 2001 ms (client timeout 1500 ms). Trace:
W20260924 14:29:08.957160 31672 rpcz_store.cc:269] 0924 14:29:06.955864 (+ 0us) service_pool.cc:170] Inserting onto call queue
0924 14:29:06.955991 (+ 127us) service_pool.cc:227] Handling call
0924 14:29:08.956767 (+2000776us) inbound_call.cc:173] Queueing success response
Metrics: {}
W20260924 14:29:08.957754 31666 connection.cc:441] server connection from unix:<unnamed> torn down before Call kudu.rpc.GenericCalculatorService.Sleep from unix:<unnamed> (request call id 2) could send its response
[ OK ] Parameters/TestRpc.TestCallTimeout/SSL_UnixSocket (2249 ms)
[ RUN ] Parameters/TestRpc.TestServerShutsDown/SSL_UnixSocket
I20260924 14:29:08.964944 31352 rpc-test.cc:1125] Connecting to 0.0.0.0:45053
W20260924 14:29:08.980794 31686 negotiation.cc:337] Failed RPC negotiation. Trace:
0924 14:29:08.979268 (+ 0us) reactor.cc:625] Submitting negotiation task for client connection to 0.0.0.0:45053 (local address 127.0.0.1:44746)
0924 14:29:08.979730 (+ 462us) negotiation.cc:107] Waiting for socket to connect
0924 14:29:08.979761 (+ 31us) client_negotiation.cc:174] Beginning negotiation
0924 14:29:08.979995 (+ 234us) client_negotiation.cc:252] Sending NEGOTIATE NegotiatePB request
0924 14:29:08.980207 (+ 212us) negotiation.cc:327] Negotiation complete: Network error: Client connection negotiation failed: client connection to 0.0.0.0:45053: BlockingWrite error: write error: Broken pipe (error 32)
Metrics: {"client-negotiator.queue_time_us":122}
[ OK ] Parameters/TestRpc.TestServerShutsDown/SSL_UnixSocket (20 ms)
[ RUN ] Parameters/TestRpc.TimedOutOnResponseMetric/SSL_UnixSocket
I20260924 14:29:09.005960 31704 acceptor_pool.cc:254] collecting diagnostics on the listening RPC socket unix:/tmp/dist-test-taskf0znoS/test-tmp/rpc-test-f310b1853196454c9f8e179417b6810e.sock every 8 connection(s)
I20260924 14:29:09.006677 31705 acceptor_pool.cc:254] collecting diagnostics on the listening RPC socket unix:/tmp/dist-test-taskf0znoS/test-tmp/rpc-test-f310b1853196454c9f8e179417b6810e.sock every 8 connection(s)
W20260924 14:29:09.247056 31708 rpcz_store.cc:267] Call kudu.rpc_test.CalculatorService.Sleep from unix:<unnamed> (request call id 3) took 50 ms (client timeout 25 ms). Trace:
W20260924 14:29:09.247339 31708 rpcz_store.cc:269] 0924 14:29:09.196401 (+ 0us) service_pool.cc:170] Inserting onto call queue
0924 14:29:09.196522 (+ 121us) service_pool.cc:227] Handling call
0924 14:29:09.246983 (+ 50461us) inbound_call.cc:173] Queueing success response
Related trace 'test_child':
Metrics: {"test_sleep_us":50000,"child_traces":[["test_child",{"related_trace_metric":1}]]}
W20260924 14:29:09.306100 31708 rpcz_store.cc:267] Call kudu.rpc_test.CalculatorService.Sleep from unix:<unnamed> (request call id 4) took 50 ms (client timeout 50 ms). Trace:
W20260924 14:29:09.306399 31708 rpcz_store.cc:269] 0924 14:29:09.255573 (+ 0us) service_pool.cc:170] Inserting onto call queue
0924 14:29:09.255688 (+ 115us) service_pool.cc:227] Handling call
0924 14:29:09.306035 (+ 50347us) inbound_call.cc:173] Queueing success response
Related trace 'test_child':
Metrics: {"test_sleep_us":50000,"child_traces":[["test_child",{"related_trace_metric":1}]]}
[ OK ] Parameters/TestRpc.TimedOutOnResponseMetric/SSL_UnixSocket (331 ms)
[ RUN ] Parameters/TestRpc.AcceptorDispatchingTimesMetric/SSL_UnixSocket
I20260924 14:29:09.326342 31730 acceptor_pool.cc:254] collecting diagnostics on the listening RPC socket 0.0.0.0:35001 every 8 connection(s)
I20260924 14:29:09.327005 31731 acceptor_pool.cc:254] collecting diagnostics on the listening RPC socket 0.0.0.0:35001 every 8 connection(s)
W20260924 14:29:09.332882 31726 negotiation.cc:337] Failed RPC negotiation. Trace:
0924 14:29:09.330674 (+ 0us) reactor.cc:625] Submitting negotiation task for server connection from 127.0.0.1:50954 (local address 127.0.0.1:35001)
0924 14:29:09.331369 (+ 695us) server_negotiation.cc:206] Beginning negotiation
0924 14:29:09.331391 (+ 22us) server_negotiation.cc:399] Waiting for connection header
0924 14:29:09.331727 (+ 336us) negotiation.cc:327] Negotiation complete: Network error: Server connection negotiation failed: server connection from 127.0.0.1:50954: BlockingRecv error: recv got EOF from 127.0.0.1:50954 (error 108)
Metrics: {"server-negotiator.queue_time_us":154}
[ OK ] Parameters/TestRpc.AcceptorDispatchingTimesMetric/SSL_UnixSocket (21 ms)
[ RUN ] Parameters/TestRpc.TestRpcCallbackDestroysMessenger/SSL_UnixSocket
[ OK ] Parameters/TestRpc.TestRpcCallbackDestroysMessenger/SSL_UnixSocket (20 ms)
[ RUN ] Parameters/TestRpc.TestApplicationFeatureFlag/SSL_UnixSocket
I20260924 14:29:09.389241 31755 acceptor_pool.cc:254] collecting diagnostics on the listening RPC socket unix:/tmp/dist-test-taskf0znoS/test-tmp/rpc-test-bee87180f75340c6826997e9adabbd75.sock every 8 connection(s)
I20260924 14:29:09.389991 31756 acceptor_pool.cc:254] collecting diagnostics on the listening RPC socket unix:/tmp/dist-test-taskf0znoS/test-tmp/rpc-test-bee87180f75340c6826997e9adabbd75.sock every 8 connection(s)
W20260924 14:29:09.435722 31752 messenger.cc:357] Unable to handle RPC call: Not implemented: call requires unsupported application feature flags: 99
[ OK ] Parameters/TestRpc.TestApplicationFeatureFlag/SSL_UnixSocket (86 ms)
[ RUN ] Parameters/TestRpc.TestCancellation/SSL_UnixSocket
I20260924 14:29:09.458556 31780 acceptor_pool.cc:254] collecting diagnostics on the listening RPC socket unix:/tmp/dist-test-taskf0znoS/test-tmp/rpc-test-b6cc87a4de0c4e0a936882e9e61477d6.sock every 8 connection(s)
I20260924 14:29:09.459287 31781 acceptor_pool.cc:254] collecting diagnostics on the listening RPC socket unix:/tmp/dist-test-taskf0znoS/test-tmp/rpc-test-b6cc87a4de0c4e0a936882e9e61477d6.sock every 8 connection(s)
I20260924 14:29:09.462486 31352 rpc-test.cc:1648] Connecting to unix:/tmp/dist-test-taskf0znoS/test-tmp/rpc-test-b6cc87a4de0c4e0a936882e9e61477d6.sock
I20260924 14:29:09.580782 31352 rpc-test-base.h:595] status: Aborted: Sleep RPC to unix:/tmp/dist-test-taskf0znoS/test-tmp/rpc-test-b6cc87a4de0c4e0a936882e9e61477d6.sock is cancelled in state READY, seconds elapsed: 0.000398814
I20260924 14:29:09.784513 31352 rpc-test-base.h:595] status: Aborted: Sleep RPC to unix:/tmp/dist-test-taskf0znoS/test-tmp/rpc-test-b6cc87a4de0c4e0a936882e9e61477d6.sock is cancelled in state SENT, seconds elapsed: 0.000853652
I20260924 14:29:09.784711 31783 rpc-test-base.h:222] got call: sleep_micros: 510000
I20260924 14:29:09.962422 31352 rpc-test-base.h:595] status: Aborted: Sleep RPC to unix:/tmp/dist-test-taskf0znoS/test-tmp/rpc-test-b6cc87a4de0c4e0a936882e9e61477d6.sock is cancelled in state SENT, seconds elapsed: 0.000655882
I20260924 14:29:09.962788 31782 rpc-test-base.h:222] got call: sleep_micros: 510000
I20260924 14:29:10.147199 31352 rpc-test-base.h:595] status: Aborted: Sleep RPC to unix:/tmp/dist-test-taskf0znoS/test-tmp/rpc-test-b6cc87a4de0c4e0a936882e9e61477d6.sock is cancelled in state SENT, seconds elapsed: 0.000827346
W20260924 14:29:10.159107 31784 rpcz_store.cc:267] Call kudu.rpc.GenericCalculatorService.Sleep from unix:<unnamed> (request call id 11) took 11 ms (client timeout 10 ms). Trace:
W20260924 14:29:10.159368 31784 rpcz_store.cc:269] 0924 14:29:10.147189 (+ 0us) service_pool.cc:170] Inserting onto call queue
0924 14:29:10.158885 (+ 11696us) service_pool.cc:214] Skipping call since client already timed out
0924 14:29:10.158967 (+ 82us) inbound_call.cc:173] Queueing failure response
Metrics: {}
I20260924 14:29:10.159849 31784 rpc-test-base.h:222] got call: sleep_micros: 1500000
W20260924 14:29:10.295344 31783 rpcz_store.cc:267] Call kudu.rpc.GenericCalculatorService.Sleep from unix:<unnamed> (request call id 3) took 510 ms (client timeout 10 ms). Trace:
W20260924 14:29:10.295637 31783 rpcz_store.cc:269] 0924 14:29:09.784534 (+ 0us) service_pool.cc:170] Inserting onto call queue
0924 14:29:09.784667 (+ 133us) service_pool.cc:227] Handling call
0924 14:29:10.295289 (+510622us) inbound_call.cc:173] Queueing success response
Metrics: {}
W20260924 14:29:10.473343 31782 rpcz_store.cc:267] Call kudu.rpc.GenericCalculatorService.Sleep from unix:<unnamed> (request call id 7) took 510 ms (client timeout 10 ms). Trace:
W20260924 14:29:10.473664 31782 rpcz_store.cc:269] 0924 14:29:09.962590 (+ 0us) service_pool.cc:170] Inserting onto call queue
0924 14:29:09.962728 (+ 138us) service_pool.cc:227] Handling call
0924 14:29:10.473285 (+510557us) inbound_call.cc:173] Queueing success response
Metrics: {}
I20260924 14:29:11.149730 31352 rpc-test-base.h:595] status: Timed out: Sleep RPC to unix:/tmp/dist-test-taskf0znoS/test-tmp/rpc-test-b6cc87a4de0c4e0a936882e9e61477d6.sock timed out after 1.000s (SENT), seconds elapsed: 1.002
I20260924 14:29:11.151738 31782 rpc-test-base.h:222] got call: sleep_micros: 1500000
W20260924 14:29:11.660550 31784 rpcz_store.cc:267] Call kudu.rpc.GenericCalculatorService.Sleep from unix:<unnamed> (request call id 12) took 1512 ms (client timeout 1000 ms). Trace:
W20260924 14:29:11.660884 31784 rpcz_store.cc:269] 0924 14:29:10.148235 (+ 0us) service_pool.cc:170] Inserting onto call queue
0924 14:29:10.159811 (+ 11576us) service_pool.cc:227] Handling call
0924 14:29:11.660387 (+1500576us) inbound_call.cc:173] Queueing success response
Metrics: {}
I20260924 14:29:12.152081 31352 rpc-test-base.h:595] status: Timed out: Sleep RPC to unix:/tmp/dist-test-taskf0znoS/test-tmp/rpc-test-b6cc87a4de0c4e0a936882e9e61477d6.sock timed out after 1.000s (SENT), seconds elapsed: 1.00184
W20260924 14:29:12.153594 31777 messenger.cc:357] Unable to handle RPC call: Not implemented: call requires unsupported application feature flags: 99, 1
W20260924 14:29:12.172806 31777 messenger.cc:357] Unable to handle RPC call: Not implemented: call requires unsupported application feature flags: 99, 1
W20260924 14:29:12.384598 31777 connection.cc:196] Error closing socket: Network error: TlsSocket::Close: Broken pipe
W20260924 14:29:12.652309 31782 rpcz_store.cc:267] Call kudu.rpc.GenericCalculatorService.Sleep from unix:<unnamed> (request call id 13) took 1501 ms (client timeout 1000 ms). Trace:
W20260924 14:29:12.652631 31782 rpcz_store.cc:269] 0924 14:29:11.151391 (+ 0us) service_pool.cc:170] Inserting onto call queue
0924 14:29:11.151594 (+ 203us) service_pool.cc:227] Handling call
0924 14:29:12.652244 (+1500650us) inbound_call.cc:173] Queueing success response
Metrics: {}
W20260924 14:29:12.653156 31777 connection.cc:441] server connection from unix:<unnamed> torn down before Call kudu.rpc.GenericCalculatorService.Sleep from unix:<unnamed> (request call id 13) could send its response
[ OK ] Parameters/TestRpc.TestCancellation/SSL_UnixSocket (3217 ms)
[ RUN ] Parameters/TestRpc.TestCancellationMultiThreads/SSL_UnixSocket
I20260924 14:29:12.684500 31807 acceptor_pool.cc:254] collecting diagnostics on the listening RPC socket unix:/tmp/dist-test-taskf0znoS/test-tmp/rpc-test-c5f6381c32ca484485f66c801e8abf39.sock every 8 connection(s)
I20260924 14:29:12.685417 31808 acceptor_pool.cc:254] collecting diagnostics on the listening RPC socket unix:/tmp/dist-test-taskf0znoS/test-tmp/rpc-test-c5f6381c32ca484485f66c801e8abf39.sock every 8 connection(s)
I20260924 14:29:12.688532 31352 rpc-test.cc:1808] Connecting to unix:/tmp/dist-test-taskf0znoS/test-tmp/rpc-test-c5f6381c32ca484485f66c801e8abf39.sock
I20260924 14:29:12.833531 31821 test_util.cc:268] Using random seed: 1819743624
I20260924 14:29:12.834717 31822 test_util.cc:268] Using random seed: 1819744897
I20260924 14:29:12.836103 31823 test_util.cc:268] Using random seed: 1819746183
I20260924 14:29:12.837463 31824 test_util.cc:268] Using random seed: 1819747618
I20260924 14:29:12.839329 31825 test_util.cc:268] Using random seed: 1819749340
I20260924 14:29:12.840766 31826 test_util.cc:268] Using random seed: 1819750791
I20260924 14:29:12.842562 31827 test_util.cc:268] Using random seed: 1819752590
I20260924 14:29:12.843983 31828 test_util.cc:268] Using random seed: 1819754039
I20260924 14:29:12.845642 31829 test_util.cc:268] Using random seed: 1819755674
I20260924 14:29:12.847028 31830 test_util.cc:268] Using random seed: 1819757078
I20260924 14:29:12.848680 31831 test_util.cc:268] Using random seed: 1819758705
I20260924 14:29:12.850044 31832 test_util.cc:268] Using random seed: 1819760099
I20260924 14:29:12.851655 31833 test_util.cc:268] Using random seed: 1819761678
I20260924 14:29:12.853453 31834 test_util.cc:268] Using random seed: 1819763456
I20260924 14:29:12.855284 31835 test_util.cc:268] Using random seed: 1819765296
I20260924 14:29:12.856848 31836 test_util.cc:268] Using random seed: 1819766883
I20260924 14:29:12.858815 31837 test_util.cc:268] Using random seed: 1819768795
I20260924 14:29:12.860325 31838 test_util.cc:268] Using random seed: 1819770371
I20260924 14:29:12.862164 31839 test_util.cc:268] Using random seed: 1819772148
I20260924 14:29:12.863735 31840 test_util.cc:268] Using random seed: 1819773741
I20260924 14:29:12.865629 31841 test_util.cc:268] Using random seed: 1819775571
I20260924 14:29:12.867486 31842 test_util.cc:268] Using random seed: 1819777477
I20260924 14:29:12.869117 31843 test_util.cc:268] Using random seed: 1819779147
I20260924 14:29:12.871001 31844 test_util.cc:268] Using random seed: 1819780934
I20260924 14:29:12.872641 31845 test_util.cc:268] Using random seed: 1819782623
I20260924 14:29:12.877311 31846 test_util.cc:268] Using random seed: 1819787337
I20260924 14:29:12.879570 31847 test_util.cc:268] Using random seed: 1819789551
I20260924 14:29:12.881451 31848 test_util.cc:268] Using random seed: 1819791447
I20260924 14:29:12.882972 31849 test_util.cc:268] Using random seed: 1819793010
I20260924 14:29:12.885124 31850 test_util.cc:268] Using random seed: 1819795204
W20260924 14:29:32.926270 31804 connection.cc:196] Error closing socket: Network error: TlsSocket::Close: Broken pipe
[ OK ] Parameters/TestRpc.TestCancellationMultiThreads/SSL_UnixSocket (20283 ms)
[ RUN ] Parameters/TestRpc.TestCallId/SSL_UnixSocket
I20260924 14:29:32.968818 31864 acceptor_pool.cc:254] collecting diagnostics on the listening RPC socket unix:/tmp/dist-test-taskf0znoS/test-tmp/rpc-test-5ad8c97df73f432691d60ed891ec3169.sock every 8 connection(s)
I20260924 14:29:32.969743 31865 acceptor_pool.cc:254] collecting diagnostics on the listening RPC socket unix:/tmp/dist-test-taskf0znoS/test-tmp/rpc-test-5ad8c97df73f432691d60ed891ec3169.sock every 8 connection(s)
W20260924 14:29:33.020184 31861 connection.cc:196] Error closing socket: Network error: TlsSocket::Close: Broken pipe
[ OK ] Parameters/TestRpc.TestCallId/SSL_UnixSocket (82 ms)
[----------] 20 tests from Parameters/TestRpc (38813 ms total)
[----------] Global test environment tear-down
[==========] 21 tests from 2 test suites ran. (42051 ms total)
[ PASSED ] 20 tests.
[ FAILED ] 1 test, listed below:
[ FAILED ] Parameters/TestRpc.TestCallWithChainCertAndRootCA/SSL_UnixSocket, where GetParam() = (true, true)
1 FAILED TEST
I20260924 14:29:33.045152 31352 logging.cc:424] LogThrottler /data0/somelongdirectorytoavoidrpathissues/src/kudu/src/kudu/rpc/acceptor_pool.cc:285: suppressed but not reported on 3 messages since previous log ~34 seconds ago