Diagnosed failure

Parameters/TestRpc.TestCallWithChainCertAndRootCA/SSL_UnixSocket: /data0/somelongdirectorytoavoidrpathissues/src/kudu/src/kudu/rpc/rpc-test.cc:303: Failure
Failed
Bad status: Runtime error: could not verify certificate chain (error with cert: subject=CN = localhost, ST = sadfjas, C = AS, emailAddress = sdflkdsajf, O = lskdfjlsad, OU = sldfkja, issuer=C = AS, ST = ASDfkjdhf, L = lskdjf, O = saldfja, OU = skdjf, CN = localhost, emailAddress = sadjflkadsj): : certificate has expired
Google Test trace:
/data0/somelongdirectorytoavoidrpathissues/src/kudu/src/kudu/rpc/rpc-test.cc:300: Connecting to unix:/tmp/dist-test-task2ifmkk/test-tmp/rpc-test-98e0b03dc39c41faa7c263120d7eaf60.sock
I20260926 12:10:31.814743   811 test_util.cc:175] -----------------------------------------------
I20260926 12:10:31.814920   811 test_util.cc:176] Had fatal failures, leaving test files at /tmp/dist-test-task2ifmkk/test-tmp/rpc-test.2.Parameters_TestRpc.TestCallWithChainCertAndRootCA_SSL_UnixSocket.1790424628371341-811-0

Full log

Note: This is test shard 3 of 8.
[==========] Running 21 tests from 2 test suites.
[----------] Global test environment set-up.
[----------] 1 test from TestRpc
[ RUN      ] TestRpc.TestNegotiationTimeout
WARNING: Logging before InitGoogleLogging() is written to STDERR
I20260926 12:10:28.559054   811 rpc-test-base.h:595] status: Timed out: connection negotiation to 0.0.0.0:44669 for RPC Sleep timed out after 0.100s (ON_OUTBOUND_QUEUE), seconds elapsed: 0.101288
W20260926 12:10:31.515322   821 negotiation.cc:337] Failed RPC negotiation. Trace:
0926 12:10:28.459050 (+     0us) reactor.cc:625] Submitting negotiation task for client connection to 0.0.0.0:44669 (local address 127.0.0.1:49304)
0926 12:10:28.459957 (+   907us) negotiation.cc:107] Waiting for socket to connect
0926 12:10:28.460036 (+    79us) client_negotiation.cc:174] Beginning negotiation
0926 12:10:28.472875 (+ 12839us) client_negotiation.cc:252] Sending NEGOTIATE NegotiatePB request
0926 12:10:31.514209 (+3041334us) negotiation.cc:327] Negotiation complete: Timed out: Client connection negotiation failed: client connection to 0.0.0.0:44669: received 0 of 4 requested bytes
Metrics: {"client-negotiator.queue_time_us":288}
[       OK ] TestRpc.TestNegotiationTimeout (3097 ms)
[----------] 1 test from TestRpc (3097 ms total)

[----------] 20 tests from Parameters/TestRpc
[ RUN      ] Parameters/TestRpc.TestAcceptorPoolStartStop/SSL_UnixSocket
I20260926 12:10:31.550100   837 acceptor_pool.cc:254] collecting diagnostics on the listening RPC socket unix:/tmp/dist-test-task2ifmkk/test-tmp/rpc-test-7ecc95d1098b4a20a5a394e42a1143f7.sock every 8 connection(s)
I20260926 12:10:31.552124   838 acceptor_pool.cc:254] collecting diagnostics on the listening RPC socket unix:/tmp/dist-test-task2ifmkk/test-tmp/rpc-test-7ecc95d1098b4a20a5a394e42a1143f7.sock every 8 connection(s)
I20260926 12:10:31.593685   848 acceptor_pool.cc:254] collecting diagnostics on the listening RPC socket unix:/tmp/dist-test-task2ifmkk/test-tmp/rpc-test-7ecc95d1098b4a20a5a394e42a1143f7.sock every 8 connection(s)
I20260926 12:10:31.595098   849 acceptor_pool.cc:254] collecting diagnostics on the listening RPC socket unix:/tmp/dist-test-task2ifmkk/test-tmp/rpc-test-7ecc95d1098b4a20a5a394e42a1143f7.sock every 8 connection(s)
I20260926 12:10:31.626268   859 acceptor_pool.cc:254] collecting diagnostics on the listening RPC socket unix:/tmp/dist-test-task2ifmkk/test-tmp/rpc-test-7ecc95d1098b4a20a5a394e42a1143f7.sock every 8 connection(s)
I20260926 12:10:31.626964   860 acceptor_pool.cc:254] collecting diagnostics on the listening RPC socket unix:/tmp/dist-test-task2ifmkk/test-tmp/rpc-test-7ecc95d1098b4a20a5a394e42a1143f7.sock every 8 connection(s)
I20260926 12:10:31.657078   870 acceptor_pool.cc:254] collecting diagnostics on the listening RPC socket unix:/tmp/dist-test-task2ifmkk/test-tmp/rpc-test-7ecc95d1098b4a20a5a394e42a1143f7.sock every 8 connection(s)
I20260926 12:10:31.657887   871 acceptor_pool.cc:254] collecting diagnostics on the listening RPC socket unix:/tmp/dist-test-task2ifmkk/test-tmp/rpc-test-7ecc95d1098b4a20a5a394e42a1143f7.sock every 8 connection(s)
I20260926 12:10:31.678893   881 acceptor_pool.cc:254] collecting diagnostics on the listening RPC socket unix:/tmp/dist-test-task2ifmkk/test-tmp/rpc-test-7ecc95d1098b4a20a5a394e42a1143f7.sock every 8 connection(s)
I20260926 12:10:31.679613   882 acceptor_pool.cc:254] collecting diagnostics on the listening RPC socket unix:/tmp/dist-test-task2ifmkk/test-tmp/rpc-test-7ecc95d1098b4a20a5a394e42a1143f7.sock every 8 connection(s)
[       OK ] Parameters/TestRpc.TestAcceptorPoolStartStop/SSL_UnixSocket (163 ms)
[ RUN      ] Parameters/TestRpc.TestCall/SSL_UnixSocket
I20260926 12:10:31.700251   894 acceptor_pool.cc:254] collecting diagnostics on the listening RPC socket unix:/tmp/dist-test-task2ifmkk/test-tmp/rpc-test-9d54179b2c404465a43727becee1a7b9.sock every 8 connection(s)
I20260926 12:10:31.702301   895 acceptor_pool.cc:254] collecting diagnostics on the listening RPC socket unix:/tmp/dist-test-task2ifmkk/test-tmp/rpc-test-9d54179b2c404465a43727becee1a7b9.sock every 8 connection(s)
I20260926 12:10:31.707393   811 rpc-test.cc:234] Connecting to unix:/tmp/dist-test-task2ifmkk/test-tmp/rpc-test-9d54179b2c404465a43727becee1a7b9.sock
W20260926 12:10:31.765040   891 connection.cc:196] Error closing socket: Network error: TlsSocket::Close: Broken pipe
[       OK ] Parameters/TestRpc.TestCall/SSL_UnixSocket (86 ms)
[ RUN      ] Parameters/TestRpc.TestCallWithChainCertAndRootCA/SSL_UnixSocket
I20260926 12:10:31.793103   919 acceptor_pool.cc:254] collecting diagnostics on the listening RPC socket unix:/tmp/dist-test-task2ifmkk/test-tmp/rpc-test-98e0b03dc39c41faa7c263120d7eaf60.sock every 8 connection(s)
I20260926 12:10:31.793849   920 acceptor_pool.cc:254] collecting diagnostics on the listening RPC socket unix:/tmp/dist-test-task2ifmkk/test-tmp/rpc-test-98e0b03dc39c41faa7c263120d7eaf60.sock every 8 connection(s)
/data0/somelongdirectorytoavoidrpathissues/src/kudu/src/kudu/rpc/rpc-test.cc:303: Failure
Failed
Bad status: Runtime error: could not verify certificate chain (error with cert: subject=CN = localhost, ST = sadfjas, C = AS, emailAddress = sdflkdsajf, O = lskdfjlsad, OU = sldfkja, issuer=C = AS, ST = ASDfkjdhf, L = lskdjf, O = saldfja, OU = skdjf, CN = localhost, emailAddress = sadjflkadsj): : certificate has expired
Google Test trace:
/data0/somelongdirectorytoavoidrpathissues/src/kudu/src/kudu/rpc/rpc-test.cc:300: Connecting to unix:/tmp/dist-test-task2ifmkk/test-tmp/rpc-test-98e0b03dc39c41faa7c263120d7eaf60.sock
I20260926 12:10:31.814743   811 test_util.cc:175] -----------------------------------------------
I20260926 12:10:31.814920   811 test_util.cc:176] Had fatal failures, leaving test files at /tmp/dist-test-task2ifmkk/test-tmp/rpc-test.2.Parameters_TestRpc.TestCallWithChainCertAndRootCA_SSL_UnixSocket.1790424628371341-811-0
[  FAILED  ] Parameters/TestRpc.TestCallWithChainCertAndRootCA/SSL_UnixSocket, where GetParam() = (true, true) (44 ms)
[ RUN      ] Parameters/TestRpc.TestCallWithBadPasswordProtectedKey/SSL_UnixSocket
[       OK ] Parameters/TestRpc.TestCallWithBadPasswordProtectedKey/SSL_UnixSocket (31 ms)
[ RUN      ] Parameters/TestRpc.TestInvalidMethodCall/SSL_UnixSocket
I20260926 12:10:31.881145   956 acceptor_pool.cc:254] collecting diagnostics on the listening RPC socket unix:/tmp/dist-test-task2ifmkk/test-tmp/rpc-test-eb4fa02815be47a0b3e4e69dc81232c6.sock every 8 connection(s)
I20260926 12:10:31.882030   957 acceptor_pool.cc:254] collecting diagnostics on the listening RPC socket unix:/tmp/dist-test-task2ifmkk/test-tmp/rpc-test-eb4fa02815be47a0b3e4e69dc81232c6.sock every 8 connection(s)
I20260926 12:10:31.885397   811 rpc-test.cc:406] Connecting to unix:/tmp/dist-test-task2ifmkk/test-tmp/rpc-test-eb4fa02815be47a0b3e4e69dc81232c6.sock
W20260926 12:10:31.919497   953 connection.cc:196] Error closing socket: Network error: TlsSocket::Close: Broken pipe
[       OK ] Parameters/TestRpc.TestInvalidMethodCall/SSL_UnixSocket (78 ms)
[ RUN      ] Parameters/TestRpc.TestHighFDs/SSL_UnixSocket
I20260926 12:10:32.137718   981 acceptor_pool.cc:254] collecting diagnostics on the listening RPC socket unix:/tmp/dist-test-task2ifmkk/test-tmp/rpc-test-0a03f423e147453fa4189d2c978086fd.sock every 8 connection(s)
I20260926 12:10:32.138476   982 acceptor_pool.cc:254] collecting diagnostics on the listening RPC socket unix:/tmp/dist-test-task2ifmkk/test-tmp/rpc-test-0a03f423e147453fa4189d2c978086fd.sock every 8 connection(s)
[       OK ] Parameters/TestRpc.TestHighFDs/SSL_UnixSocket (257 ms)
[ RUN      ] Parameters/TestRpc.TestConnectionAlwaysKeepalive/SSL_UnixSocket
I20260926 12:10:32.211794  1004 acceptor_pool.cc:254] collecting diagnostics on the listening RPC socket unix:/tmp/dist-test-task2ifmkk/test-tmp/rpc-test-d66ed62df3d640138782c239ddc1c76d.sock every 8 connection(s)
I20260926 12:10:32.212627  1005 acceptor_pool.cc:254] collecting diagnostics on the listening RPC socket unix:/tmp/dist-test-task2ifmkk/test-tmp/rpc-test-d66ed62df3d640138782c239ddc1c76d.sock every 8 connection(s)
I20260926 12:10:32.215737   811 rpc-test.cc:532] Connecting to unix:/tmp/dist-test-task2ifmkk/test-tmp/rpc-test-d66ed62df3d640138782c239ddc1c76d.sock
[       OK ] Parameters/TestRpc.TestConnectionAlwaysKeepalive/SSL_UnixSocket (3084 ms)
[ RUN      ] Parameters/TestRpc.TestReopenOutboundConnections/SSL_UnixSocket
I20260926 12:10:35.297591  1027 acceptor_pool.cc:254] collecting diagnostics on the listening RPC socket unix:/tmp/dist-test-task2ifmkk/test-tmp/rpc-test-9985663bee5b4c2996cbae72f5131213.sock every 8 connection(s)
I20260926 12:10:35.298300  1028 acceptor_pool.cc:254] collecting diagnostics on the listening RPC socket unix:/tmp/dist-test-task2ifmkk/test-tmp/rpc-test-9985663bee5b4c2996cbae72f5131213.sock every 8 connection(s)
I20260926 12:10:35.301208   811 rpc-test.cc:658] Connecting to unix:/tmp/dist-test-task2ifmkk/test-tmp/rpc-test-9985663bee5b4c2996cbae72f5131213.sock
W20260926 12:10:35.337692  1026 connection.cc:196] Error closing socket: Network error: TlsSocket::Close: Broken pipe
W20260926 12:10:35.346479  1026 connection.cc:196] Error closing socket: Network error: TlsSocket::Close: Broken pipe
W20260926 12:10:35.355293  1026 connection.cc:196] Error closing socket: Network error: TlsSocket::Close: Broken pipe
W20260926 12:10:35.364473  1026 connection.cc:196] Error closing socket: Network error: TlsSocket::Close: Broken pipe
W20260926 12:10:35.373103  1026 connection.cc:196] Error closing socket: Network error: TlsSocket::Close: Broken pipe
W20260926 12:10:35.382026  1026 connection.cc:196] Error closing socket: Network error: TlsSocket::Close: Broken pipe
W20260926 12:10:35.390951  1026 connection.cc:196] Error closing socket: Network error: TlsSocket::Close: Broken pipe
W20260926 12:10:35.399967  1026 connection.cc:196] Error closing socket: Network error: TlsSocket::Close: Broken pipe
W20260926 12:10:35.409016  1026 connection.cc:196] Error closing socket: Network error: TlsSocket::Close: Broken pipe
W20260926 12:10:35.418263  1026 connection.cc:196] Error closing socket: Network error: TlsSocket::Close: Broken pipe
W20260926 12:10:35.427217  1026 connection.cc:196] Error closing socket: Network error: TlsSocket::Close: Broken pipe
W20260926 12:10:35.435757  1026 connection.cc:196] Error closing socket: Network error: TlsSocket::Close: Broken pipe
W20260926 12:10:35.444599  1026 connection.cc:196] Error closing socket: Network error: TlsSocket::Close: Broken pipe
W20260926 12:10:35.453768  1026 connection.cc:196] Error closing socket: Network error: TlsSocket::Close: Broken pipe
W20260926 12:10:35.453882  1027 acceptor_pool.cc:285] unable to collect diagnostics on RPC socket unix:/tmp/dist-test-task2ifmkk/test-tmp/rpc-test-9985663bee5b4c2996cbae72f5131213.sock: Not implemented: netlink diagnostics is currently supported only on IPv4 TCP sockets
W20260926 12:10:35.463361  1026 connection.cc:196] Error closing socket: Network error: TlsSocket::Close: Broken pipe
W20260926 12:10:35.472460  1026 connection.cc:196] Error closing socket: Network error: TlsSocket::Close: Broken pipe
W20260926 12:10:35.481617  1026 connection.cc:196] Error closing socket: Network error: TlsSocket::Close: Broken pipe
W20260926 12:10:35.491031  1026 connection.cc:196] Error closing socket: Network error: TlsSocket::Close: Broken pipe
W20260926 12:10:35.500021  1026 connection.cc:196] Error closing socket: Network error: TlsSocket::Close: Broken pipe
W20260926 12:10:35.508677  1026 connection.cc:196] Error closing socket: Network error: TlsSocket::Close: Broken pipe
W20260926 12:10:35.517846  1026 connection.cc:196] Error closing socket: Network error: TlsSocket::Close: Broken pipe
W20260926 12:10:35.526866  1026 connection.cc:196] Error closing socket: Network error: TlsSocket::Close: Broken pipe
W20260926 12:10:35.535883  1026 connection.cc:196] Error closing socket: Network error: TlsSocket::Close: Broken pipe
W20260926 12:10:35.545794  1026 connection.cc:196] Error closing socket: Network error: TlsSocket::Close: Broken pipe
W20260926 12:10:35.556038  1026 connection.cc:196] Error closing socket: Network error: TlsSocket::Close: Broken pipe
W20260926 12:10:35.565730  1026 connection.cc:196] Error closing socket: Network error: TlsSocket::Close: Broken pipe
W20260926 12:10:35.574379  1026 connection.cc:196] Error closing socket: Network error: TlsSocket::Close: Broken pipe
W20260926 12:10:35.583952  1026 connection.cc:196] Error closing socket: Network error: TlsSocket::Close: Broken pipe
W20260926 12:10:35.592975  1026 connection.cc:196] Error closing socket: Network error: TlsSocket::Close: Broken pipe
W20260926 12:10:35.602010  1026 connection.cc:196] Error closing socket: Network error: TlsSocket::Close: Broken pipe
W20260926 12:10:35.611116  1026 connection.cc:196] Error closing socket: Network error: TlsSocket::Close: Broken pipe
W20260926 12:10:35.622826  1026 connection.cc:196] Error closing socket: Network error: TlsSocket::Close: Broken pipe
[       OK ] Parameters/TestRpc.TestReopenOutboundConnections/SSL_UnixSocket (359 ms)
[ RUN      ] Parameters/TestRpc.TestConnectionNetworkPlane/SSL_UnixSocket
I20260926 12:10:35.650810  1050 acceptor_pool.cc:254] collecting diagnostics on the listening RPC socket unix:/tmp/dist-test-task2ifmkk/test-tmp/rpc-test-bd3174fb1c2d43508d3ca6252c12c822.sock every 8 connection(s)
I20260926 12:10:35.651516  1051 acceptor_pool.cc:254] collecting diagnostics on the listening RPC socket unix:/tmp/dist-test-task2ifmkk/test-tmp/rpc-test-bd3174fb1c2d43508d3ca6252c12c822.sock every 8 connection(s)
I20260926 12:10:35.654592   811 rpc-test.cc:772] Connecting to unix:/tmp/dist-test-task2ifmkk/test-tmp/rpc-test-bd3174fb1c2d43508d3ca6252c12c822.sock
W20260926 12:10:35.694054  1049 connection.cc:196] Error closing socket: Network error: TlsSocket::Close: Broken pipe
W20260926 12:10:35.694936  1049 connection.cc:196] Error closing socket: Network error: TlsSocket::Close: Broken pipe
[       OK ] Parameters/TestRpc.TestConnectionNetworkPlane/SSL_UnixSocket (72 ms)
[ RUN      ] Parameters/TestRpc.TestTCPKeepalive/SSL_UnixSocket
I20260926 12:10:35.713889  1075 acceptor_pool.cc:254] collecting diagnostics on the listening RPC socket unix:/tmp/dist-test-task2ifmkk/test-tmp/rpc-test-d12c7f59ff8d47a595ba418dab7ebaea.sock every 8 connection(s)
I20260926 12:10:35.714660  1076 acceptor_pool.cc:254] collecting diagnostics on the listening RPC socket unix:/tmp/dist-test-task2ifmkk/test-tmp/rpc-test-d12c7f59ff8d47a595ba418dab7ebaea.sock every 8 connection(s)
I20260926 12:10:35.746501  1079 rpc-test-base.h:222] got call: sleep_micros: 8000000 deferred: true
I20260926 12:10:43.750514  1079 rpcz_store.cc:275] Call kudu.rpc.GenericCalculatorService.Sleep from unix:<unnamed> (request call id 0) took 8004 ms. Trace:
I20260926 12:10:43.750960  1079 rpcz_store.cc:276] 0926 12:10:35.746349 (+     0us) service_pool.cc:170] Inserting onto call queue
0926 12:10:35.746452 (+   103us) service_pool.cc:227] Handling call
0926 12:10:43.750350 (+8003898us) inbound_call.cc:173] Queueing success response
Metrics: {}
W20260926 12:10:43.756930  1072 connection.cc:196] Error closing socket: Network error: TlsSocket::Close: Broken pipe
[       OK ] Parameters/TestRpc.TestTCPKeepalive/SSL_UnixSocket (8065 ms)
[ RUN      ] Parameters/TestRpc.TestMaxSmallSidecars/SSL_UnixSocket
I20260926 12:10:43.790817  1101 acceptor_pool.cc:254] collecting diagnostics on the listening RPC socket unix:/tmp/dist-test-task2ifmkk/test-tmp/rpc-test-362b962d3a1241fa836295f8f6719312.sock every 8 connection(s)
I20260926 12:10:43.791667  1102 acceptor_pool.cc:254] collecting diagnostics on the listening RPC socket unix:/tmp/dist-test-task2ifmkk/test-tmp/rpc-test-362b962d3a1241fa836295f8f6719312.sock every 8 connection(s)
W20260926 12:10:43.970058  1098 connection.cc:196] Error closing socket: Network error: TlsSocket::Close: Broken pipe
[       OK ] Parameters/TestRpc.TestMaxSmallSidecars/SSL_UnixSocket (210 ms)
[ RUN      ] Parameters/TestRpc.TestCallTimeout/SSL_UnixSocket
I20260926 12:10:43.999569  1126 acceptor_pool.cc:254] collecting diagnostics on the listening RPC socket unix:/tmp/dist-test-task2ifmkk/test-tmp/rpc-test-69ffab330d2f49c993e6b493a4d24fb0.sock every 8 connection(s)
I20260926 12:10:44.000202  1127 acceptor_pool.cc:254] collecting diagnostics on the listening RPC socket unix:/tmp/dist-test-task2ifmkk/test-tmp/rpc-test-69ffab330d2f49c993e6b493a4d24fb0.sock every 8 connection(s)
I20260926 12:10:44.018005   811 rpc-test-base.h:595] status: Timed out: connection negotiation to unix:/tmp/dist-test-task2ifmkk/test-tmp/rpc-test-69ffab330d2f49c993e6b493a4d24fb0.sock for RPC Sleep timed out after 0.000s (ON_OUTBOUND_QUEUE), seconds elapsed: 0.00222104
I20260926 12:10:44.025662  1130 rpc-test-base.h:222] got call: sleep_micros: 700000
I20260926 12:10:44.219336   811 rpc-test-base.h:595] status: Timed out: Sleep RPC to unix:/tmp/dist-test-task2ifmkk/test-tmp/rpc-test-69ffab330d2f49c993e6b493a4d24fb0.sock timed out after 0.200s (SENT), seconds elapsed: 0.201009
I20260926 12:10:44.220661  1129 rpc-test-base.h:222] got call: sleep_micros: 2000000
W20260926 12:10:44.726205  1130 rpcz_store.cc:267] Call kudu.rpc.GenericCalculatorService.Sleep from unix:<unnamed> (request call id 1) took 700 ms (client timeout 200 ms). Trace:
W20260926 12:10:44.726502  1130 rpcz_store.cc:269] 0926 12:10:44.025474 (+     0us) service_pool.cc:170] Inserting onto call queue
0926 12:10:44.025619 (+   145us) service_pool.cc:227] Handling call
0926 12:10:44.726158 (+700539us) inbound_call.cc:173] Queueing success response
Metrics: {}
I20260926 12:10:45.722000   811 rpc-test-base.h:595] status: Timed out: Sleep RPC to unix:/tmp/dist-test-task2ifmkk/test-tmp/rpc-test-69ffab330d2f49c993e6b493a4d24fb0.sock timed out after 1.500s (SENT), seconds elapsed: 1.50231
W20260926 12:10:46.221194  1129 rpcz_store.cc:267] Call kudu.rpc.GenericCalculatorService.Sleep from unix:<unnamed> (request call id 2) took 2000 ms (client timeout 1500 ms). Trace:
W20260926 12:10:46.221536  1129 rpcz_store.cc:269] 0926 12:10:44.220487 (+     0us) service_pool.cc:170] Inserting onto call queue
0926 12:10:44.220605 (+   118us) service_pool.cc:227] Handling call
0926 12:10:46.221142 (+2000537us) inbound_call.cc:173] Queueing success response
Metrics: {}
W20260926 12:10:46.222107  1123 connection.cc:441] server connection from unix:<unnamed> torn down before Call kudu.rpc.GenericCalculatorService.Sleep from unix:<unnamed> (request call id 2) could send its response
[       OK ] Parameters/TestRpc.TestCallTimeout/SSL_UnixSocket (2252 ms)
[ RUN      ] Parameters/TestRpc.TestServerShutsDown/SSL_UnixSocket
I20260926 12:10:46.229163   811 rpc-test.cc:1125] Connecting to 0.0.0.0:46257
W20260926 12:10:46.241007  1143 negotiation.cc:337] Failed RPC negotiation. Trace:
0926 12:10:46.239648 (+     0us) reactor.cc:625] Submitting negotiation task for client connection to 0.0.0.0:46257 (local address 127.0.0.1:59366)
0926 12:10:46.240064 (+   416us) negotiation.cc:107] Waiting for socket to connect
0926 12:10:46.240094 (+    30us) client_negotiation.cc:174] Beginning negotiation
0926 12:10:46.240317 (+   223us) client_negotiation.cc:252] Sending NEGOTIATE NegotiatePB request
0926 12:10:46.240526 (+   209us) negotiation.cc:327] Negotiation complete: Network error: Client connection negotiation failed: client connection to 0.0.0.0:46257: BlockingWrite error: write error: Broken pipe (error 32)
Metrics: {"client-negotiator.queue_time_us":107}
[       OK ] Parameters/TestRpc.TestServerShutsDown/SSL_UnixSocket (16 ms)
[ RUN      ] Parameters/TestRpc.TimedOutOnResponseMetric/SSL_UnixSocket
I20260926 12:10:46.262399  1160 acceptor_pool.cc:254] collecting diagnostics on the listening RPC socket unix:/tmp/dist-test-task2ifmkk/test-tmp/rpc-test-6cccd996b7ea489eacfa8d205f639e95.sock every 8 connection(s)
I20260926 12:10:46.263116  1161 acceptor_pool.cc:254] collecting diagnostics on the listening RPC socket unix:/tmp/dist-test-task2ifmkk/test-tmp/rpc-test-6cccd996b7ea489eacfa8d205f639e95.sock every 8 connection(s)
W20260926 12:10:46.509641  1164 rpcz_store.cc:267] Call kudu.rpc_test.CalculatorService.Sleep from unix:<unnamed> (request call id 3) took 50 ms (client timeout 25 ms). Trace:
W20260926 12:10:46.509994  1164 rpcz_store.cc:269] 0926 12:10:46.458976 (+     0us) service_pool.cc:170] Inserting onto call queue
0926 12:10:46.459082 (+   106us) service_pool.cc:227] Handling call
0926 12:10:46.509572 (+ 50490us) inbound_call.cc:173] Queueing success response
Related trace 'test_child':
Metrics: {"test_sleep_us":50000,"child_traces":[["test_child",{"related_trace_metric":1}]]}
W20260926 12:10:46.568600  1164 rpcz_store.cc:267] Call kudu.rpc_test.CalculatorService.Sleep from unix:<unnamed> (request call id 4) took 50 ms (client timeout 50 ms). Trace:
W20260926 12:10:46.568899  1164 rpcz_store.cc:269] 0926 12:10:46.518075 (+     0us) service_pool.cc:170] Inserting onto call queue
0926 12:10:46.518195 (+   120us) service_pool.cc:227] Handling call
0926 12:10:46.568544 (+ 50349us) inbound_call.cc:173] Queueing success response
Related trace 'test_child':
Metrics: {"test_sleep_us":50000,"child_traces":[["test_child",{"related_trace_metric":1}]]}
W20260926 12:10:46.571758  1157 connection.cc:196] Error closing socket: Network error: TlsSocket::Close: Broken pipe
[       OK ] Parameters/TestRpc.TimedOutOnResponseMetric/SSL_UnixSocket (333 ms)
[ RUN      ] Parameters/TestRpc.AcceptorDispatchingTimesMetric/SSL_UnixSocket
I20260926 12:10:46.588914  1185 acceptor_pool.cc:254] collecting diagnostics on the listening RPC socket 0.0.0.0:42107 every 8 connection(s)
I20260926 12:10:46.589581  1186 acceptor_pool.cc:254] collecting diagnostics on the listening RPC socket 0.0.0.0:42107 every 8 connection(s)
W20260926 12:10:46.595697  1181 negotiation.cc:337] Failed RPC negotiation. Trace:
0926 12:10:46.593857 (+     0us) reactor.cc:625] Submitting negotiation task for server connection from 127.0.0.1:39802 (local address 127.0.0.1:42107)
0926 12:10:46.594571 (+   714us) server_negotiation.cc:206] Beginning negotiation
0926 12:10:46.594589 (+    18us) server_negotiation.cc:399] Waiting for connection header
0926 12:10:46.595029 (+   440us) negotiation.cc:327] Negotiation complete: Network error: Server connection negotiation failed: server connection from 127.0.0.1:39802: BlockingRecv error: recv got EOF from 127.0.0.1:39802 (error 108)
Metrics: {"server-negotiator.queue_time_us":170}
[       OK ] Parameters/TestRpc.AcceptorDispatchingTimesMetric/SSL_UnixSocket (21 ms)
[ RUN      ] Parameters/TestRpc.TestRpcCallbackDestroysMessenger/SSL_UnixSocket
[       OK ] Parameters/TestRpc.TestRpcCallbackDestroysMessenger/SSL_UnixSocket (18 ms)
[ RUN      ] Parameters/TestRpc.TestApplicationFeatureFlag/SSL_UnixSocket
I20260926 12:10:46.655279  1210 acceptor_pool.cc:254] collecting diagnostics on the listening RPC socket unix:/tmp/dist-test-task2ifmkk/test-tmp/rpc-test-ec5aca0d1ab540139a2a8cc72c21dd68.sock every 8 connection(s)
I20260926 12:10:46.655977  1211 acceptor_pool.cc:254] collecting diagnostics on the listening RPC socket unix:/tmp/dist-test-task2ifmkk/test-tmp/rpc-test-ec5aca0d1ab540139a2a8cc72c21dd68.sock every 8 connection(s)
W20260926 12:10:46.696790  1207 messenger.cc:357] Unable to handle RPC call: Not implemented: call requires unsupported application feature flags: 99
W20260926 12:10:46.699453  1207 connection.cc:196] Error closing socket: Network error: TlsSocket::Close: Broken pipe
[       OK ] Parameters/TestRpc.TestApplicationFeatureFlag/SSL_UnixSocket (86 ms)
[ RUN      ] Parameters/TestRpc.TestCancellation/SSL_UnixSocket
I20260926 12:10:46.733767  1235 acceptor_pool.cc:254] collecting diagnostics on the listening RPC socket unix:/tmp/dist-test-task2ifmkk/test-tmp/rpc-test-66c9eb34082e4bbfbc6b650f4b8be8db.sock every 8 connection(s)
I20260926 12:10:46.734388  1236 acceptor_pool.cc:254] collecting diagnostics on the listening RPC socket unix:/tmp/dist-test-task2ifmkk/test-tmp/rpc-test-66c9eb34082e4bbfbc6b650f4b8be8db.sock every 8 connection(s)
I20260926 12:10:46.737285   811 rpc-test.cc:1648] Connecting to unix:/tmp/dist-test-task2ifmkk/test-tmp/rpc-test-66c9eb34082e4bbfbc6b650f4b8be8db.sock
I20260926 12:10:46.859884   811 rpc-test-base.h:595] status: Aborted: Sleep RPC to unix:/tmp/dist-test-task2ifmkk/test-tmp/rpc-test-66c9eb34082e4bbfbc6b650f4b8be8db.sock is cancelled in state READY, seconds elapsed: 0.000307654
I20260926 12:10:47.043243   811 rpc-test-base.h:595] status: Aborted: Sleep RPC to unix:/tmp/dist-test-task2ifmkk/test-tmp/rpc-test-66c9eb34082e4bbfbc6b650f4b8be8db.sock is cancelled in state SENT, seconds elapsed: 0.000702044
I20260926 12:10:47.043562  1238 rpc-test-base.h:222] got call: sleep_micros: 510000
I20260926 12:10:47.218041   811 rpc-test-base.h:595] status: Aborted: Sleep RPC to unix:/tmp/dist-test-task2ifmkk/test-tmp/rpc-test-66c9eb34082e4bbfbc6b650f4b8be8db.sock is cancelled in state SENT, seconds elapsed: 0.000663814
I20260926 12:10:47.218364  1237 rpc-test-base.h:222] got call: sleep_micros: 510000
I20260926 12:10:47.403905   811 rpc-test-base.h:595] status: Aborted: Sleep RPC to unix:/tmp/dist-test-task2ifmkk/test-tmp/rpc-test-66c9eb34082e4bbfbc6b650f4b8be8db.sock is cancelled in state SENT, seconds elapsed: 0.000898642
W20260926 12:10:47.415319  1239 rpcz_store.cc:267] Call kudu.rpc.GenericCalculatorService.Sleep from unix:<unnamed> (request call id 11) took 11 ms (client timeout 10 ms). Trace:
W20260926 12:10:47.415616  1239 rpcz_store.cc:269] 0926 12:10:47.403892 (+     0us) service_pool.cc:170] Inserting onto call queue
0926 12:10:47.415109 (+ 11217us) service_pool.cc:214] Skipping call since client already timed out
0926 12:10:47.415180 (+    71us) inbound_call.cc:173] Queueing failure response
Metrics: {}
I20260926 12:10:47.416092  1239 rpc-test-base.h:222] got call: sleep_micros: 1500000
W20260926 12:10:47.554052  1238 rpcz_store.cc:267] Call kudu.rpc.GenericCalculatorService.Sleep from unix:<unnamed> (request call id 3) took 510 ms (client timeout 10 ms). Trace:
W20260926 12:10:47.554337  1238 rpcz_store.cc:269] 0926 12:10:47.043395 (+     0us) service_pool.cc:170] Inserting onto call queue
0926 12:10:47.043508 (+   113us) service_pool.cc:227] Handling call
0926 12:10:47.554005 (+510497us) inbound_call.cc:173] Queueing success response
Metrics: {}
W20260926 12:10:47.728945  1237 rpcz_store.cc:267] Call kudu.rpc.GenericCalculatorService.Sleep from unix:<unnamed> (request call id 7) took 510 ms (client timeout 10 ms). Trace:
W20260926 12:10:47.729287  1237 rpcz_store.cc:269] 0926 12:10:47.218185 (+     0us) service_pool.cc:170] Inserting onto call queue
0926 12:10:47.218316 (+   131us) service_pool.cc:227] Handling call
0926 12:10:47.728895 (+510579us) inbound_call.cc:173] Queueing success response
Metrics: {}
I20260926 12:10:48.406411   811 rpc-test-base.h:595] status: Timed out: Sleep RPC to unix:/tmp/dist-test-task2ifmkk/test-tmp/rpc-test-66c9eb34082e4bbfbc6b650f4b8be8db.sock timed out after 1.000s (SENT), seconds elapsed: 1.00213
I20260926 12:10:48.407624  1237 rpc-test-base.h:222] got call: sleep_micros: 1500000
W20260926 12:10:48.916747  1239 rpcz_store.cc:267] Call kudu.rpc.GenericCalculatorService.Sleep from unix:<unnamed> (request call id 12) took 1511 ms (client timeout 1000 ms). Trace:
W20260926 12:10:48.917140  1239 rpcz_store.cc:269] 0926 12:10:47.404902 (+     0us) service_pool.cc:170] Inserting onto call queue
0926 12:10:47.416051 (+ 11149us) service_pool.cc:227] Handling call
0926 12:10:48.916595 (+1500544us) inbound_call.cc:173] Queueing success response
Metrics: {}
I20260926 12:10:49.408787   811 rpc-test-base.h:595] status: Timed out: Sleep RPC to unix:/tmp/dist-test-task2ifmkk/test-tmp/rpc-test-66c9eb34082e4bbfbc6b650f4b8be8db.sock timed out after 1.000s (SENT), seconds elapsed: 1.00199
W20260926 12:10:49.410400  1232 messenger.cc:357] Unable to handle RPC call: Not implemented: call requires unsupported application feature flags: 99, 1
W20260926 12:10:49.411866  1232 messenger.cc:357] Unable to handle RPC call: Not implemented: call requires unsupported application feature flags: 99, 1
W20260926 12:10:49.646828  1232 connection.cc:196] Error closing socket: Network error: TlsSocket::Close: Broken pipe
W20260926 12:10:49.908216  1237 rpcz_store.cc:267] Call kudu.rpc.GenericCalculatorService.Sleep from unix:<unnamed> (request call id 13) took 1500 ms (client timeout 1000 ms). Trace:
W20260926 12:10:49.908504  1237 rpcz_store.cc:269] 0926 12:10:48.407476 (+     0us) service_pool.cc:170] Inserting onto call queue
0926 12:10:48.407580 (+   104us) service_pool.cc:227] Handling call
0926 12:10:49.908072 (+1500492us) inbound_call.cc:173] Queueing success response
Metrics: {}
W20260926 12:10:49.909060  1232 connection.cc:441] server connection from unix:<unnamed> torn down before Call kudu.rpc.GenericCalculatorService.Sleep from unix:<unnamed> (request call id 13) could send its response
[       OK ] Parameters/TestRpc.TestCancellation/SSL_UnixSocket (3212 ms)
[ RUN      ] Parameters/TestRpc.TestCancellationMultiThreads/SSL_UnixSocket
I20260926 12:10:49.933321  1261 acceptor_pool.cc:254] collecting diagnostics on the listening RPC socket unix:/tmp/dist-test-task2ifmkk/test-tmp/rpc-test-2cbb22defb2a41748b9d7ec7b2b06380.sock every 8 connection(s)
I20260926 12:10:49.934188  1262 acceptor_pool.cc:254] collecting diagnostics on the listening RPC socket unix:/tmp/dist-test-task2ifmkk/test-tmp/rpc-test-2cbb22defb2a41748b9d7ec7b2b06380.sock every 8 connection(s)
I20260926 12:10:49.937150   811 rpc-test.cc:1808] Connecting to unix:/tmp/dist-test-task2ifmkk/test-tmp/rpc-test-2cbb22defb2a41748b9d7ec7b2b06380.sock
I20260926 12:10:50.083691  1275 test_util.cc:268] Using random seed: -1186730763
I20260926 12:10:50.084892  1276 test_util.cc:268] Using random seed: -1186729468
I20260926 12:10:50.086596  1277 test_util.cc:268] Using random seed: -1186727834
I20260926 12:10:50.087826  1278 test_util.cc:268] Using random seed: -1186726557
I20260926 12:10:50.089339  1279 test_util.cc:268] Using random seed: -1186725163
I20260926 12:10:50.091044  1280 test_util.cc:268] Using random seed: -1186723476
I20260926 12:10:50.092893  1281 test_util.cc:268] Using random seed: -1186721600
I20260926 12:10:50.094619  1282 test_util.cc:268] Using random seed: -1186719846
I20260926 12:10:50.096561  1283 test_util.cc:268] Using random seed: -1186718311
I20260926 12:10:50.097857  1284 test_util.cc:268] Using random seed: -1186716706
I20260926 12:10:50.099797  1285 test_util.cc:268] Using random seed: -1186714688
I20260926 12:10:50.101773  1286 test_util.cc:268] Using random seed: -1186712714
I20260926 12:10:50.103410  1287 test_util.cc:268] Using random seed: -1186711363
I20260926 12:10:50.105465  1288 test_util.cc:268] Using random seed: -1186709408
I20260926 12:10:50.106882  1289 test_util.cc:268] Using random seed: -1186707633
I20260926 12:10:50.108502  1290 test_util.cc:268] Using random seed: -1186705941
I20260926 12:10:50.110445  1291 test_util.cc:268] Using random seed: -1186704064
I20260926 12:10:50.112012  1292 test_util.cc:268] Using random seed: -1186702810
I20260926 12:10:50.113343  1293 test_util.cc:268] Using random seed: -1186701156
I20260926 12:10:50.115319  1294 test_util.cc:268] Using random seed: -1186699164
I20260926 12:10:50.117336  1295 test_util.cc:268] Using random seed: -1186697130
I20260926 12:10:50.119036  1296 test_util.cc:268] Using random seed: -1186695434
I20260926 12:10:50.121035  1297 test_util.cc:268] Using random seed: -1186693480
I20260926 12:10:50.122283  1298 test_util.cc:268] Using random seed: -1186692165
I20260926 12:10:50.124569  1299 test_util.cc:268] Using random seed: -1186689949
I20260926 12:10:50.126794  1300 test_util.cc:268] Using random seed: -1186687729
I20260926 12:10:50.128453  1301 test_util.cc:268] Using random seed: -1186686022
I20260926 12:10:50.130555  1302 test_util.cc:268] Using random seed: -1186683955
I20260926 12:10:50.132776  1303 test_util.cc:268] Using random seed: -1186682175
I20260926 12:10:50.134164  1304 test_util.cc:268] Using random seed: -1186680344
W20260926 12:11:09.991940  1258 connection.cc:196] Error closing socket: Network error: TlsSocket::Close: Broken pipe
[       OK ] Parameters/TestRpc.TestCancellationMultiThreads/SSL_UnixSocket (20092 ms)
[ RUN      ] Parameters/TestRpc.TestCallId/SSL_UnixSocket
I20260926 12:11:10.050899  1318 acceptor_pool.cc:254] collecting diagnostics on the listening RPC socket unix:/tmp/dist-test-task2ifmkk/test-tmp/rpc-test-6037b177ee6d49bc8ae505271d863c17.sock every 8 connection(s)
I20260926 12:11:10.051756  1319 acceptor_pool.cc:254] collecting diagnostics on the listening RPC socket unix:/tmp/dist-test-task2ifmkk/test-tmp/rpc-test-6037b177ee6d49bc8ae505271d863c17.sock every 8 connection(s)
[       OK ] Parameters/TestRpc.TestCallId/SSL_UnixSocket (87 ms)
[----------] 20 tests from Parameters/TestRpc (38578 ms total)

[----------] Global test environment tear-down
[==========] 21 tests from 2 test suites ran. (41676 ms total)
[  PASSED  ] 20 tests.
[  FAILED  ] 1 test, listed below:
[  FAILED  ] Parameters/TestRpc.TestCallWithChainCertAndRootCA/SSL_UnixSocket, where GetParam() = (true, true)

 1 FAILED TEST
I20260926 12:11:10.115164   811 logging.cc:424] LogThrottler /data0/somelongdirectorytoavoidrpathissues/src/kudu/src/kudu/rpc/acceptor_pool.cc:285: suppressed but not reported on 3 messages since previous log ~34 seconds ago