Diagnosed failure

Parameters/TestRpc.TestCallWithChainCertAndChainCA/SSL_TCP: /data0/somelongdirectorytoavoidrpathissues/src/kudu/src/kudu/rpc/rpc-test.cc:270: Failure
Failed
Bad status: Runtime error: could not verify certificate chain (error with cert: subject=CN = localhost, ST = sadfjas, C = AS, emailAddress = sdflkdsajf, O = lskdfjlsad, OU = sldfkja, issuer=C = AS, ST = ASDfkjdhf, L = lskdjf, O = saldfja, OU = skdjf, CN = localhost, emailAddress = sadjflkadsj): : certificate has expired
Google Test trace:
/data0/somelongdirectorytoavoidrpathissues/src/kudu/src/kudu/rpc/rpc-test.cc:267: Connecting to 0.0.0.0:42767
I20260929 14:08:44.982941 29621 test_util.cc:175] -----------------------------------------------
I20260929 14:08:44.983016 29621 test_util.cc:176] Had fatal failures, leaving test files at /tmp/dist-test-task79qDmu/test-tmp/rpc-test.5.Parameters_TestRpc.TestCallWithChainCertAndChainCA_SSL_TCP.1790690924930308-29621-0

Full log

Note: This is test shard 6 of 8.
[==========] Running 21 tests from 2 test suites.
[----------] Global test environment set-up.
[----------] 20 tests from Parameters/TestRpc
[ RUN      ] Parameters/TestRpc.TestMessengerCreateDestroy/SSL_TCP
WARNING: Logging before InitGoogleLogging() is written to STDERR
I20260929 14:08:44.949079 29621 rpc-test.cc:169] started messenger TestCreateDestroy
[       OK ] Parameters/TestRpc.TestMessengerCreateDestroy/SSL_TCP (17 ms)
[ RUN      ] Parameters/TestRpc.TestNegotiationDeadlock/SSL_TCP
I20260929 14:08:44.959772 29642 acceptor_pool.cc:254] collecting diagnostics on the listening RPC socket 0.0.0.0:46119 every 8 connection(s)
I20260929 14:08:44.959774 29641 acceptor_pool.cc:254] collecting diagnostics on the listening RPC socket 0.0.0.0:46119 every 8 connection(s)
[       OK ] Parameters/TestRpc.TestNegotiationDeadlock/SSL_TCP (18 ms)
[ RUN      ] Parameters/TestRpc.TestCallWithChainCertAndChainCA/SSL_TCP
I20260929 14:08:44.977944 29657 acceptor_pool.cc:254] collecting diagnostics on the listening RPC socket 0.0.0.0:42767 every 8 connection(s)
I20260929 14:08:44.977974 29658 acceptor_pool.cc:254] collecting diagnostics on the listening RPC socket 0.0.0.0:42767 every 8 connection(s)
/data0/somelongdirectorytoavoidrpathissues/src/kudu/src/kudu/rpc/rpc-test.cc:270: Failure
Failed
Bad status: Runtime error: could not verify certificate chain (error with cert: subject=CN = localhost, ST = sadfjas, C = AS, emailAddress = sdflkdsajf, O = lskdfjlsad, OU = sldfkja, issuer=C = AS, ST = ASDfkjdhf, L = lskdjf, O = saldfja, OU = skdjf, CN = localhost, emailAddress = sadjflkadsj): : certificate has expired
Google Test trace:
/data0/somelongdirectorytoavoidrpathissues/src/kudu/src/kudu/rpc/rpc-test.cc:267: Connecting to 0.0.0.0:42767
I20260929 14:08:44.982941 29621 test_util.cc:175] -----------------------------------------------
I20260929 14:08:44.983016 29621 test_util.cc:176] Had fatal failures, leaving test files at /tmp/dist-test-task79qDmu/test-tmp/rpc-test.5.Parameters_TestRpc.TestCallWithChainCertAndChainCA_SSL_TCP.1790690924930308-29621-0
[  FAILED  ] Parameters/TestRpc.TestCallWithChainCertAndChainCA/SSL_TCP, where GetParam() = (true, false) (14 ms)
[ RUN      ] Parameters/TestRpc.TestCallWithPasswordProtectedKey/SSL_TCP
I20260929 14:08:44.993432 29682 acceptor_pool.cc:254] collecting diagnostics on the listening RPC socket 0.0.0.0:41707 every 8 connection(s)
I20260929 14:08:44.993432 29683 acceptor_pool.cc:254] collecting diagnostics on the listening RPC socket 0.0.0.0:41707 every 8 connection(s)
[       OK ] Parameters/TestRpc.TestCallWithPasswordProtectedKey/SSL_TCP (26 ms)
[ RUN      ] Parameters/TestRpc.TestCallToBadServer/SSL_TCP
I20260929 14:08:45.018239 29621 rpc-test.cc:394] Status: Network error: Client connection negotiation failed: client connection to 0.0.0.0:0: connect: Connection refused (error 111)
I20260929 14:08:45.018723 29621 rpc-test.cc:394] Status: Network error: Client connection negotiation failed: client connection to 0.0.0.0:0: connect: Connection refused (error 111)
I20260929 14:08:45.019260 29621 rpc-test.cc:394] Status: Network error: Client connection negotiation failed: client connection to 0.0.0.0:0: connect: Connection refused (error 111)
I20260929 14:08:45.019824 29621 rpc-test.cc:394] Status: Network error: Client connection negotiation failed: client connection to 0.0.0.0:0: connect: Connection refused (error 111)
I20260929 14:08:45.020213 29621 rpc-test.cc:394] Status: Network error: Client connection negotiation failed: client connection to 0.0.0.0:0: connect: Connection refused (error 111)
[       OK ] Parameters/TestRpc.TestCallToBadServer/SSL_TCP (11 ms)
[ RUN      ] Parameters/TestRpc.TestWrongService/SSL_TCP
I20260929 14:08:45.032259 29717 acceptor_pool.cc:254] collecting diagnostics on the listening RPC socket 0.0.0.0:45545 every 8 connection(s)
I20260929 14:08:45.032300 29718 acceptor_pool.cc:254] collecting diagnostics on the listening RPC socket 0.0.0.0:45545 every 8 connection(s)
I20260929 14:08:45.043965 29716 messenger.cc:345] service WrongServiceName not registered on TestServer
[       OK ] Parameters/TestRpc.TestWrongService/SSL_TCP (25 ms)
[ RUN      ] Parameters/TestRpc.TestConnectionKeepalive/SSL_TCP
I20260929 14:08:45.056044 29740 acceptor_pool.cc:254] collecting diagnostics on the listening RPC socket 0.0.0.0:38525 every 8 connection(s)
I20260929 14:08:45.056066 29741 acceptor_pool.cc:254] collecting diagnostics on the listening RPC socket 0.0.0.0:38525 every 8 connection(s)
I20260929 14:08:45.056237 29621 rpc-test.cc:488] Connecting to 0.0.0.0:38525
[       OK ] Parameters/TestRpc.TestConnectionKeepalive/SSL_TCP (1033 ms)
[ RUN      ] Parameters/TestRpc.TestClientConnectionMetrics/SSL_TCP
I20260929 14:08:46.096683 29766 acceptor_pool.cc:254] collecting diagnostics on the listening RPC socket 0.0.0.0:46409 every 8 connection(s)
I20260929 14:08:46.096858 29765 acceptor_pool.cc:254] collecting diagnostics on the listening RPC socket 0.0.0.0:46409 every 8 connection(s)
I20260929 14:08:46.096860 29621 rpc-test.cc:569] Connecting to 0.0.0.0:46409
[       OK ] Parameters/TestRpc.TestClientConnectionMetrics/SSL_TCP (11814 ms)
[ RUN      ] Parameters/TestRpc.TestCredentialsPolicy/SSL_TCP
I20260929 14:08:57.925088 29788 acceptor_pool.cc:254] collecting diagnostics on the listening RPC socket 0.0.0.0:35403 every 8 connection(s)
I20260929 14:08:57.925102 29789 acceptor_pool.cc:254] collecting diagnostics on the listening RPC socket 0.0.0.0:35403 every 8 connection(s)
I20260929 14:08:57.925262 29621 rpc-test.cc:700] Connecting to 0.0.0.0:35403
[       OK ] Parameters/TestRpc.TestCredentialsPolicy/SSL_TCP (62 ms)
[ RUN      ] Parameters/TestRpc.TestCallLongerThanKeepalive/SSL_TCP
I20260929 14:08:57.967523 29813 acceptor_pool.cc:254] collecting diagnostics on the listening RPC socket 0.0.0.0:45321 every 8 connection(s)
I20260929 14:08:57.967559 29814 acceptor_pool.cc:254] collecting diagnostics on the listening RPC socket 0.0.0.0:45321 every 8 connection(s)
I20260929 14:08:57.983678 29817 rpc-test-base.h:222] got call: sleep_micros: 3000000 deferred: true
I20260929 14:09:00.984539 29817 rpcz_store.cc:275] Call kudu.rpc.GenericCalculatorService.Sleep from 127.0.0.1:56916 (request call id 0) took 3000 ms. Trace:
I20260929 14:09:00.984794 29817 rpcz_store.cc:276] 0929 14:08:57.983615 (+     0us) service_pool.cc:170] Inserting onto call queue
0929 14:08:57.983650 (+    35us) service_pool.cc:227] Handling call
0929 14:09:00.984519 (+3000869us) inbound_call.cc:173] Queueing success response
Metrics: {}
[       OK ] Parameters/TestRpc.TestCallLongerThanKeepalive/SSL_TCP (3030 ms)
[ RUN      ] Parameters/TestRpc.TestRpcSidecar/SSL_TCP
I20260929 14:09:01.000330 29838 acceptor_pool.cc:254] collecting diagnostics on the listening RPC socket 0.0.0.0:43091 every 8 connection(s)
I20260929 14:09:01.000425 29839 acceptor_pool.cc:254] collecting diagnostics on the listening RPC socket 0.0.0.0:43091 every 8 connection(s)
[       OK ] Parameters/TestRpc.TestRpcSidecar/SSL_TCP (66 ms)
[ RUN      ] Parameters/TestRpc.TestRpcSidecarLimits/SSL_TCP
I20260929 14:09:03.086959 29863 acceptor_pool.cc:254] collecting diagnostics on the listening RPC socket 0.0.0.0:38941 every 8 connection(s)
I20260929 14:09:03.086992 29864 acceptor_pool.cc:254] collecting diagnostics on the listening RPC socket 0.0.0.0:38941 every 8 connection(s)
W20260929 14:09:03.112335 29621 serialization.cc:72] Serialized kudu.rpc_test.PushStringsRequestPB (2147483654 bytes) is larger than the maximum configured RPC message size (52428800 bytes). Sending anyway, but peer may reject the data.
W20260929 14:09:03.115708 29860 connection.cc:535] server connection from 127.0.0.1:33262 recv error: Network error: RPC frame had a length of 2147483714, but we only support messages up to 52428800 bytes long.
W20260929 14:09:03.115767 29860 connection.cc:158] shutting down server connection from 127.0.0.1:33262 with pending inbound data: 4/2147483714 bytes received; last active 0 ns ago: status Network error: RPC frame had a length of 2147483714, but we only support messages up to 52428800 bytes long.
W20260929 14:09:03.116072 29876 connection.cc:196] Error closing socket: Network error: TlsSocket::Close: Connection reset by peer
I20260929 14:09:03.126520 29888 acceptor_pool.cc:254] collecting diagnostics on the listening RPC socket 0.0.0.0:45505 every 8 connection(s)
I20260929 14:09:03.126571 29889 acceptor_pool.cc:254] collecting diagnostics on the listening RPC socket 0.0.0.0:45505 every 8 connection(s)
W20260929 14:09:07.420667 29885 connection.cc:577] server connection from 127.0.0.1:49218: received bad data: 'Corruption: Invalid packet: message had a length of 2147483710, but we only support messages up to 2147483647 bytes
'
[       OK ] Parameters/TestRpc.TestRpcSidecarLimits/SSL_TCP (6369 ms)
[ RUN      ] Parameters/TestRpc.TestCallTimeoutDoesntAffectNegotiation/SSL_TCP
I20260929 14:09:07.431806 29913 acceptor_pool.cc:254] collecting diagnostics on the listening RPC socket 0.0.0.0:33013 every 8 connection(s)
I20260929 14:09:07.431988 29914 acceptor_pool.cc:254] collecting diagnostics on the listening RPC socket 0.0.0.0:33013 every 8 connection(s)
W20260929 14:09:07.453075 29909 negotiation.cc:266] Injecting 500ms delay in negotiation
I20260929 14:09:07.503536 29621 rpc-test-base.h:595] status: Timed out: connection negotiation to 0.0.0.0:33013 for RPC Sleep timed out after 0.050s (ON_OUTBOUND_QUEUE), seconds elapsed: 0.0509196
[       OK ] Parameters/TestRpc.TestCallTimeoutDoesntAffectNegotiation/SSL_TCP (536 ms)
[ RUN      ] Parameters/TestRpc.TestRpcHandlerLatencyMetric/SSL_TCP
I20260929 14:09:07.970503 29939 acceptor_pool.cc:254] collecting diagnostics on the listening RPC socket 0.0.0.0:45191 every 8 connection(s)
I20260929 14:09:07.970515 29938 acceptor_pool.cc:254] collecting diagnostics on the listening RPC socket 0.0.0.0:45191 every 8 connection(s)
I20260929 14:09:08.012730 29621 rpc-test.cc:1236] Sleep() min lat: 20430
I20260929 14:09:08.012880 29621 rpc-test.cc:1237] Sleep() mean lat: 20430
I20260929 14:09:08.012907 29621 rpc-test.cc:1238] Sleep() max lat: 20430
I20260929 14:09:08.012921 29621 rpc-test.cc:1239] Sleep() #calls: 1
[       OK ] Parameters/TestRpc.TestRpcHandlerLatencyMetric/SSL_TCP (55 ms)
[ RUN      ] Parameters/TestRpc.TimedOutOnResponseMetricServiceQueue/SSL_TCP
I20260929 14:09:08.022032 29964 acceptor_pool.cc:254] collecting diagnostics on the listening RPC socket 0.0.0.0:33663 every 8 connection(s)
I20260929 14:09:08.022082 29965 acceptor_pool.cc:254] collecting diagnostics on the listening RPC socket 0.0.0.0:33663 every 8 connection(s)
W20260929 14:09:08.075685 29966 rpcz_store.cc:267] Call kudu.rpc_test.CalculatorService.Sleep from 127.0.0.1:53272 (request call id 2) took 20 ms (client timeout 20 ms). Trace:
W20260929 14:09:08.075805 29966 rpcz_store.cc:269] 0929 14:09:08.055366 (+     0us) service_pool.cc:170] Inserting onto call queue
0929 14:09:08.075658 (+ 20292us) service_pool.cc:214] Skipping call since client already timed out
0929 14:09:08.075668 (+    10us) inbound_call.cc:173] Queueing failure response
Metrics: {}
[       OK ] Parameters/TestRpc.TimedOutOnResponseMetricServiceQueue/SSL_TCP (62 ms)
[ RUN      ] Parameters/TestRpc.RpcPendingConnectionsMetric/SSL_TCP
I20260929 14:09:08.084008 29987 acceptor_pool.cc:254] collecting diagnostics on the listening RPC socket 0.0.0.0:37851 every 8 connection(s)
I20260929 14:09:08.084057 29988 acceptor_pool.cc:254] collecting diagnostics on the listening RPC socket 0.0.0.0:37851 every 8 connection(s)
W20260929 14:09:08.084710 29983 negotiation.cc:337] Failed RPC negotiation. Trace:
0929 14:09:08.084527 (+     0us) reactor.cc:625] Submitting negotiation task for server connection from 127.0.0.1:53268 (local address 127.0.0.1:37851)
0929 14:09:08.084573 (+    46us) server_negotiation.cc:206] Beginning negotiation
0929 14:09:08.084575 (+     2us) server_negotiation.cc:399] Waiting for connection header
0929 14:09:08.084654 (+    79us) negotiation.cc:327] Negotiation complete: Network error: Server connection negotiation failed: server connection from 127.0.0.1:53268: BlockingRecv error: recv got EOF from 127.0.0.1:53268 (error 108)
Metrics: {"server-negotiator.queue_time_us":14}
[       OK ] Parameters/TestRpc.RpcPendingConnectionsMetric/SSL_TCP (18 ms)
[ RUN      ] Parameters/TestRpc.TestRpcContextClientDeadline/SSL_TCP
I20260929 14:09:08.126870 30003 acceptor_pool.cc:254] collecting diagnostics on the listening RPC socket 0.0.0.0:35525 every 8 connection(s)
I20260929 14:09:08.126888 30004 acceptor_pool.cc:254] collecting diagnostics on the listening RPC socket 0.0.0.0:35525 every 8 connection(s)
[       OK ] Parameters/TestRpc.TestRpcContextClientDeadline/SSL_TCP (79 ms)
[ RUN      ] Parameters/TestRpc.TestApplicationFeatureFlagUnsupportedServer/SSL_TCP
I20260929 14:09:08.197405 30028 acceptor_pool.cc:254] collecting diagnostics on the listening RPC socket 0.0.0.0:33267 every 8 connection(s)
I20260929 14:09:08.197433 30029 acceptor_pool.cc:254] collecting diagnostics on the listening RPC socket 0.0.0.0:33267 every 8 connection(s)
[       OK ] Parameters/TestRpc.TestApplicationFeatureFlagUnsupportedServer/SSL_TCP (57 ms)
[ RUN      ] Parameters/TestRpc.TestCancellationAsync/SSL_TCP
I20260929 14:09:08.257688 29621 rpc-test.cc:1716] Connecting to 0.0.0.0:46349
I20260929 14:09:08.258584 30053 acceptor_pool.cc:254] collecting diagnostics on the listening RPC socket 0.0.0.0:46349 every 8 connection(s)
I20260929 14:09:08.258853 30054 acceptor_pool.cc:254] collecting diagnostics on the listening RPC socket 0.0.0.0:46349 every 8 connection(s)
I20260929 14:09:08.266774 29621 test_util.cc:268] Using random seed: -1176519916
I20260929 14:09:08.289248 30057 rpc-test-base.h:240] got call: sleep_micros: 500 pattern: 4294967295 num_repetitions: 2097152 sidecar_idx: 0
I20260929 14:09:08.307126 30057 rpc-test-base.h:240] got call: sleep_micros: 500 pattern: 4294967295 num_repetitions: 2097152 sidecar_idx: 0
I20260929 14:09:08.325007 30057 rpc-test-base.h:240] got call: sleep_micros: 500 pattern: 4294967295 num_repetitions: 2097152 sidecar_idx: 0
I20260929 14:09:08.340827 30057 rpc-test-base.h:240] got call: sleep_micros: 500 pattern: 4294967295 num_repetitions: 2097152 sidecar_idx: 0
I20260929 14:09:08.356810 30057 rpc-test-base.h:240] got call: sleep_micros: 500 pattern: 4294967295 num_repetitions: 2097152 sidecar_idx: 0
I20260929 14:09:08.372711 30057 rpc-test-base.h:240] got call: sleep_micros: 500 pattern: 4294967295 num_repetitions: 2097152 sidecar_idx: 0
I20260929 14:09:08.387612 30057 rpc-test-base.h:240] got call: sleep_micros: 500 pattern: 4294967295 num_repetitions: 2097152 sidecar_idx: 0
I20260929 14:09:08.402261 30057 rpc-test-base.h:240] got call: sleep_micros: 500 pattern: 4294967295 num_repetitions: 2097152 sidecar_idx: 0
W20260929 14:09:08.405758 30052 connection.cc:441] server connection from 127.0.0.1:35330 torn down before Call kudu.rpc.GenericCalculatorService.SleepWithSidecar from 127.0.0.1:35330 (request call id 9) could send its response
[       OK ] Parameters/TestRpc.TestCancellationAsync/SSL_TCP (173 ms)
[ RUN      ] Parameters/TestRpc.TestPerformanceBySocketType/SSL_TCP
I20260929 14:09:08.420650 30078 acceptor_pool.cc:254] collecting diagnostics on the listening RPC socket 0.0.0.0:37171 every 8 connection(s)
I20260929 14:09:08.420692 30079 acceptor_pool.cc:254] collecting diagnostics on the listening RPC socket 0.0.0.0:37171 every 8 connection(s)
I20260929 14:09:08.420868 29621 rpc-test.cc:1846] Connecting to 0.0.0.0:37171
I20260929 14:09:10.306784 29621 rpc-test.cc:1859] Sending 1024MB via ssl-enabled tcp socket: real 1.878s	user 1.670s	sys 1.597s
I20260929 14:09:12.154807 29621 rpc-test.cc:1859] Sending 1024MB via ssl-enabled tcp socket: real 1.848s	user 1.662s	sys 1.588s
I20260929 14:09:13.994514 29621 rpc-test.cc:1859] Sending 1024MB via ssl-enabled tcp socket: real 1.840s	user 1.632s	sys 1.601s
I20260929 14:09:15.764343 29621 rpc-test.cc:1859] Sending 1024MB via ssl-enabled tcp socket: real 1.770s	user 1.610s	sys 1.509s
I20260929 14:09:17.554337 29621 rpc-test.cc:1859] Sending 1024MB via ssl-enabled tcp socket: real 1.790s	user 1.698s	sys 1.462s
[       OK ] Parameters/TestRpc.TestPerformanceBySocketType/SSL_TCP (9149 ms)
[----------] 20 tests from Parameters/TestRpc (32623 ms total)

[----------] 1 test from Parameters/TestRpcSocketTxRxQueue
[ RUN      ] Parameters/TestRpcSocketTxRxQueue.OverCapacity/0
W20260929 14:09:17.828306 30140 negotiation.cc:337] Failed RPC negotiation. Trace:
0929 14:09:17.567805 (+     0us) reactor.cc:625] Submitting negotiation task for client connection to 0.0.0.0:46381 (local address 127.0.0.1:39484)
0929 14:09:17.567864 (+    59us) negotiation.cc:107] Waiting for socket to connect
0929 14:09:17.567874 (+    10us) client_negotiation.cc:174] Beginning negotiation
0929 14:09:17.567921 (+    47us) client_negotiation.cc:252] Sending NEGOTIATE NegotiatePB request
0929 14:09:17.828248 (+260327us) negotiation.cc:327] Negotiation complete: Network error: Client connection negotiation failed: client connection to 0.0.0.0:46381: BlockingRecv error: recv error from unknown peer: Transport endpoint is not connected (error 107)
Metrics: {"client-negotiator.queue_time_us":34}
W20260929 14:09:17.828405 30122 negotiation.cc:337] Failed RPC negotiation. Trace:
0929 14:09:17.565530 (+     0us) reactor.cc:625] Submitting negotiation task for client connection to 0.0.0.0:46381 (local address 127.0.0.1:39466)
0929 14:09:17.565582 (+    52us) negotiation.cc:107] Waiting for socket to connect
0929 14:09:17.565592 (+    10us) client_negotiation.cc:174] Beginning negotiation
0929 14:09:17.565643 (+    51us) client_negotiation.cc:252] Sending NEGOTIATE NegotiatePB request
0929 14:09:17.828355 (+262712us) negotiation.cc:327] Negotiation complete: Network error: Client connection negotiation failed: client connection to 0.0.0.0:46381: BlockingRecv error: recv error from unknown peer: Transport endpoint is not connected (error 107)
Metrics: {"client-negotiator.queue_time_us":26}
W20260929 14:09:17.828312 30095 negotiation.cc:337] Failed RPC negotiation. Trace:
0929 14:09:17.561970 (+     0us) reactor.cc:625] Submitting negotiation task for client connection to 0.0.0.0:46381 (local address 127.0.0.1:39442)
0929 14:09:17.562068 (+    98us) negotiation.cc:107] Waiting for socket to connect
0929 14:09:17.562082 (+    14us) client_negotiation.cc:174] Beginning negotiation
0929 14:09:17.562152 (+    70us) client_negotiation.cc:252] Sending NEGOTIATE NegotiatePB request
0929 14:09:17.828175 (+266023us) negotiation.cc:327] Negotiation complete: Network error: Client connection negotiation failed: client connection to 0.0.0.0:46381: BlockingRecv error: recv error from unknown peer: Transport endpoint is not connected (error 107)
Metrics: {"client-negotiator.queue_time_us":54}
W20260929 14:09:17.828313 30104 negotiation.cc:337] Failed RPC negotiation. Trace:
0929 14:09:17.563140 (+     0us) reactor.cc:625] Submitting negotiation task for client connection to 0.0.0.0:46381 (local address 127.0.0.1:39458)
0929 14:09:17.563186 (+    46us) negotiation.cc:107] Waiting for socket to connect
0929 14:09:17.563195 (+     9us) client_negotiation.cc:174] Beginning negotiation
0929 14:09:17.563243 (+    48us) client_negotiation.cc:252] Sending NEGOTIATE NegotiatePB request
0929 14:09:17.828161 (+264918us) negotiation.cc:327] Negotiation complete: Network error: Client connection negotiation failed: client connection to 0.0.0.0:46381: BlockingRecv error: recv error from unknown peer: Transport endpoint is not connected (error 107)
Metrics: {"client-negotiator.queue_time_us":19}
W20260929 14:09:17.828626 30131 negotiation.cc:337] Failed RPC negotiation. Trace:
0929 14:09:17.566819 (+     0us) reactor.cc:625] Submitting negotiation task for client connection to 0.0.0.0:46381 (local address 127.0.0.1:39468)
0929 14:09:17.566894 (+    75us) negotiation.cc:107] Waiting for socket to connect
0929 14:09:17.567028 (+   134us) client_negotiation.cc:174] Beginning negotiation
0929 14:09:17.567087 (+    59us) client_negotiation.cc:252] Sending NEGOTIATE NegotiatePB request
0929 14:09:17.828161 (+261074us) negotiation.cc:327] Negotiation complete: Network error: Client connection negotiation failed: client connection to 0.0.0.0:46381: BlockingRecv error: recv error from unknown peer: Transport endpoint is not connected (error 107)
Metrics: {"client-negotiator.queue_time_us":49}
W20260929 14:09:17.828653 30113 negotiation.cc:337] Failed RPC negotiation. Trace:
0929 14:09:17.564203 (+     0us) reactor.cc:625] Submitting negotiation task for client connection to 0.0.0.0:46381 (local address 127.0.0.1:39462)
0929 14:09:17.564249 (+    46us) negotiation.cc:107] Waiting for socket to connect
0929 14:09:17.564269 (+    20us) client_negotiation.cc:174] Beginning negotiation
0929 14:09:17.564331 (+    62us) client_negotiation.cc:252] Sending NEGOTIATE NegotiatePB request
0929 14:09:17.828176 (+263845us) negotiation.cc:327] Negotiation complete: Network error: Client connection negotiation failed: client connection to 0.0.0.0:46381: BlockingRecv error: recv error from unknown peer: Transport endpoint is not connected (error 107)
Metrics: {"client-negotiator.queue_time_us":19}
[       OK ] Parameters/TestRpcSocketTxRxQueue.OverCapacity/0 (1045 ms)
[----------] 1 test from Parameters/TestRpcSocketTxRxQueue (1045 ms total)

[----------] Global test environment tear-down
[==========] 21 tests from 2 test suites ran. (33669 ms total)
[  PASSED  ] 20 tests.
[  FAILED  ] 1 test, listed below:
[  FAILED  ] Parameters/TestRpc.TestCallWithChainCertAndChainCA/SSL_TCP, where GetParam() = (true, false)

 1 FAILED TEST