Diagnosed failure

Parameters/TestRpc.TestCallWithChainCertAndChainCA/SSL_TCP: /data0/somelongdirectorytoavoidrpathissues/src/kudu/src/kudu/rpc/rpc-test.cc:270: Failure
Failed
Bad status: Runtime error: could not verify certificate chain (error with cert: subject=CN = localhost, ST = sadfjas, C = AS, emailAddress = sdflkdsajf, O = lskdfjlsad, OU = sldfkja, issuer=C = AS, ST = ASDfkjdhf, L = lskdjf, O = saldfja, OU = skdjf, CN = localhost, emailAddress = sadjflkadsj): : certificate has expired
Google Test trace:
/data0/somelongdirectorytoavoidrpathissues/src/kudu/src/kudu/rpc/rpc-test.cc:267: Connecting to 0.0.0.0:41523
I20260927 19:37:06.479210   390 test_util.cc:175] -----------------------------------------------
I20260927 19:37:06.479393   390 test_util.cc:176] Had fatal failures, leaving test files at /tmp/dist-test-task2uf8ee/test-tmp/rpc-test.5.Parameters_TestRpc.TestCallWithChainCertAndChainCA_SSL_TCP.1790537825166365-390-0

Full log

Note: This is test shard 6 of 8.
[==========] Running 21 tests from 2 test suites.
[----------] Global test environment set-up.
[----------] 20 tests from Parameters/TestRpc
[ RUN      ] Parameters/TestRpc.TestMessengerCreateDestroy/SSL_TCP
WARNING: Logging before InitGoogleLogging() is written to STDERR
I20260927 19:37:05.274752   390 rpc-test.cc:169] started messenger TestCreateDestroy
[       OK ] Parameters/TestRpc.TestMessengerCreateDestroy/SSL_TCP (1113 ms)
[ RUN      ] Parameters/TestRpc.TestNegotiationDeadlock/SSL_TCP
I20260927 19:37:06.358335   412 acceptor_pool.cc:254] collecting diagnostics on the listening RPC socket 0.0.0.0:36117 every 8 connection(s)
I20260927 19:37:06.359519   413 acceptor_pool.cc:254] collecting diagnostics on the listening RPC socket 0.0.0.0:36117 every 8 connection(s)
[       OK ] Parameters/TestRpc.TestNegotiationDeadlock/SSL_TCP (76 ms)
[ RUN      ] Parameters/TestRpc.TestCallWithChainCertAndChainCA/SSL_TCP
I20260927 19:37:06.450508   428 acceptor_pool.cc:254] collecting diagnostics on the listening RPC socket 0.0.0.0:41523 every 8 connection(s)
I20260927 19:37:06.452375   429 acceptor_pool.cc:254] collecting diagnostics on the listening RPC socket 0.0.0.0:41523 every 8 connection(s)
/data0/somelongdirectorytoavoidrpathissues/src/kudu/src/kudu/rpc/rpc-test.cc:270: Failure
Failed
Bad status: Runtime error: could not verify certificate chain (error with cert: subject=CN = localhost, ST = sadfjas, C = AS, emailAddress = sdflkdsajf, O = lskdfjlsad, OU = sldfkja, issuer=C = AS, ST = ASDfkjdhf, L = lskdjf, O = saldfja, OU = skdjf, CN = localhost, emailAddress = sadjflkadsj): : certificate has expired
Google Test trace:
/data0/somelongdirectorytoavoidrpathissues/src/kudu/src/kudu/rpc/rpc-test.cc:267: Connecting to 0.0.0.0:41523
I20260927 19:37:06.479210   390 test_util.cc:175] -----------------------------------------------
I20260927 19:37:06.479393   390 test_util.cc:176] Had fatal failures, leaving test files at /tmp/dist-test-task2uf8ee/test-tmp/rpc-test.5.Parameters_TestRpc.TestCallWithChainCertAndChainCA_SSL_TCP.1790537825166365-390-0
[  FAILED  ] Parameters/TestRpc.TestCallWithChainCertAndChainCA/SSL_TCP, where GetParam() = (true, false) (68 ms)
[ RUN      ] Parameters/TestRpc.TestCallWithPasswordProtectedKey/SSL_TCP
I20260927 19:37:06.501724   453 acceptor_pool.cc:254] collecting diagnostics on the listening RPC socket 0.0.0.0:34137 every 8 connection(s)
I20260927 19:37:06.502420   454 acceptor_pool.cc:254] collecting diagnostics on the listening RPC socket 0.0.0.0:34137 every 8 connection(s)
[       OK ] Parameters/TestRpc.TestCallWithPasswordProtectedKey/SSL_TCP (68 ms)
[ RUN      ] Parameters/TestRpc.TestCallToBadServer/SSL_TCP
I20260927 19:37:06.586869   390 rpc-test.cc:394] Status: Network error: Client connection negotiation failed: client connection to 0.0.0.0:0: connect: Connection refused (error 111)
I20260927 19:37:06.588297   390 rpc-test.cc:394] Status: Network error: Client connection negotiation failed: client connection to 0.0.0.0:0: connect: Connection refused (error 111)
I20260927 19:37:06.589704   390 rpc-test.cc:394] Status: Network error: Client connection negotiation failed: client connection to 0.0.0.0:0: connect: Connection refused (error 111)
I20260927 19:37:06.591037   390 rpc-test.cc:394] Status: Network error: Client connection negotiation failed: client connection to 0.0.0.0:0: connect: Connection refused (error 111)
I20260927 19:37:06.592307   390 rpc-test.cc:394] Status: Network error: Client connection negotiation failed: client connection to 0.0.0.0:0: connect: Connection refused (error 111)
[       OK ] Parameters/TestRpc.TestCallToBadServer/SSL_TCP (46 ms)
[ RUN      ] Parameters/TestRpc.TestWrongService/SSL_TCP
I20260927 19:37:06.616850   488 acceptor_pool.cc:254] collecting diagnostics on the listening RPC socket 0.0.0.0:46631 every 8 connection(s)
I20260927 19:37:06.617599   489 acceptor_pool.cc:254] collecting diagnostics on the listening RPC socket 0.0.0.0:46631 every 8 connection(s)
I20260927 19:37:06.647660   487 messenger.cc:345] service WrongServiceName not registered on TestServer
[       OK ] Parameters/TestRpc.TestWrongService/SSL_TCP (60 ms)
[ RUN      ] Parameters/TestRpc.TestConnectionKeepalive/SSL_TCP
I20260927 19:37:06.670663   511 acceptor_pool.cc:254] collecting diagnostics on the listening RPC socket 0.0.0.0:33451 every 8 connection(s)
I20260927 19:37:06.671335   512 acceptor_pool.cc:254] collecting diagnostics on the listening RPC socket 0.0.0.0:33451 every 8 connection(s)
I20260927 19:37:06.674410   390 rpc-test.cc:488] Connecting to 0.0.0.0:33451
[       OK ] Parameters/TestRpc.TestConnectionKeepalive/SSL_TCP (1063 ms)
[ RUN      ] Parameters/TestRpc.TestClientConnectionMetrics/SSL_TCP
I20260927 19:37:07.756181   536 acceptor_pool.cc:254] collecting diagnostics on the listening RPC socket 0.0.0.0:38719 every 8 connection(s)
I20260927 19:37:07.756870   537 acceptor_pool.cc:254] collecting diagnostics on the listening RPC socket 0.0.0.0:38719 every 8 connection(s)
I20260927 19:37:07.760143   390 rpc-test.cc:569] Connecting to 0.0.0.0:38719
[       OK ] Parameters/TestRpc.TestClientConnectionMetrics/SSL_TCP (111612 ms)
[ RUN      ] Parameters/TestRpc.TestCredentialsPolicy/SSL_TCP
I20260927 19:38:59.360407   570 acceptor_pool.cc:254] collecting diagnostics on the listening RPC socket 0.0.0.0:42637 every 8 connection(s)
I20260927 19:38:59.361156   571 acceptor_pool.cc:254] collecting diagnostics on the listening RPC socket 0.0.0.0:42637 every 8 connection(s)
I20260927 19:38:59.364391   390 rpc-test.cc:700] Connecting to 0.0.0.0:42637
[       OK ] Parameters/TestRpc.TestCredentialsPolicy/SSL_TCP (84 ms)
[ RUN      ] Parameters/TestRpc.TestCallLongerThanKeepalive/SSL_TCP
I20260927 19:38:59.437649   595 acceptor_pool.cc:254] collecting diagnostics on the listening RPC socket 0.0.0.0:38759 every 8 connection(s)
I20260927 19:38:59.438349   596 acceptor_pool.cc:254] collecting diagnostics on the listening RPC socket 0.0.0.0:38759 every 8 connection(s)
I20260927 19:38:59.475253   599 rpc-test-base.h:222] got call: sleep_micros: 3000000 deferred: true
I20260927 19:39:02.479635   599 rpcz_store.cc:275] Call kudu.rpc.GenericCalculatorService.Sleep from 127.0.0.1:44788 (request call id 0) took 3004 ms. Trace:
I20260927 19:39:02.480015   599 rpcz_store.cc:276] 0927 19:38:59.475037 (+     0us) service_pool.cc:170] Inserting onto call queue
0927 19:38:59.475122 (+    85us) service_pool.cc:227] Handling call
0927 19:39:02.479567 (+3004445us) inbound_call.cc:173] Queueing success response
Metrics: {}
[       OK ] Parameters/TestRpc.TestCallLongerThanKeepalive/SSL_TCP (3073 ms)
[ RUN      ] Parameters/TestRpc.TestRpcSidecar/SSL_TCP
I20260927 19:39:02.512763   620 acceptor_pool.cc:254] collecting diagnostics on the listening RPC socket 0.0.0.0:45545 every 8 connection(s)
I20260927 19:39:02.513563   621 acceptor_pool.cc:254] collecting diagnostics on the listening RPC socket 0.0.0.0:45545 every 8 connection(s)
[       OK ] Parameters/TestRpc.TestRpcSidecar/SSL_TCP (557 ms)
[ RUN      ] Parameters/TestRpc.TestRpcSidecarLimits/SSL_TCP
I20260927 19:39:19.178109   647 acceptor_pool.cc:254] collecting diagnostics on the listening RPC socket 0.0.0.0:32969 every 8 connection(s)
I20260927 19:39:19.178845   648 acceptor_pool.cc:254] collecting diagnostics on the listening RPC socket 0.0.0.0:32969 every 8 connection(s)
W20260927 19:39:19.201633   390 serialization.cc:72] Serialized kudu.rpc_test.PushStringsRequestPB (2147483654 bytes) is larger than the maximum configured RPC message size (52428800 bytes). Sending anyway, but peer may reject the data.
W20260927 19:39:19.212407   646 connection.cc:535] server connection from 127.0.0.1:58026 recv error: Network error: RPC frame had a length of 2147483714, but we only support messages up to 52428800 bytes long.
W20260927 19:39:19.212782   646 connection.cc:158] shutting down server connection from 127.0.0.1:58026 with pending inbound data: 4/2147483714 bytes received; last active 0 ns ago: status Network error: RPC frame had a length of 2147483714, but we only support messages up to 52428800 bytes long.
W20260927 19:39:19.213634   660 connection.cc:698] client connection to 0.0.0.0:32969 send error: Network error: failed to write to TLS socket: Connection reset by peer
W20260927 19:39:19.214188   660 connection.cc:196] Error closing socket: Network error: TlsSocket::Close: Success
[       OK ] Parameters/TestRpc.TestRpcSidecarLimits/SSL_TCP (16774 ms)
[ RUN      ] Parameters/TestRpc.TestCallTimeoutDoesntAffectNegotiation/SSL_TCP
I20260927 19:39:19.839736   672 acceptor_pool.cc:254] collecting diagnostics on the listening RPC socket 0.0.0.0:33737 every 8 connection(s)
I20260927 19:39:19.840402   673 acceptor_pool.cc:254] collecting diagnostics on the listening RPC socket 0.0.0.0:33737 every 8 connection(s)
W20260927 19:39:19.860157   668 negotiation.cc:266] Injecting 500ms delay in negotiation
I20260927 19:39:19.909751   390 rpc-test-base.h:595] status: Timed out: connection negotiation to 0.0.0.0:33737 for RPC Sleep timed out after 0.050s (ON_OUTBOUND_QUEUE), seconds elapsed: 0.0506813
[       OK ] Parameters/TestRpc.TestCallTimeoutDoesntAffectNegotiation/SSL_TCP (560 ms)
[ RUN      ] Parameters/TestRpc.TestRpcHandlerLatencyMetric/SSL_TCP
I20260927 19:39:20.401597   697 acceptor_pool.cc:254] collecting diagnostics on the listening RPC socket 0.0.0.0:35453 every 8 connection(s)
I20260927 19:39:20.402245   698 acceptor_pool.cc:254] collecting diagnostics on the listening RPC socket 0.0.0.0:35453 every 8 connection(s)
I20260927 19:39:20.456152   390 rpc-test.cc:1236] Sleep() min lat: 21621
I20260927 19:39:20.456349   390 rpc-test.cc:1237] Sleep() mean lat: 21621
I20260927 19:39:20.456481   390 rpc-test.cc:1238] Sleep() max lat: 21621
I20260927 19:39:20.456589   390 rpc-test.cc:1239] Sleep() #calls: 1
[       OK ] Parameters/TestRpc.TestRpcHandlerLatencyMetric/SSL_TCP (80 ms)
[ RUN      ] Parameters/TestRpc.TimedOutOnResponseMetricServiceQueue/SSL_TCP
I20260927 19:39:20.481072   723 acceptor_pool.cc:254] collecting diagnostics on the listening RPC socket 0.0.0.0:46793 every 8 connection(s)
I20260927 19:39:20.481745   724 acceptor_pool.cc:254] collecting diagnostics on the listening RPC socket 0.0.0.0:46793 every 8 connection(s)
W20260927 19:39:20.554761   725 rpcz_store.cc:267] Call kudu.rpc_test.CalculatorService.Sleep from 127.0.0.1:54408 (request call id 2) took 20 ms (client timeout 20 ms). Trace:
W20260927 19:39:20.555063   725 rpcz_store.cc:269] 0927 19:39:20.534250 (+     0us) service_pool.cc:170] Inserting onto call queue
0927 19:39:20.554641 (+ 20391us) service_pool.cc:214] Skipping call since client already timed out
0927 19:39:20.554717 (+    76us) inbound_call.cc:173] Queueing failure response
Metrics: {}
[       OK ] Parameters/TestRpc.TimedOutOnResponseMetricServiceQueue/SSL_TCP (98 ms)
[ RUN      ] Parameters/TestRpc.RpcPendingConnectionsMetric/SSL_TCP
I20260927 19:39:20.571559   746 acceptor_pool.cc:254] collecting diagnostics on the listening RPC socket 0.0.0.0:45031 every 8 connection(s)
I20260927 19:39:20.572218   747 acceptor_pool.cc:254] collecting diagnostics on the listening RPC socket 0.0.0.0:45031 every 8 connection(s)
W20260927 19:39:20.586045   742 negotiation.cc:337] Failed RPC negotiation. Trace:
0927 19:39:20.584407 (+     0us) reactor.cc:625] Submitting negotiation task for server connection from 127.0.0.1:53102 (local address 127.0.0.1:45031)
0927 19:39:20.584930 (+   523us) server_negotiation.cc:206] Beginning negotiation
0927 19:39:20.584955 (+    25us) server_negotiation.cc:399] Waiting for connection header
0927 19:39:20.585255 (+   300us) negotiation.cc:327] Negotiation complete: Network error: Server connection negotiation failed: server connection from 127.0.0.1:53102: BlockingRecv error: recv got EOF from 127.0.0.1:53102 (error 108)
Metrics: {"server-negotiator.queue_time_us":120}
[       OK ] Parameters/TestRpc.RpcPendingConnectionsMetric/SSL_TCP (37 ms)
[ RUN      ] Parameters/TestRpc.TestRpcContextClientDeadline/SSL_TCP
I20260927 19:39:20.618357   762 acceptor_pool.cc:254] collecting diagnostics on the listening RPC socket 0.0.0.0:39483 every 8 connection(s)
I20260927 19:39:20.619005   763 acceptor_pool.cc:254] collecting diagnostics on the listening RPC socket 0.0.0.0:39483 every 8 connection(s)
[       OK ] Parameters/TestRpc.TestRpcContextClientDeadline/SSL_TCP (88 ms)
[ RUN      ] Parameters/TestRpc.TestApplicationFeatureFlagUnsupportedServer/SSL_TCP
I20260927 19:39:20.727530   787 acceptor_pool.cc:254] collecting diagnostics on the listening RPC socket 0.0.0.0:44539 every 8 connection(s)
I20260927 19:39:20.728253   788 acceptor_pool.cc:254] collecting diagnostics on the listening RPC socket 0.0.0.0:44539 every 8 connection(s)
[       OK ] Parameters/TestRpc.TestApplicationFeatureFlagUnsupportedServer/SSL_TCP (75 ms)
[ RUN      ] Parameters/TestRpc.TestCancellationAsync/SSL_TCP
I20260927 19:39:20.782832   812 acceptor_pool.cc:254] collecting diagnostics on the listening RPC socket 0.0.0.0:33487 every 8 connection(s)
I20260927 19:39:20.783514   813 acceptor_pool.cc:254] collecting diagnostics on the listening RPC socket 0.0.0.0:33487 every 8 connection(s)
I20260927 19:39:20.786455   390 rpc-test.cc:1716] Connecting to 0.0.0.0:33487
I20260927 19:39:20.824455   390 test_util.cc:268] Using random seed: 454860400
I20260927 19:39:21.050074   816 rpc-test-base.h:240] got call: sleep_micros: 500 pattern: 4294967295 num_repetitions: 2097152 sidecar_idx: 0
I20260927 19:39:21.218652   815 rpc-test-base.h:240] got call: sleep_micros: 500 pattern: 4294967295 num_repetitions: 2097152 sidecar_idx: 0
I20260927 19:39:21.404557   816 rpc-test-base.h:240] got call: sleep_micros: 500 pattern: 4294967295 num_repetitions: 2097152 sidecar_idx: 0
I20260927 19:39:21.577555   815 rpc-test-base.h:240] got call: sleep_micros: 500 pattern: 4294967295 num_repetitions: 2097152 sidecar_idx: 0
I20260927 19:39:21.750185   816 rpc-test-base.h:240] got call: sleep_micros: 500 pattern: 4294967295 num_repetitions: 2097152 sidecar_idx: 0
I20260927 19:39:21.923298   815 rpc-test-base.h:240] got call: sleep_micros: 500 pattern: 4294967295 num_repetitions: 2097152 sidecar_idx: 0
I20260927 19:39:22.105439   815 rpc-test-base.h:240] got call: sleep_micros: 500 pattern: 4294967295 num_repetitions: 2097152 sidecar_idx: 0
I20260927 19:39:22.261951   816 rpc-test-base.h:240] got call: sleep_micros: 500 pattern: 4294967295 num_repetitions: 2097152 sidecar_idx: 0
W20260927 19:39:22.415314   809 connection.cc:698] server connection from 127.0.0.1:46680 send error: Network error: failed to write to TLS socket: Broken pipe
W20260927 19:39:22.415577   809 connection.cc:441] server connection from 127.0.0.1:46680 torn down before Call kudu.rpc.GenericCalculatorService.SleepWithSidecar from 127.0.0.1:46680 (request call id 9) could send its response
W20260927 19:39:22.420069   809 connection.cc:196] Error closing socket: Network error: TlsSocket::Close: Success
W20260927 19:39:22.466358   809 connection.cc:441] server connection from 127.0.0.1:46680 torn down before Call kudu.rpc.GenericCalculatorService.SleepWithSidecar from 127.0.0.1:46680 (request call id 8) could send its response
[       OK ] Parameters/TestRpc.TestCancellationAsync/SSL_TCP (1711 ms)
[ RUN      ] Parameters/TestRpc.TestPerformanceBySocketType/SSL_TCP
I20260927 19:39:22.569893   837 acceptor_pool.cc:254] collecting diagnostics on the listening RPC socket 0.0.0.0:36543 every 8 connection(s)
I20260927 19:39:22.570547   838 acceptor_pool.cc:254] collecting diagnostics on the listening RPC socket 0.0.0.0:36543 every 8 connection(s)
I20260927 19:39:22.573511   390 rpc-test.cc:1846] Connecting to 0.0.0.0:36543
I20260927 19:39:41.286367   390 rpc-test.cc:1859] Sending 1024MB via ssl-enabled tcp socket: real 18.683s	user 17.045s	sys 9.856s
I20260927 19:39:59.682772   390 rpc-test.cc:1859] Sending 1024MB via ssl-enabled tcp socket: real 18.396s	user 16.299s	sys 10.153s
I20260927 19:40:18.062987   390 rpc-test.cc:1859] Sending 1024MB via ssl-enabled tcp socket: real 18.380s	user 16.216s	sys 10.181s
I20260927 19:40:36.620800   390 rpc-test.cc:1859] Sending 1024MB via ssl-enabled tcp socket: real 18.557s	user 16.395s	sys 10.253s
I20260927 19:40:55.037098   390 rpc-test.cc:1859] Sending 1024MB via ssl-enabled tcp socket: real 18.416s	user 16.156s	sys 10.284s
[       OK ] Parameters/TestRpc.TestPerformanceBySocketType/SSL_TCP (92577 ms)
[----------] 20 tests from Parameters/TestRpc (229833 ms total)

[----------] 1 test from Parameters/TestRpcSocketTxRxQueue
[ RUN      ] Parameters/TestRpcSocketTxRxQueue.OverCapacity/0
W20260927 19:40:55.483996   890 negotiation.cc:337] Failed RPC negotiation. Trace:
0927 19:40:55.092966 (+     0us) reactor.cc:625] Submitting negotiation task for client connection to 0.0.0.0:45423 (local address 127.0.0.1:35776)
0927 19:40:55.093486 (+   520us) negotiation.cc:107] Waiting for socket to connect
0927 19:40:55.093516 (+    30us) client_negotiation.cc:174] Beginning negotiation
0927 19:40:55.093700 (+   184us) client_negotiation.cc:252] Sending NEGOTIATE NegotiatePB request
0927 19:40:55.482819 (+389119us) negotiation.cc:327] Negotiation complete: Network error: Client connection negotiation failed: client connection to 0.0.0.0:45423: BlockingRecv error: recv error from unknown peer: Transport endpoint is not connected (error 107)
Metrics: {"client-negotiator.queue_time_us":148}
W20260927 19:40:55.484567   881 negotiation.cc:337] Failed RPC negotiation. Trace:
0927 19:40:55.080901 (+     0us) reactor.cc:625] Submitting negotiation task for client connection to 0.0.0.0:45423 (local address 127.0.0.1:35766)
0927 19:40:55.081448 (+   547us) negotiation.cc:107] Waiting for socket to connect
0927 19:40:55.081477 (+    29us) client_negotiation.cc:174] Beginning negotiation
0927 19:40:55.081659 (+   182us) client_negotiation.cc:252] Sending NEGOTIATE NegotiatePB request
0927 19:40:55.482883 (+401224us) negotiation.cc:327] Negotiation complete: Network error: Client connection negotiation failed: client connection to 0.0.0.0:45423: BlockingRecv error: recv error from unknown peer: Transport endpoint is not connected (error 107)
Metrics: {"client-negotiator.queue_time_us":151}
W20260927 19:40:55.484023   872 negotiation.cc:337] Failed RPC negotiation. Trace:
0927 19:40:55.073991 (+     0us) reactor.cc:625] Submitting negotiation task for client connection to 0.0.0.0:45423 (local address 127.0.0.1:35756)
0927 19:40:55.074515 (+   524us) negotiation.cc:107] Waiting for socket to connect
0927 19:40:55.074544 (+    29us) client_negotiation.cc:174] Beginning negotiation
0927 19:40:55.074716 (+   172us) client_negotiation.cc:252] Sending NEGOTIATE NegotiatePB request
0927 19:40:55.482928 (+408212us) negotiation.cc:327] Negotiation complete: Network error: Client connection negotiation failed: client connection to 0.0.0.0:45423: BlockingRecv error: recv error from unknown peer: Transport endpoint is not connected (error 107)
Metrics: {"client-negotiator.queue_time_us":116}
W20260927 19:40:55.486598   908 negotiation.cc:337] Failed RPC negotiation. Trace:
0927 19:40:55.116202 (+     0us) reactor.cc:625] Submitting negotiation task for client connection to 0.0.0.0:45423 (local address 127.0.0.1:35802)
0927 19:40:55.116728 (+   526us) negotiation.cc:107] Waiting for socket to connect
0927 19:40:55.116758 (+    30us) client_negotiation.cc:174] Beginning negotiation
0927 19:40:55.116947 (+   189us) client_negotiation.cc:252] Sending NEGOTIATE NegotiatePB request
0927 19:40:55.483717 (+366770us) negotiation.cc:327] Negotiation complete: Network error: Client connection negotiation failed: client connection to 0.0.0.0:45423: BlockingRecv error: recv error from unknown peer: Transport endpoint is not connected (error 107)
Metrics: {"client-negotiator.queue_time_us":128}
W20260927 19:40:55.486608   899 negotiation.cc:337] Failed RPC negotiation. Trace:
0927 19:40:55.104745 (+     0us) reactor.cc:625] Submitting negotiation task for client connection to 0.0.0.0:45423 (local address 127.0.0.1:35792)
0927 19:40:55.105273 (+   528us) negotiation.cc:107] Waiting for socket to connect
0927 19:40:55.105303 (+    30us) client_negotiation.cc:174] Beginning negotiation
0927 19:40:55.105486 (+   183us) client_negotiation.cc:252] Sending NEGOTIATE NegotiatePB request
0927 19:40:55.484384 (+378898us) negotiation.cc:327] Negotiation complete: Network error: Client connection negotiation failed: client connection to 0.0.0.0:45423: BlockingRecv error: recv error from unknown peer: Transport endpoint is not connected (error 107)
Metrics: {"client-negotiator.queue_time_us":135}
W20260927 19:40:55.486737   863 negotiation.cc:337] Failed RPC negotiation. Trace:
0927 19:40:55.067514 (+     0us) reactor.cc:625] Submitting negotiation task for client connection to 0.0.0.0:45423 (local address 127.0.0.1:35740)
0927 19:40:55.068178 (+   664us) negotiation.cc:107] Waiting for socket to connect
0927 19:40:55.068218 (+    40us) client_negotiation.cc:174] Beginning negotiation
0927 19:40:55.068670 (+   452us) client_negotiation.cc:252] Sending NEGOTIATE NegotiatePB request
0927 19:40:55.482819 (+414149us) negotiation.cc:327] Negotiation complete: Network error: Client connection negotiation failed: client connection to 0.0.0.0:45423: BlockingRecv error: recv error from unknown peer: Transport endpoint is not connected (error 107)
Metrics: {"client-negotiator.queue_time_us":153}
[       OK ] Parameters/TestRpcSocketTxRxQueue.OverCapacity/0 (1235 ms)
[----------] 1 test from Parameters/TestRpcSocketTxRxQueue (1235 ms total)

[----------] Global test environment tear-down
[==========] 21 tests from 2 test suites ran. (231070 ms total)
[  PASSED  ] 20 tests.
[  FAILED  ] 1 test, listed below:
[  FAILED  ] Parameters/TestRpc.TestCallWithChainCertAndChainCA/SSL_TCP, where GetParam() = (true, false)

 1 FAILED TEST