Diagnosed failure

Parameters/TestRpc.TestCallWithChainCertAndChainCA/SSL_TCP: /data0/somelongdirectorytoavoidrpathissues/src/kudu/src/kudu/rpc/rpc-test.cc:270: Failure
Failed
Bad status: Runtime error: could not verify certificate chain (error with cert: subject=CN = localhost, ST = sadfjas, C = AS, emailAddress = sdflkdsajf, O = lskdfjlsad, OU = sldfkja, issuer=C = AS, ST = ASDfkjdhf, L = lskdjf, O = saldfja, OU = skdjf, CN = localhost, emailAddress = sadjflkadsj): : certificate has expired
Google Test trace:
/data0/somelongdirectorytoavoidrpathissues/src/kudu/src/kudu/rpc/rpc-test.cc:267: Connecting to 0.0.0.0:46769
I20260928 02:35:38.755859  1039 test_util.cc:175] -----------------------------------------------
I20260928 02:35:38.755909  1039 test_util.cc:176] Had fatal failures, leaving test files at /tmp/dist-test-task54D1Aa/test-tmp/rpc-test.5.Parameters_TestRpc.TestCallWithChainCertAndChainCA_SSL_TCP.1790562938689371-1039-0

Full log

Note: This is test shard 6 of 8.
[==========] Running 21 tests from 2 test suites.
[----------] Global test environment set-up.
[----------] 20 tests from Parameters/TestRpc
[ RUN      ] Parameters/TestRpc.TestMessengerCreateDestroy/SSL_TCP
WARNING: Logging before InitGoogleLogging() is written to STDERR
I20260928 02:35:38.715986  1039 rpc-test.cc:169] started messenger TestCreateDestroy
[       OK ] Parameters/TestRpc.TestMessengerCreateDestroy/SSL_TCP (25 ms)
[ RUN      ] Parameters/TestRpc.TestNegotiationDeadlock/SSL_TCP
I20260928 02:35:38.731163  1059 acceptor_pool.cc:254] collecting diagnostics on the listening RPC socket 0.0.0.0:44645 every 8 connection(s)
I20260928 02:35:38.731172  1060 acceptor_pool.cc:254] collecting diagnostics on the listening RPC socket 0.0.0.0:44645 every 8 connection(s)
[       OK ] Parameters/TestRpc.TestNegotiationDeadlock/SSL_TCP (21 ms)
[ RUN      ] Parameters/TestRpc.TestCallWithChainCertAndChainCA/SSL_TCP
I20260928 02:35:38.751740  1076 acceptor_pool.cc:254] collecting diagnostics on the listening RPC socket 0.0.0.0:46769 every 8 connection(s)
I20260928 02:35:38.751740  1075 acceptor_pool.cc:254] collecting diagnostics on the listening RPC socket 0.0.0.0:46769 every 8 connection(s)
/data0/somelongdirectorytoavoidrpathissues/src/kudu/src/kudu/rpc/rpc-test.cc:270: Failure
Failed
Bad status: Runtime error: could not verify certificate chain (error with cert: subject=CN = localhost, ST = sadfjas, C = AS, emailAddress = sdflkdsajf, O = lskdfjlsad, OU = sldfkja, issuer=C = AS, ST = ASDfkjdhf, L = lskdjf, O = saldfja, OU = skdjf, CN = localhost, emailAddress = sadjflkadsj): : certificate has expired
Google Test trace:
/data0/somelongdirectorytoavoidrpathissues/src/kudu/src/kudu/rpc/rpc-test.cc:267: Connecting to 0.0.0.0:46769
I20260928 02:35:38.755859  1039 test_util.cc:175] -----------------------------------------------
I20260928 02:35:38.755909  1039 test_util.cc:176] Had fatal failures, leaving test files at /tmp/dist-test-task54D1Aa/test-tmp/rpc-test.5.Parameters_TestRpc.TestCallWithChainCertAndChainCA_SSL_TCP.1790562938689371-1039-0
[  FAILED  ] Parameters/TestRpc.TestCallWithChainCertAndChainCA/SSL_TCP, where GetParam() = (true, false) (17 ms)
[ RUN      ] Parameters/TestRpc.TestCallWithPasswordProtectedKey/SSL_TCP
I20260928 02:35:38.764735  1100 acceptor_pool.cc:254] collecting diagnostics on the listening RPC socket 0.0.0.0:33039 every 8 connection(s)
I20260928 02:35:38.764771  1101 acceptor_pool.cc:254] collecting diagnostics on the listening RPC socket 0.0.0.0:33039 every 8 connection(s)
[       OK ] Parameters/TestRpc.TestCallWithPasswordProtectedKey/SSL_TCP (21 ms)
[ RUN      ] Parameters/TestRpc.TestCallToBadServer/SSL_TCP
I20260928 02:35:38.797868  1039 rpc-test.cc:394] Status: Network error: Client connection negotiation failed: client connection to 0.0.0.0:0: connect: Connection refused (error 111)
I20260928 02:35:38.798197  1039 rpc-test.cc:394] Status: Network error: Client connection negotiation failed: client connection to 0.0.0.0:0: connect: Connection refused (error 111)
I20260928 02:35:38.798446  1039 rpc-test.cc:394] Status: Network error: Client connection negotiation failed: client connection to 0.0.0.0:0: connect: Connection refused (error 111)
I20260928 02:35:38.798631  1039 rpc-test.cc:394] Status: Network error: Client connection negotiation failed: client connection to 0.0.0.0:0: connect: Connection refused (error 111)
I20260928 02:35:38.798794  1039 rpc-test.cc:394] Status: Network error: Client connection negotiation failed: client connection to 0.0.0.0:0: connect: Connection refused (error 111)
[       OK ] Parameters/TestRpc.TestCallToBadServer/SSL_TCP (22 ms)
[ RUN      ] Parameters/TestRpc.TestWrongService/SSL_TCP
I20260928 02:35:38.828964  1135 acceptor_pool.cc:254] collecting diagnostics on the listening RPC socket 0.0.0.0:42155 every 8 connection(s)
I20260928 02:35:38.829011  1136 acceptor_pool.cc:254] collecting diagnostics on the listening RPC socket 0.0.0.0:42155 every 8 connection(s)
I20260928 02:35:38.837767  1134 messenger.cc:345] service WrongServiceName not registered on TestServer
[       OK ] Parameters/TestRpc.TestWrongService/SSL_TCP (39 ms)
[ RUN      ] Parameters/TestRpc.TestConnectionKeepalive/SSL_TCP
I20260928 02:35:38.849093  1158 acceptor_pool.cc:254] collecting diagnostics on the listening RPC socket 0.0.0.0:38359 every 8 connection(s)
I20260928 02:35:38.849135  1159 acceptor_pool.cc:254] collecting diagnostics on the listening RPC socket 0.0.0.0:38359 every 8 connection(s)
I20260928 02:35:38.849316  1039 rpc-test.cc:488] Connecting to 0.0.0.0:38359
[       OK ] Parameters/TestRpc.TestConnectionKeepalive/SSL_TCP (1030 ms)
[ RUN      ] Parameters/TestRpc.TestClientConnectionMetrics/SSL_TCP
I20260928 02:35:39.882061  1183 acceptor_pool.cc:254] collecting diagnostics on the listening RPC socket 0.0.0.0:37937 every 8 connection(s)
I20260928 02:35:39.882090  1184 acceptor_pool.cc:254] collecting diagnostics on the listening RPC socket 0.0.0.0:37937 every 8 connection(s)
I20260928 02:35:39.882256  1039 rpc-test.cc:569] Connecting to 0.0.0.0:37937
[       OK ] Parameters/TestRpc.TestClientConnectionMetrics/SSL_TCP (8509 ms)
[ RUN      ] Parameters/TestRpc.TestCredentialsPolicy/SSL_TCP
I20260928 02:35:48.392966  1206 acceptor_pool.cc:254] collecting diagnostics on the listening RPC socket 0.0.0.0:35487 every 8 connection(s)
I20260928 02:35:48.393010  1207 acceptor_pool.cc:254] collecting diagnostics on the listening RPC socket 0.0.0.0:35487 every 8 connection(s)
I20260928 02:35:48.393172  1039 rpc-test.cc:700] Connecting to 0.0.0.0:35487
[       OK ] Parameters/TestRpc.TestCredentialsPolicy/SSL_TCP (35 ms)
[ RUN      ] Parameters/TestRpc.TestCallLongerThanKeepalive/SSL_TCP
I20260928 02:35:48.434244  1231 acceptor_pool.cc:254] collecting diagnostics on the listening RPC socket 0.0.0.0:42891 every 8 connection(s)
I20260928 02:35:48.434279  1232 acceptor_pool.cc:254] collecting diagnostics on the listening RPC socket 0.0.0.0:42891 every 8 connection(s)
I20260928 02:35:48.480944  1234 rpc-test-base.h:222] got call: sleep_micros: 3000000 deferred: true
I20260928 02:35:51.481602  1234 rpcz_store.cc:275] Call kudu.rpc.GenericCalculatorService.Sleep from 127.0.0.1:58914 (request call id 0) took 3000 ms. Trace:
I20260928 02:35:51.481704  1234 rpcz_store.cc:276] 0928 02:35:48.480880 (+     0us) service_pool.cc:170] Inserting onto call queue
0928 02:35:48.480919 (+    39us) service_pool.cc:227] Handling call
0928 02:35:51.481586 (+3000667us) inbound_call.cc:173] Queueing success response
Metrics: {}
[       OK ] Parameters/TestRpc.TestCallLongerThanKeepalive/SSL_TCP (3068 ms)
[ RUN      ] Parameters/TestRpc.TestRpcSidecar/SSL_TCP
I20260928 02:35:51.501367  1256 acceptor_pool.cc:254] collecting diagnostics on the listening RPC socket 0.0.0.0:34965 every 8 connection(s)
I20260928 02:35:51.501415  1257 acceptor_pool.cc:254] collecting diagnostics on the listening RPC socket 0.0.0.0:34965 every 8 connection(s)
[       OK ] Parameters/TestRpc.TestRpcSidecar/SSL_TCP (61 ms)
[ RUN      ] Parameters/TestRpc.TestRpcSidecarLimits/SSL_TCP
I20260928 02:35:53.267184  1282 acceptor_pool.cc:254] collecting diagnostics on the listening RPC socket 0.0.0.0:44069 every 8 connection(s)
I20260928 02:35:53.267155  1281 acceptor_pool.cc:254] collecting diagnostics on the listening RPC socket 0.0.0.0:44069 every 8 connection(s)
W20260928 02:35:53.285229  1039 serialization.cc:72] Serialized kudu.rpc_test.PushStringsRequestPB (2147483654 bytes) is larger than the maximum configured RPC message size (52428800 bytes). Sending anyway, but peer may reject the data.
W20260928 02:35:53.288283  1278 connection.cc:535] server connection from 127.0.0.1:44722 recv error: Network error: RPC frame had a length of 2147483714, but we only support messages up to 52428800 bytes long.
W20260928 02:35:53.288333  1278 connection.cc:158] shutting down server connection from 127.0.0.1:44722 with pending inbound data: 4/2147483714 bytes received; last active 0 ns ago: status Network error: RPC frame had a length of 2147483714, but we only support messages up to 52428800 bytes long.
W20260928 02:35:53.288533  1294 connection.cc:196] Error closing socket: Network error: TlsSocket::Close: Connection reset by peer
I20260928 02:35:53.299692  1306 acceptor_pool.cc:254] collecting diagnostics on the listening RPC socket 0.0.0.0:40705 every 8 connection(s)
I20260928 02:35:53.299798  1307 acceptor_pool.cc:254] collecting diagnostics on the listening RPC socket 0.0.0.0:40705 every 8 connection(s)
W20260928 02:35:57.108448  1304 connection.cc:577] server connection from 127.0.0.1:54090: received bad data: 'Corruption: Invalid packet: message had a length of 2147483710, but we only support messages up to 2147483647 bytes
'
[       OK ] Parameters/TestRpc.TestRpcSidecarLimits/SSL_TCP (5565 ms)
[ RUN      ] Parameters/TestRpc.TestCallTimeoutDoesntAffectNegotiation/SSL_TCP
I20260928 02:35:57.127161  1331 acceptor_pool.cc:254] collecting diagnostics on the listening RPC socket 0.0.0.0:35143 every 8 connection(s)
I20260928 02:35:57.127188  1332 acceptor_pool.cc:254] collecting diagnostics on the listening RPC socket 0.0.0.0:35143 every 8 connection(s)
W20260928 02:35:57.134196  1327 negotiation.cc:266] Injecting 500ms delay in negotiation
I20260928 02:35:57.184490  1039 rpc-test-base.h:595] status: Timed out: connection negotiation to 0.0.0.0:35143 for RPC Sleep timed out after 0.050s (ON_OUTBOUND_QUEUE), seconds elapsed: 0.0506485
[       OK ] Parameters/TestRpc.TestCallTimeoutDoesntAffectNegotiation/SSL_TCP (528 ms)
[ RUN      ] Parameters/TestRpc.TestRpcHandlerLatencyMetric/SSL_TCP
I20260928 02:35:57.653548  1356 acceptor_pool.cc:254] collecting diagnostics on the listening RPC socket 0.0.0.0:37095 every 8 connection(s)
I20260928 02:35:57.653573  1357 acceptor_pool.cc:254] collecting diagnostics on the listening RPC socket 0.0.0.0:37095 every 8 connection(s)
I20260928 02:35:57.688345  1039 rpc-test.cc:1236] Sleep() min lat: 20344
I20260928 02:35:57.688416  1039 rpc-test.cc:1237] Sleep() mean lat: 20344
I20260928 02:35:57.688442  1039 rpc-test.cc:1238] Sleep() max lat: 20344
I20260928 02:35:57.688455  1039 rpc-test.cc:1239] Sleep() #calls: 1
[       OK ] Parameters/TestRpc.TestRpcHandlerLatencyMetric/SSL_TCP (51 ms)
[ RUN      ] Parameters/TestRpc.TimedOutOnResponseMetricServiceQueue/SSL_TCP
I20260928 02:35:57.713527  1382 acceptor_pool.cc:254] collecting diagnostics on the listening RPC socket 0.0.0.0:41851 every 8 connection(s)
I20260928 02:35:57.713575  1383 acceptor_pool.cc:254] collecting diagnostics on the listening RPC socket 0.0.0.0:41851 every 8 connection(s)
W20260928 02:35:57.766207  1384 rpcz_store.cc:267] Call kudu.rpc_test.CalculatorService.Sleep from 127.0.0.1:60512 (request call id 2) took 20 ms (client timeout 20 ms). Trace:
W20260928 02:35:57.766343  1384 rpcz_store.cc:269] 0928 02:35:57.745942 (+     0us) service_pool.cc:170] Inserting onto call queue
0928 02:35:57.766178 (+ 20236us) service_pool.cc:214] Skipping call since client already timed out
0928 02:35:57.766190 (+    12us) inbound_call.cc:173] Queueing failure response
Metrics: {}
[       OK ] Parameters/TestRpc.TimedOutOnResponseMetricServiceQueue/SSL_TCP (77 ms)
[ RUN      ] Parameters/TestRpc.RpcPendingConnectionsMetric/SSL_TCP
I20260928 02:35:57.769615  1405 acceptor_pool.cc:254] collecting diagnostics on the listening RPC socket 0.0.0.0:44607 every 8 connection(s)
I20260928 02:35:57.769680  1406 acceptor_pool.cc:254] collecting diagnostics on the listening RPC socket 0.0.0.0:44607 every 8 connection(s)
W20260928 02:35:57.778334  1401 negotiation.cc:337] Failed RPC negotiation. Trace:
0928 02:35:57.778070 (+     0us) reactor.cc:625] Submitting negotiation task for server connection from 127.0.0.1:56072 (local address 127.0.0.1:44607)
0928 02:35:57.778143 (+    73us) server_negotiation.cc:206] Beginning negotiation
0928 02:35:57.778146 (+     3us) server_negotiation.cc:399] Waiting for connection header
0928 02:35:57.778244 (+    98us) negotiation.cc:327] Negotiation complete: Network error: Server connection negotiation failed: server connection from 127.0.0.1:56072: BlockingRecv error: recv got EOF from 127.0.0.1:56072 (error 108)
Metrics: {"server-negotiator.queue_time_us":21}
[       OK ] Parameters/TestRpc.RpcPendingConnectionsMetric/SSL_TCP (21 ms)
[ RUN      ] Parameters/TestRpc.TestRpcContextClientDeadline/SSL_TCP
I20260928 02:35:57.807298  1421 acceptor_pool.cc:254] collecting diagnostics on the listening RPC socket 0.0.0.0:40249 every 8 connection(s)
I20260928 02:35:57.807337  1422 acceptor_pool.cc:254] collecting diagnostics on the listening RPC socket 0.0.0.0:40249 every 8 connection(s)
[       OK ] Parameters/TestRpc.TestRpcContextClientDeadline/SSL_TCP (67 ms)
[ RUN      ] Parameters/TestRpc.TestApplicationFeatureFlagUnsupportedServer/SSL_TCP
I20260928 02:35:57.865568  1446 acceptor_pool.cc:254] collecting diagnostics on the listening RPC socket 0.0.0.0:40607 every 8 connection(s)
I20260928 02:35:57.865638  1447 acceptor_pool.cc:254] collecting diagnostics on the listening RPC socket 0.0.0.0:40607 every 8 connection(s)
[       OK ] Parameters/TestRpc.TestApplicationFeatureFlagUnsupportedServer/SSL_TCP (29 ms)
[ RUN      ] Parameters/TestRpc.TestCancellationAsync/SSL_TCP
I20260928 02:35:57.897632  1471 acceptor_pool.cc:254] collecting diagnostics on the listening RPC socket 0.0.0.0:35325 every 8 connection(s)
I20260928 02:35:57.897686  1472 acceptor_pool.cc:254] collecting diagnostics on the listening RPC socket 0.0.0.0:35325 every 8 connection(s)
I20260928 02:35:57.897866  1039 rpc-test.cc:1716] Connecting to 0.0.0.0:35325
I20260928 02:35:57.903187  1039 test_util.cc:268] Using random seed: -317864625
I20260928 02:35:57.918650  1475 rpc-test-base.h:240] got call: sleep_micros: 500 pattern: 4294967295 num_repetitions: 2097152 sidecar_idx: 0
I20260928 02:35:57.931279  1475 rpc-test-base.h:240] got call: sleep_micros: 500 pattern: 4294967295 num_repetitions: 2097152 sidecar_idx: 0
I20260928 02:35:57.943641  1475 rpc-test-base.h:240] got call: sleep_micros: 500 pattern: 4294967295 num_repetitions: 2097152 sidecar_idx: 0
I20260928 02:35:57.957397  1475 rpc-test-base.h:240] got call: sleep_micros: 500 pattern: 4294967295 num_repetitions: 2097152 sidecar_idx: 0
I20260928 02:35:57.970775  1475 rpc-test-base.h:240] got call: sleep_micros: 500 pattern: 4294967295 num_repetitions: 2097152 sidecar_idx: 0
I20260928 02:35:57.985116  1475 rpc-test-base.h:240] got call: sleep_micros: 500 pattern: 4294967295 num_repetitions: 2097152 sidecar_idx: 0
I20260928 02:35:57.998638  1475 rpc-test-base.h:240] got call: sleep_micros: 500 pattern: 4294967295 num_repetitions: 2097152 sidecar_idx: 0
I20260928 02:35:58.012593  1475 rpc-test-base.h:240] got call: sleep_micros: 500 pattern: 4294967295 num_repetitions: 2097152 sidecar_idx: 0
W20260928 02:35:58.016067  1469 connection.cc:441] server connection from 127.0.0.1:45918 torn down before Call kudu.rpc.GenericCalculatorService.SleepWithSidecar from 127.0.0.1:45918 (request call id 9) could send its response
[       OK ] Parameters/TestRpc.TestCancellationAsync/SSL_TCP (130 ms)
[ RUN      ] Parameters/TestRpc.TestPerformanceBySocketType/SSL_TCP
I20260928 02:35:58.030946  1496 acceptor_pool.cc:254] collecting diagnostics on the listening RPC socket 0.0.0.0:45679 every 8 connection(s)
I20260928 02:35:58.030947  1497 acceptor_pool.cc:254] collecting diagnostics on the listening RPC socket 0.0.0.0:45679 every 8 connection(s)
I20260928 02:35:58.031114  1039 rpc-test.cc:1846] Connecting to 0.0.0.0:45679
I20260928 02:35:59.743948  1039 rpc-test.cc:1859] Sending 1024MB via ssl-enabled tcp socket: real 1.704s	user 1.457s	sys 1.563s
I20260928 02:36:01.329257  1039 rpc-test.cc:1859] Sending 1024MB via ssl-enabled tcp socket: real 1.585s	user 1.378s	sys 1.449s
I20260928 02:36:02.972537  1039 rpc-test.cc:1859] Sending 1024MB via ssl-enabled tcp socket: real 1.643s	user 1.488s	sys 1.417s
I20260928 02:36:04.545855  1039 rpc-test.cc:1859] Sending 1024MB via ssl-enabled tcp socket: real 1.573s	user 1.379s	sys 1.429s
I20260928 02:36:06.160933  1039 rpc-test.cc:1859] Sending 1024MB via ssl-enabled tcp socket: real 1.615s	user 1.447s	sys 1.441s
[       OK ] Parameters/TestRpc.TestPerformanceBySocketType/SSL_TCP (8145 ms)
[----------] 20 tests from Parameters/TestRpc (27471 ms total)

[----------] 1 test from Parameters/TestRpcSocketTxRxQueue
[ RUN      ] Parameters/TestRpcSocketTxRxQueue.OverCapacity/0
W20260928 02:36:06.428896  1540 negotiation.cc:337] Failed RPC negotiation. Trace:
0928 02:36:06.167261 (+     0us) reactor.cc:625] Submitting negotiation task for client connection to 0.0.0.0:44207 (local address 127.0.0.1:58036)
0928 02:36:06.167312 (+    51us) negotiation.cc:107] Waiting for socket to connect
0928 02:36:06.167321 (+     9us) client_negotiation.cc:174] Beginning negotiation
0928 02:36:06.167360 (+    39us) client_negotiation.cc:252] Sending NEGOTIATE NegotiatePB request
0928 02:36:06.428780 (+261420us) negotiation.cc:327] Negotiation complete: Network error: Client connection negotiation failed: client connection to 0.0.0.0:44207: BlockingRecv error: recv error from unknown peer: Transport endpoint is not connected (error 107)
Metrics: {"client-negotiator.queue_time_us":32}
W20260928 02:36:06.428895  1513 negotiation.cc:337] Failed RPC negotiation. Trace:
0928 02:36:06.164401 (+     0us) reactor.cc:625] Submitting negotiation task for client connection to 0.0.0.0:44207 (local address 127.0.0.1:58012)
0928 02:36:06.164464 (+    63us) negotiation.cc:107] Waiting for socket to connect
0928 02:36:06.164476 (+    12us) client_negotiation.cc:174] Beginning negotiation
0928 02:36:06.164528 (+    52us) client_negotiation.cc:252] Sending NEGOTIATE NegotiatePB request
0928 02:36:06.428754 (+264226us) negotiation.cc:327] Negotiation complete: Network error: Client connection negotiation failed: client connection to 0.0.0.0:44207: BlockingRecv error: recv error from unknown peer: Transport endpoint is not connected (error 107)
Metrics: {"client-negotiator.queue_time_us":36}
W20260928 02:36:06.429035  1522 negotiation.cc:337] Failed RPC negotiation. Trace:
0928 02:36:06.165469 (+     0us) reactor.cc:625] Submitting negotiation task for client connection to 0.0.0.0:44207 (local address 127.0.0.1:58022)
0928 02:36:06.165510 (+    41us) negotiation.cc:107] Waiting for socket to connect
0928 02:36:06.165519 (+     9us) client_negotiation.cc:174] Beginning negotiation
0928 02:36:06.165561 (+    42us) client_negotiation.cc:252] Sending NEGOTIATE NegotiatePB request
0928 02:36:06.428864 (+263303us) negotiation.cc:327] Negotiation complete: Network error: Client connection negotiation failed: client connection to 0.0.0.0:44207: BlockingRecv error: recv error from unknown peer: Transport endpoint is not connected (error 107)
Metrics: {"client-negotiator.queue_time_us":17}
W20260928 02:36:06.429035  1531 negotiation.cc:337] Failed RPC negotiation. Trace:
0928 02:36:06.166316 (+     0us) reactor.cc:625] Submitting negotiation task for client connection to 0.0.0.0:44207 (local address 127.0.0.1:58024)
0928 02:36:06.166369 (+    53us) negotiation.cc:107] Waiting for socket to connect
0928 02:36:06.166378 (+     9us) client_negotiation.cc:174] Beginning negotiation
0928 02:36:06.166417 (+    39us) client_negotiation.cc:252] Sending NEGOTIATE NegotiatePB request
0928 02:36:06.428863 (+262446us) negotiation.cc:327] Negotiation complete: Network error: Client connection negotiation failed: client connection to 0.0.0.0:44207: BlockingRecv error: recv error from unknown peer: Transport endpoint is not connected (error 107)
Metrics: {"client-negotiator.queue_time_us":34}
W20260928 02:36:06.429297  1549 negotiation.cc:337] Failed RPC negotiation. Trace:
0928 02:36:06.168175 (+     0us) reactor.cc:625] Submitting negotiation task for client connection to 0.0.0.0:44207 (local address 127.0.0.1:58052)
0928 02:36:06.168230 (+    55us) negotiation.cc:107] Waiting for socket to connect
0928 02:36:06.168256 (+    26us) client_negotiation.cc:174] Beginning negotiation
0928 02:36:06.168301 (+    45us) client_negotiation.cc:252] Sending NEGOTIATE NegotiatePB request
0928 02:36:06.429253 (+260952us) negotiation.cc:327] Negotiation complete: Network error: Client connection negotiation failed: client connection to 0.0.0.0:44207: BlockingRecv error: recv error from unknown peer: Transport endpoint is not connected (error 107)
Metrics: {"client-negotiator.queue_time_us":35}
W20260928 02:36:06.429416  1558 negotiation.cc:337] Failed RPC negotiation. Trace:
0928 02:36:06.169105 (+     0us) reactor.cc:625] Submitting negotiation task for client connection to 0.0.0.0:44207 (local address 127.0.0.1:58062)
0928 02:36:06.169159 (+    54us) negotiation.cc:107] Waiting for socket to connect
0928 02:36:06.169168 (+     9us) client_negotiation.cc:174] Beginning negotiation
0928 02:36:06.169214 (+    46us) client_negotiation.cc:252] Sending NEGOTIATE NegotiatePB request
0928 02:36:06.429282 (+260068us) negotiation.cc:327] Negotiation complete: Network error: Client connection negotiation failed: client connection to 0.0.0.0:44207: BlockingRecv error: recv error from unknown peer: Transport endpoint is not connected (error 107)
Metrics: {"client-negotiator.queue_time_us":34}
[       OK ] Parameters/TestRpcSocketTxRxQueue.OverCapacity/0 (1040 ms)
[----------] 1 test from Parameters/TestRpcSocketTxRxQueue (1040 ms total)

[----------] Global test environment tear-down
[==========] 21 tests from 2 test suites ran. (28511 ms total)
[  PASSED  ] 20 tests.
[  FAILED  ] 1 test, listed below:
[  FAILED  ] Parameters/TestRpc.TestCallWithChainCertAndChainCA/SSL_TCP, where GetParam() = (true, false)

 1 FAILED TEST