Diagnosed failure
Parameters/TestRpc.TestCallWithChainCertAndChainCA/SSL_UnixSocket: /data0/somelongdirectorytoavoidrpathissues/src/kudu/src/kudu/rpc/rpc-test.cc:270: Failure
Failed
Bad status: Runtime error: could not verify certificate chain (error with cert: subject=CN = localhost, ST = sadfjas, C = AS, emailAddress = sdflkdsajf, O = lskdfjlsad, OU = sldfkja, issuer=C = AS, ST = ASDfkjdhf, L = lskdjf, O = saldfja, OU = skdjf, CN = localhost, emailAddress = sadjflkadsj): : certificate has expired
Google Test trace:
/data0/somelongdirectorytoavoidrpathissues/src/kudu/src/kudu/rpc/rpc-test.cc:267: Connecting to unix:/tmp/dist-test-taskogTzCc/test-tmp/rpc-test-13043275374645c8bc66eac2395d88e4.sock
I20260925 18:59:55.496824 383 test_util.cc:175] -----------------------------------------------
I20260925 18:59:55.496872 383 test_util.cc:176] Had fatal failures, leaving test files at /tmp/dist-test-taskogTzCc/test-tmp/rpc-test.6.Parameters_TestRpc.TestCallWithChainCertAndChainCA_SSL_UnixSocket.1790362795430543-383-0
Full log
Note: This is test shard 7 of 8.
[==========] Running 21 tests from 2 test suites.
[----------] Global test environment set-up.
[----------] 20 tests from Parameters/TestRpc
[ RUN ] Parameters/TestRpc.TestMessengerCreateDestroy/SSL_UnixSocket
WARNING: Logging before InitGoogleLogging() is written to STDERR
I20260925 18:59:55.453029 383 rpc-test.cc:169] started messenger TestCreateDestroy
[ OK ] Parameters/TestRpc.TestMessengerCreateDestroy/SSL_UnixSocket (20 ms)
[ RUN ] Parameters/TestRpc.TestNegotiationDeadlock/SSL_UnixSocket
I20260925 18:59:55.465770 403 acceptor_pool.cc:254] collecting diagnostics on the listening RPC socket unix:/tmp/dist-test-taskogTzCc/test-tmp/rpc-test-ac27d89a91c84af8a0d20af3a722be08.sock every 8 connection(s)
I20260925 18:59:55.465770 404 acceptor_pool.cc:254] collecting diagnostics on the listening RPC socket unix:/tmp/dist-test-taskogTzCc/test-tmp/rpc-test-ac27d89a91c84af8a0d20af3a722be08.sock every 8 connection(s)
[ OK ] Parameters/TestRpc.TestNegotiationDeadlock/SSL_UnixSocket (18 ms)
[ RUN ] Parameters/TestRpc.TestCallWithChainCertAndChainCA/SSL_UnixSocket
I20260925 18:59:55.493006 419 acceptor_pool.cc:254] collecting diagnostics on the listening RPC socket unix:/tmp/dist-test-taskogTzCc/test-tmp/rpc-test-13043275374645c8bc66eac2395d88e4.sock every 8 connection(s)
I20260925 18:59:55.493027 420 acceptor_pool.cc:254] collecting diagnostics on the listening RPC socket unix:/tmp/dist-test-taskogTzCc/test-tmp/rpc-test-13043275374645c8bc66eac2395d88e4.sock every 8 connection(s)
/data0/somelongdirectorytoavoidrpathissues/src/kudu/src/kudu/rpc/rpc-test.cc:270: Failure
Failed
Bad status: Runtime error: could not verify certificate chain (error with cert: subject=CN = localhost, ST = sadfjas, C = AS, emailAddress = sdflkdsajf, O = lskdfjlsad, OU = sldfkja, issuer=C = AS, ST = ASDfkjdhf, L = lskdjf, O = saldfja, OU = skdjf, CN = localhost, emailAddress = sadjflkadsj): : certificate has expired
Google Test trace:
/data0/somelongdirectorytoavoidrpathissues/src/kudu/src/kudu/rpc/rpc-test.cc:267: Connecting to unix:/tmp/dist-test-taskogTzCc/test-tmp/rpc-test-13043275374645c8bc66eac2395d88e4.sock
I20260925 18:59:55.496824 383 test_util.cc:175] -----------------------------------------------
I20260925 18:59:55.496872 383 test_util.cc:176] Had fatal failures, leaving test files at /tmp/dist-test-taskogTzCc/test-tmp/rpc-test.6.Parameters_TestRpc.TestCallWithChainCertAndChainCA_SSL_UnixSocket.1790362795430543-383-0
[ FAILED ] Parameters/TestRpc.TestCallWithChainCertAndChainCA/SSL_UnixSocket, where GetParam() = (true, true) (24 ms)
[ RUN ] Parameters/TestRpc.TestCallWithPasswordProtectedKey/SSL_UnixSocket
I20260925 18:59:55.506768 444 acceptor_pool.cc:254] collecting diagnostics on the listening RPC socket unix:/tmp/dist-test-taskogTzCc/test-tmp/rpc-test-875f9716d45e4a52a9f79bc71d29ecad.sock every 8 connection(s)
I20260925 18:59:55.506803 445 acceptor_pool.cc:254] collecting diagnostics on the listening RPC socket unix:/tmp/dist-test-taskogTzCc/test-tmp/rpc-test-875f9716d45e4a52a9f79bc71d29ecad.sock every 8 connection(s)
W20260925 18:59:55.516942 441 connection.cc:196] Error closing socket: Network error: TlsSocket::Close: Broken pipe
[ OK ] Parameters/TestRpc.TestCallWithPasswordProtectedKey/SSL_UnixSocket (21 ms)
[ RUN ] Parameters/TestRpc.TestCallToBadServer/SSL_UnixSocket
I20260925 18:59:55.547851 383 rpc-test.cc:394] Status: Network error: Client connection negotiation failed: client connection to 0.0.0.0:0: connect: Connection refused (error 111)
I20260925 18:59:55.548110 383 rpc-test.cc:394] Status: Network error: Client connection negotiation failed: client connection to 0.0.0.0:0: connect: Connection refused (error 111)
I20260925 18:59:55.548265 383 rpc-test.cc:394] Status: Network error: Client connection negotiation failed: client connection to 0.0.0.0:0: connect: Connection refused (error 111)
I20260925 18:59:55.548399 383 rpc-test.cc:394] Status: Network error: Client connection negotiation failed: client connection to 0.0.0.0:0: connect: Connection refused (error 111)
I20260925 18:59:55.548563 383 rpc-test.cc:394] Status: Network error: Client connection negotiation failed: client connection to 0.0.0.0:0: connect: Connection refused (error 111)
[ OK ] Parameters/TestRpc.TestCallToBadServer/SSL_UnixSocket (30 ms)
[ RUN ] Parameters/TestRpc.TestWrongService/SSL_UnixSocket
I20260925 18:59:55.556782 479 acceptor_pool.cc:254] collecting diagnostics on the listening RPC socket unix:/tmp/dist-test-taskogTzCc/test-tmp/rpc-test-da17980a17f5460894452345f7b91469.sock every 8 connection(s)
I20260925 18:59:55.556808 480 acceptor_pool.cc:254] collecting diagnostics on the listening RPC socket unix:/tmp/dist-test-taskogTzCc/test-tmp/rpc-test-da17980a17f5460894452345f7b91469.sock every 8 connection(s)
I20260925 18:59:55.570266 476 messenger.cc:345] service WrongServiceName not registered on TestServer
[ OK ] Parameters/TestRpc.TestWrongService/SSL_UnixSocket (22 ms)
[ RUN ] Parameters/TestRpc.TestConnectionKeepalive/SSL_UnixSocket
I20260925 18:59:55.598405 502 acceptor_pool.cc:254] collecting diagnostics on the listening RPC socket unix:/tmp/dist-test-taskogTzCc/test-tmp/rpc-test-9ec718d39285409f83a4e7ab5269c2d0.sock every 8 connection(s)
I20260925 18:59:55.598441 503 acceptor_pool.cc:254] collecting diagnostics on the listening RPC socket unix:/tmp/dist-test-taskogTzCc/test-tmp/rpc-test-9ec718d39285409f83a4e7ab5269c2d0.sock every 8 connection(s)
I20260925 18:59:55.598574 383 rpc-test.cc:488] Connecting to unix:/tmp/dist-test-taskogTzCc/test-tmp/rpc-test-9ec718d39285409f83a4e7ab5269c2d0.sock
W20260925 18:59:56.073258 515 connection.cc:196] Error closing socket: Network error: TlsSocket::Close: Broken pipe
[ OK ] Parameters/TestRpc.TestConnectionKeepalive/SSL_UnixSocket (1051 ms)
[ RUN ] Parameters/TestRpc.TestClientConnectionMetrics/SSL_UnixSocket
I20260925 18:59:56.629091 527 acceptor_pool.cc:254] collecting diagnostics on the listening RPC socket unix:/tmp/dist-test-taskogTzCc/test-tmp/rpc-test-ff3f0637997f4a05b850a443148e0558.sock every 8 connection(s)
I20260925 18:59:56.629141 528 acceptor_pool.cc:254] collecting diagnostics on the listening RPC socket unix:/tmp/dist-test-taskogTzCc/test-tmp/rpc-test-ff3f0637997f4a05b850a443148e0558.sock every 8 connection(s)
I20260925 18:59:56.629272 383 rpc-test.cc:569] Connecting to unix:/tmp/dist-test-taskogTzCc/test-tmp/rpc-test-ff3f0637997f4a05b850a443148e0558.sock
W20260925 19:00:04.709437 524 connection.cc:196] Error closing socket: Network error: TlsSocket::Close: Broken pipe
[ OK ] Parameters/TestRpc.TestClientConnectionMetrics/SSL_UnixSocket (8086 ms)
[ RUN ] Parameters/TestRpc.TestCredentialsPolicy/SSL_UnixSocket
I20260925 19:00:04.728209 550 acceptor_pool.cc:254] collecting diagnostics on the listening RPC socket unix:/tmp/dist-test-taskogTzCc/test-tmp/rpc-test-7c47bb2caf574725846458af225e550e.sock every 8 connection(s)
I20260925 19:00:04.728235 551 acceptor_pool.cc:254] collecting diagnostics on the listening RPC socket unix:/tmp/dist-test-taskogTzCc/test-tmp/rpc-test-7c47bb2caf574725846458af225e550e.sock every 8 connection(s)
I20260925 19:00:04.728365 383 rpc-test.cc:700] Connecting to unix:/tmp/dist-test-taskogTzCc/test-tmp/rpc-test-7c47bb2caf574725846458af225e550e.sock
W20260925 19:00:04.745608 549 connection.cc:196] Error closing socket: Network error: TlsSocket::Close: Broken pipe
[ OK ] Parameters/TestRpc.TestCredentialsPolicy/SSL_UnixSocket (39 ms)
[ RUN ] Parameters/TestRpc.TestCallLongerThanKeepalive/SSL_UnixSocket
I20260925 19:00:04.773571 575 acceptor_pool.cc:254] collecting diagnostics on the listening RPC socket unix:/tmp/dist-test-taskogTzCc/test-tmp/rpc-test-ee64189d1c854a708dc09d9796fa0ca5.sock every 8 connection(s)
I20260925 19:00:04.773581 576 acceptor_pool.cc:254] collecting diagnostics on the listening RPC socket unix:/tmp/dist-test-taskogTzCc/test-tmp/rpc-test-ee64189d1c854a708dc09d9796fa0ca5.sock every 8 connection(s)
I20260925 19:00:04.797765 579 rpc-test-base.h:222] got call: sleep_micros: 3000000 deferred: true
I20260925 19:00:07.798583 579 rpcz_store.cc:275] Call kudu.rpc.GenericCalculatorService.Sleep from unix:<unnamed> (request call id 0) took 3000 ms. Trace:
I20260925 19:00:07.798684 579 rpcz_store.cc:276] 0925 19:00:04.797718 (+ 0us) service_pool.cc:170] Inserting onto call queue
0925 19:00:04.797746 (+ 28us) service_pool.cc:227] Handling call
0925 19:00:07.798567 (+3000821us) inbound_call.cc:173] Queueing success response
Metrics: {}
W20260925 19:00:07.799584 572 connection.cc:196] Error closing socket: Network error: TlsSocket::Close: Broken pipe
[ OK ] Parameters/TestRpc.TestCallLongerThanKeepalive/SSL_UnixSocket (3050 ms)
[ RUN ] Parameters/TestRpc.TestRpcSidecar/SSL_UnixSocket
I20260925 19:00:07.819685 600 acceptor_pool.cc:254] collecting diagnostics on the listening RPC socket unix:/tmp/dist-test-taskogTzCc/test-tmp/rpc-test-726ecd987b374c2da182b809f7d7caec.sock every 8 connection(s)
I20260925 19:00:07.819715 601 acceptor_pool.cc:254] collecting diagnostics on the listening RPC socket unix:/tmp/dist-test-taskogTzCc/test-tmp/rpc-test-726ecd987b374c2da182b809f7d7caec.sock every 8 connection(s)
[ OK ] Parameters/TestRpc.TestRpcSidecar/SSL_UnixSocket (54 ms)
[ RUN ] Parameters/TestRpc.TestRpcSidecarLimits/SSL_UnixSocket
I20260925 19:00:09.533099 625 acceptor_pool.cc:254] collecting diagnostics on the listening RPC socket unix:/tmp/dist-test-taskogTzCc/test-tmp/rpc-test-0277bf57e63d454dad1322cd7593f450.sock every 8 connection(s)
I20260925 19:00:09.533149 626 acceptor_pool.cc:254] collecting diagnostics on the listening RPC socket unix:/tmp/dist-test-taskogTzCc/test-tmp/rpc-test-0277bf57e63d454dad1322cd7593f450.sock every 8 connection(s)
W20260925 19:00:09.547832 383 serialization.cc:72] Serialized kudu.rpc_test.PushStringsRequestPB (2147483654 bytes) is larger than the maximum configured RPC message size (52428800 bytes). Sending anyway, but peer may reject the data.
W20260925 19:00:09.550797 622 connection.cc:535] server connection from unix:<unnamed> recv error: Network error: RPC frame had a length of 2147483714, but we only support messages up to 52428800 bytes long.
W20260925 19:00:09.550869 622 connection.cc:158] shutting down server connection from unix:<unnamed> with pending inbound data: 4/2147483714 bytes received; last active 0 ns ago: status Network error: RPC frame had a length of 2147483714, but we only support messages up to 52428800 bytes long.
W20260925 19:00:09.551033 638 connection.cc:196] Error closing socket: Network error: TlsSocket::Close: Broken pipe
I20260925 19:00:09.563725 650 acceptor_pool.cc:254] collecting diagnostics on the listening RPC socket unix:/tmp/dist-test-taskogTzCc/test-tmp/rpc-test-0277bf57e63d454dad1322cd7593f450.sock every 8 connection(s)
I20260925 19:00:09.563738 651 acceptor_pool.cc:254] collecting diagnostics on the listening RPC socket unix:/tmp/dist-test-taskogTzCc/test-tmp/rpc-test-0277bf57e63d454dad1322cd7593f450.sock every 8 connection(s)
W20260925 19:00:13.779130 647 connection.cc:577] server connection from unix:<unnamed>: received bad data: 'Corruption: Invalid packet: message had a length of 2147483710, but we only support messages up to 2147483647 bytes
'
W20260925 19:00:13.779454 663 connection.cc:196] Error closing socket: Network error: TlsSocket::Close: Broken pipe
[ OK ] Parameters/TestRpc.TestRpcSidecarLimits/SSL_UnixSocket (5925 ms)
[ RUN ] Parameters/TestRpc.TestCallTimeoutDoesntAffectNegotiation/SSL_UnixSocket
I20260925 19:00:13.815232 676 acceptor_pool.cc:254] collecting diagnostics on the listening RPC socket unix:/tmp/dist-test-taskogTzCc/test-tmp/rpc-test-1c91932577b94eb48184b0fc37e24a91.sock every 8 connection(s)
I20260925 19:00:13.815217 675 acceptor_pool.cc:254] collecting diagnostics on the listening RPC socket unix:/tmp/dist-test-taskogTzCc/test-tmp/rpc-test-1c91932577b94eb48184b0fc37e24a91.sock every 8 connection(s)
W20260925 19:00:13.828267 671 negotiation.cc:266] Injecting 500ms delay in negotiation
I20260925 19:00:13.878628 383 rpc-test-base.h:595] status: Timed out: connection negotiation to unix:/tmp/dist-test-taskogTzCc/test-tmp/rpc-test-1c91932577b94eb48184b0fc37e24a91.sock for RPC Sleep timed out after 0.050s (ON_OUTBOUND_QUEUE), seconds elapsed: 0.0506667
[ OK ] Parameters/TestRpc.TestCallTimeoutDoesntAffectNegotiation/SSL_UnixSocket (551 ms)
[ RUN ] Parameters/TestRpc.TestRpcHandlerLatencyMetric/SSL_UnixSocket
I20260925 19:00:14.354940 700 acceptor_pool.cc:254] collecting diagnostics on the listening RPC socket unix:/tmp/dist-test-taskogTzCc/test-tmp/rpc-test-b6a6750d38ce45bd98486e5cbc49bc16.sock every 8 connection(s)
I20260925 19:00:14.354969 701 acceptor_pool.cc:254] collecting diagnostics on the listening RPC socket unix:/tmp/dist-test-taskogTzCc/test-tmp/rpc-test-b6a6750d38ce45bd98486e5cbc49bc16.sock every 8 connection(s)
I20260925 19:00:14.383883 383 rpc-test.cc:1236] Sleep() min lat: 20237
I20260925 19:00:14.383950 383 rpc-test.cc:1237] Sleep() mean lat: 20237
I20260925 19:00:14.383973 383 rpc-test.cc:1238] Sleep() max lat: 20237
I20260925 19:00:14.383986 383 rpc-test.cc:1239] Sleep() #calls: 1
W20260925 19:00:14.384549 697 connection.cc:196] Error closing socket: Network error: TlsSocket::Close: Broken pipe
[ OK ] Parameters/TestRpc.TestRpcHandlerLatencyMetric/SSL_UnixSocket (52 ms)
[ RUN ] Parameters/TestRpc.TimedOutOnResponseMetricServiceQueue/SSL_UnixSocket
I20260925 19:00:14.394629 726 acceptor_pool.cc:254] collecting diagnostics on the listening RPC socket unix:/tmp/dist-test-taskogTzCc/test-tmp/rpc-test-fafe3609086a42aab77453119f8a5c43.sock every 8 connection(s)
I20260925 19:00:14.394651 727 acceptor_pool.cc:254] collecting diagnostics on the listening RPC socket unix:/tmp/dist-test-taskogTzCc/test-tmp/rpc-test-fafe3609086a42aab77453119f8a5c43.sock every 8 connection(s)
W20260925 19:00:14.444767 728 rpcz_store.cc:267] Call kudu.rpc_test.CalculatorService.Sleep from unix:<unnamed> (request call id 2) took 20 ms (client timeout 20 ms). Trace:
W20260925 19:00:14.444869 728 rpcz_store.cc:269] 0925 19:00:14.424467 (+ 0us) service_pool.cc:170] Inserting onto call queue
0925 19:00:14.444746 (+ 20279us) service_pool.cc:214] Skipping call since client already timed out
0925 19:00:14.444755 (+ 9us) inbound_call.cc:173] Queueing failure response
Metrics: {}
[ OK ] Parameters/TestRpc.TimedOutOnResponseMetricServiceQueue/SSL_UnixSocket (60 ms)
[ RUN ] Parameters/TestRpc.RpcPendingConnectionsMetric/SSL_UnixSocket
I20260925 19:00:14.447825 749 acceptor_pool.cc:254] collecting diagnostics on the listening RPC socket 0.0.0.0:46489 every 8 connection(s)
I20260925 19:00:14.447881 750 acceptor_pool.cc:254] collecting diagnostics on the listening RPC socket 0.0.0.0:46489 every 8 connection(s)
W20260925 19:00:14.456005 745 negotiation.cc:337] Failed RPC negotiation. Trace:
0925 19:00:14.455720 (+ 0us) reactor.cc:625] Submitting negotiation task for server connection from 127.0.0.1:58830 (local address 127.0.0.1:46489)
0925 19:00:14.455804 (+ 84us) server_negotiation.cc:206] Beginning negotiation
0925 19:00:14.455807 (+ 3us) server_negotiation.cc:399] Waiting for connection header
0925 19:00:14.455914 (+ 107us) negotiation.cc:327] Negotiation complete: Network error: Server connection negotiation failed: server connection from 127.0.0.1:58830: BlockingRecv error: recv got EOF from 127.0.0.1:58830 (error 108)
Metrics: {"server-negotiator.queue_time_us":38}
[ OK ] Parameters/TestRpc.RpcPendingConnectionsMetric/SSL_UnixSocket (20 ms)
[ RUN ] Parameters/TestRpc.TestRpcContextClientDeadline/SSL_UnixSocket
I20260925 19:00:14.477295 765 acceptor_pool.cc:254] collecting diagnostics on the listening RPC socket unix:/tmp/dist-test-taskogTzCc/test-tmp/rpc-test-6b4ea11c12884424b61db0a85d6e9e83.sock every 8 connection(s)
I20260925 19:00:14.477295 766 acceptor_pool.cc:254] collecting diagnostics on the listening RPC socket unix:/tmp/dist-test-taskogTzCc/test-tmp/rpc-test-6b4ea11c12884424b61db0a85d6e9e83.sock every 8 connection(s)
W20260925 19:00:14.521483 762 connection.cc:196] Error closing socket: Network error: TlsSocket::Close: Broken pipe
[ OK ] Parameters/TestRpc.TestRpcContextClientDeadline/SSL_UnixSocket (55 ms)
[ RUN ] Parameters/TestRpc.TestApplicationFeatureFlagUnsupportedServer/SSL_UnixSocket
I20260925 19:00:14.527613 790 acceptor_pool.cc:254] collecting diagnostics on the listening RPC socket unix:/tmp/dist-test-taskogTzCc/test-tmp/rpc-test-b0ae38c550e54100941fec980f59a266.sock every 8 connection(s)
I20260925 19:00:14.527657 791 acceptor_pool.cc:254] collecting diagnostics on the listening RPC socket unix:/tmp/dist-test-taskogTzCc/test-tmp/rpc-test-b0ae38c550e54100941fec980f59a266.sock every 8 connection(s)
[ OK ] Parameters/TestRpc.TestApplicationFeatureFlagUnsupportedServer/SSL_UnixSocket (18 ms)
[ RUN ] Parameters/TestRpc.TestCancellationAsync/SSL_UnixSocket
I20260925 19:00:14.553208 815 acceptor_pool.cc:254] collecting diagnostics on the listening RPC socket unix:/tmp/dist-test-taskogTzCc/test-tmp/rpc-test-e5c7b429148a4a4295331d8ece302570.sock every 8 connection(s)
I20260925 19:00:14.553218 816 acceptor_pool.cc:254] collecting diagnostics on the listening RPC socket unix:/tmp/dist-test-taskogTzCc/test-tmp/rpc-test-e5c7b429148a4a4295331d8ece302570.sock every 8 connection(s)
I20260925 19:00:14.553342 383 rpc-test.cc:1716] Connecting to unix:/tmp/dist-test-taskogTzCc/test-tmp/rpc-test-e5c7b429148a4a4295331d8ece302570.sock
I20260925 19:00:14.566722 383 test_util.cc:268] Using random seed: 1402261822
I20260925 19:00:14.582587 819 rpc-test-base.h:240] got call: sleep_micros: 500 pattern: 4294967295 num_repetitions: 2097152 sidecar_idx: 0
I20260925 19:00:14.594892 819 rpc-test-base.h:240] got call: sleep_micros: 500 pattern: 4294967295 num_repetitions: 2097152 sidecar_idx: 0
I20260925 19:00:14.607591 819 rpc-test-base.h:240] got call: sleep_micros: 500 pattern: 4294967295 num_repetitions: 2097152 sidecar_idx: 0
I20260925 19:00:14.620133 819 rpc-test-base.h:240] got call: sleep_micros: 500 pattern: 4294967295 num_repetitions: 2097152 sidecar_idx: 0
I20260925 19:00:14.632822 819 rpc-test-base.h:240] got call: sleep_micros: 500 pattern: 4294967295 num_repetitions: 2097152 sidecar_idx: 0
I20260925 19:00:14.644655 819 rpc-test-base.h:240] got call: sleep_micros: 500 pattern: 4294967295 num_repetitions: 2097152 sidecar_idx: 0
I20260925 19:00:14.654708 819 rpc-test-base.h:240] got call: sleep_micros: 500 pattern: 4294967295 num_repetitions: 2097152 sidecar_idx: 0
I20260925 19:00:14.664824 819 rpc-test-base.h:240] got call: sleep_micros: 500 pattern: 4294967295 num_repetitions: 2097152 sidecar_idx: 0
W20260925 19:00:14.666671 812 connection.cc:196] Error closing socket: Network error: TlsSocket::Close: Broken pipe
W20260925 19:00:14.667910 812 connection.cc:441] server connection from unix:<unnamed> torn down before Call kudu.rpc.GenericCalculatorService.SleepWithSidecar from unix:<unnamed> (request call id 9) could send its response
[ OK ] Parameters/TestRpc.TestCancellationAsync/SSL_UnixSocket (127 ms)
[ RUN ] Parameters/TestRpc.TestPerformanceBySocketType/SSL_UnixSocket
I20260925 19:00:14.721438 840 acceptor_pool.cc:254] collecting diagnostics on the listening RPC socket unix:/tmp/dist-test-taskogTzCc/test-tmp/rpc-test-5dea5dec396342ac9f6779dde152c8b1.sock every 8 connection(s)
I20260925 19:00:14.721478 841 acceptor_pool.cc:254] collecting diagnostics on the listening RPC socket unix:/tmp/dist-test-taskogTzCc/test-tmp/rpc-test-5dea5dec396342ac9f6779dde152c8b1.sock every 8 connection(s)
I20260925 19:00:14.721594 383 rpc-test.cc:1846] Connecting to unix:/tmp/dist-test-taskogTzCc/test-tmp/rpc-test-5dea5dec396342ac9f6779dde152c8b1.sock
I20260925 19:00:15.912742 383 rpc-test.cc:1859] Sending 1024MB via ssl-enabled unix socket: real 1.183s user 1.313s sys 0.796s
I20260925 19:00:17.095849 383 rpc-test.cc:1859] Sending 1024MB via ssl-enabled unix socket: real 1.183s user 1.287s sys 0.827s
I20260925 19:00:18.359318 383 rpc-test.cc:1859] Sending 1024MB via ssl-enabled unix socket: real 1.263s user 1.392s sys 0.853s
I20260925 19:00:19.600565 383 rpc-test.cc:1859] Sending 1024MB via ssl-enabled unix socket: real 1.241s user 1.342s sys 0.880s
I20260925 19:00:20.754145 383 rpc-test.cc:1859] Sending 1024MB via ssl-enabled unix socket: real 1.153s user 1.312s sys 0.760s
W20260925 19:00:20.754822 837 connection.cc:196] Error closing socket: Network error: TlsSocket::Close: Broken pipe
[ OK ] Parameters/TestRpc.TestPerformanceBySocketType/SSL_UnixSocket (6086 ms)
[----------] 20 tests from Parameters/TestRpc (25322 ms total)
[----------] 1 test from Parameters/TestRpcSocketTxRxQueue
[ RUN ] Parameters/TestRpcSocketTxRxQueue.AcceptorRxQueueSizeMetric/0
I20260925 19:00:20.757150 865 acceptor_pool.cc:254] collecting diagnostics on the listening RPC socket 0.0.0.0:44617 every 1 connection(s)
I20260925 19:00:20.757212 866 acceptor_pool.cc:254] collecting diagnostics on the listening RPC socket 0.0.0.0:44617 every 1 connection(s)
W20260925 19:00:20.757666 861 negotiation.cc:337] Failed RPC negotiation. Trace:
0925 19:00:20.757534 (+ 0us) reactor.cc:625] Submitting negotiation task for server connection from 127.0.0.1:59280 (local address 127.0.0.1:44617)
0925 19:00:20.757573 (+ 39us) server_negotiation.cc:206] Beginning negotiation
0925 19:00:20.757575 (+ 2us) server_negotiation.cc:399] Waiting for connection header
0925 19:00:20.757639 (+ 64us) negotiation.cc:327] Negotiation complete: Network error: Server connection negotiation failed: server connection from 127.0.0.1:59280: BlockingRecv error: recv got EOF from 127.0.0.1:59280 (error 108)
Metrics: {"server-negotiator.queue_time_us":13}
[ OK ] Parameters/TestRpcSocketTxRxQueue.AcceptorRxQueueSizeMetric/0 (3 ms)
[----------] 1 test from Parameters/TestRpcSocketTxRxQueue (3 ms total)
[----------] Global test environment tear-down
[==========] 21 tests from 2 test suites ran. (25326 ms total)
[ PASSED ] 20 tests.
[ FAILED ] 1 test, listed below:
[ FAILED ] Parameters/TestRpc.TestCallWithChainCertAndChainCA/SSL_UnixSocket, where GetParam() = (true, true)
1 FAILED TEST