Diagnosed failure

Parameters/TestRpc.TestCallWithChainCertAndChainCA/SSL_TCP: /data0/somelongdirectorytoavoidrpathissues/src/kudu/src/kudu/rpc/rpc-test.cc:270: Failure
Failed
Bad status: Runtime error: could not verify certificate chain (error with cert: subject=CN = localhost, ST = sadfjas, C = AS, emailAddress = sdflkdsajf, O = lskdfjlsad, OU = sldfkja, issuer=C = AS, ST = ASDfkjdhf, L = lskdjf, O = saldfja, OU = skdjf, CN = localhost, emailAddress = sadjflkadsj): : certificate has expired
Google Test trace:
/data0/somelongdirectorytoavoidrpathissues/src/kudu/src/kudu/rpc/rpc-test.cc:267: Connecting to 0.0.0.0:46481
I20260928 19:35:36.136157  2399 test_util.cc:175] -----------------------------------------------
I20260928 19:35:36.136340  2399 test_util.cc:176] Had fatal failures, leaving test files at /tmp/dist-test-taskE9hgZC/test-tmp/rpc-test.5.Parameters_TestRpc.TestCallWithChainCertAndChainCA_SSL_TCP.1790624134734292-2399-0

Full log

Note: This is test shard 6 of 8.
[==========] Running 21 tests from 2 test suites.
[----------] Global test environment set-up.
[----------] 20 tests from Parameters/TestRpc
[ RUN      ] Parameters/TestRpc.TestMessengerCreateDestroy/SSL_TCP
WARNING: Logging before InitGoogleLogging() is written to STDERR
I20260928 19:35:34.844100  2399 rpc-test.cc:169] started messenger TestCreateDestroy
[       OK ] Parameters/TestRpc.TestMessengerCreateDestroy/SSL_TCP (1199 ms)
[ RUN      ] Parameters/TestRpc.TestNegotiationDeadlock/SSL_TCP
I20260928 19:35:36.013427  2421 acceptor_pool.cc:254] collecting diagnostics on the listening RPC socket 0.0.0.0:33303 every 8 connection(s)
I20260928 19:35:36.014930  2422 acceptor_pool.cc:254] collecting diagnostics on the listening RPC socket 0.0.0.0:33303 every 8 connection(s)
[       OK ] Parameters/TestRpc.TestNegotiationDeadlock/SSL_TCP (82 ms)
[ RUN      ] Parameters/TestRpc.TestCallWithChainCertAndChainCA/SSL_TCP
I20260928 19:35:36.104408  2437 acceptor_pool.cc:254] collecting diagnostics on the listening RPC socket 0.0.0.0:46481 every 8 connection(s)
I20260928 19:35:36.107110  2438 acceptor_pool.cc:254] collecting diagnostics on the listening RPC socket 0.0.0.0:46481 every 8 connection(s)
/data0/somelongdirectorytoavoidrpathissues/src/kudu/src/kudu/rpc/rpc-test.cc:270: Failure
Failed
Bad status: Runtime error: could not verify certificate chain (error with cert: subject=CN = localhost, ST = sadfjas, C = AS, emailAddress = sdflkdsajf, O = lskdfjlsad, OU = sldfkja, issuer=C = AS, ST = ASDfkjdhf, L = lskdjf, O = saldfja, OU = skdjf, CN = localhost, emailAddress = sadjflkadsj): : certificate has expired
Google Test trace:
/data0/somelongdirectorytoavoidrpathissues/src/kudu/src/kudu/rpc/rpc-test.cc:267: Connecting to 0.0.0.0:46481
I20260928 19:35:36.136157  2399 test_util.cc:175] -----------------------------------------------
I20260928 19:35:36.136340  2399 test_util.cc:176] Had fatal failures, leaving test files at /tmp/dist-test-taskE9hgZC/test-tmp/rpc-test.5.Parameters_TestRpc.TestCallWithChainCertAndChainCA_SSL_TCP.1790624134734292-2399-0
[  FAILED  ] Parameters/TestRpc.TestCallWithChainCertAndChainCA/SSL_TCP, where GetParam() = (true, false) (66 ms)
[ RUN      ] Parameters/TestRpc.TestCallWithPasswordProtectedKey/SSL_TCP
I20260928 19:35:36.172094  2462 acceptor_pool.cc:254] collecting diagnostics on the listening RPC socket 0.0.0.0:35559 every 8 connection(s)
I20260928 19:35:36.172840  2463 acceptor_pool.cc:254] collecting diagnostics on the listening RPC socket 0.0.0.0:35559 every 8 connection(s)
[       OK ] Parameters/TestRpc.TestCallWithPasswordProtectedKey/SSL_TCP (86 ms)
[ RUN      ] Parameters/TestRpc.TestCallToBadServer/SSL_TCP
I20260928 19:35:36.244594  2399 rpc-test.cc:394] Status: Network error: Client connection negotiation failed: client connection to 0.0.0.0:0: connect: Connection refused (error 111)
I20260928 19:35:36.246009  2399 rpc-test.cc:394] Status: Network error: Client connection negotiation failed: client connection to 0.0.0.0:0: connect: Connection refused (error 111)
I20260928 19:35:36.247448  2399 rpc-test.cc:394] Status: Network error: Client connection negotiation failed: client connection to 0.0.0.0:0: connect: Connection refused (error 111)
I20260928 19:35:36.248754  2399 rpc-test.cc:394] Status: Network error: Client connection negotiation failed: client connection to 0.0.0.0:0: connect: Connection refused (error 111)
I20260928 19:35:36.250149  2399 rpc-test.cc:394] Status: Network error: Client connection negotiation failed: client connection to 0.0.0.0:0: connect: Connection refused (error 111)
[       OK ] Parameters/TestRpc.TestCallToBadServer/SSL_TCP (29 ms)
[ RUN      ] Parameters/TestRpc.TestWrongService/SSL_TCP
I20260928 19:35:36.284063  2497 acceptor_pool.cc:254] collecting diagnostics on the listening RPC socket 0.0.0.0:45411 every 8 connection(s)
I20260928 19:35:36.284888  2498 acceptor_pool.cc:254] collecting diagnostics on the listening RPC socket 0.0.0.0:45411 every 8 connection(s)
I20260928 19:35:36.326049  2495 messenger.cc:345] service WrongServiceName not registered on TestServer
[       OK ] Parameters/TestRpc.TestWrongService/SSL_TCP (82 ms)
[ RUN      ] Parameters/TestRpc.TestConnectionKeepalive/SSL_TCP
I20260928 19:35:36.348656  2520 acceptor_pool.cc:254] collecting diagnostics on the listening RPC socket 0.0.0.0:36749 every 8 connection(s)
I20260928 19:35:36.349395  2521 acceptor_pool.cc:254] collecting diagnostics on the listening RPC socket 0.0.0.0:36749 every 8 connection(s)
I20260928 19:35:36.352757  2399 rpc-test.cc:488] Connecting to 0.0.0.0:36749
[       OK ] Parameters/TestRpc.TestConnectionKeepalive/SSL_TCP (1065 ms)
[ RUN      ] Parameters/TestRpc.TestClientConnectionMetrics/SSL_TCP
I20260928 19:35:37.422592  2545 acceptor_pool.cc:254] collecting diagnostics on the listening RPC socket 0.0.0.0:33515 every 8 connection(s)
I20260928 19:35:37.423430  2546 acceptor_pool.cc:254] collecting diagnostics on the listening RPC socket 0.0.0.0:33515 every 8 connection(s)
I20260928 19:35:37.427501  2399 rpc-test.cc:569] Connecting to 0.0.0.0:33515
[       OK ] Parameters/TestRpc.TestClientConnectionMetrics/SSL_TCP (119252 ms)
[ RUN      ] Parameters/TestRpc.TestCredentialsPolicy/SSL_TCP
I20260928 19:37:36.687240  2580 acceptor_pool.cc:254] collecting diagnostics on the listening RPC socket 0.0.0.0:34605 every 8 connection(s)
I20260928 19:37:36.688099  2581 acceptor_pool.cc:254] collecting diagnostics on the listening RPC socket 0.0.0.0:34605 every 8 connection(s)
I20260928 19:37:36.691519  2399 rpc-test.cc:700] Connecting to 0.0.0.0:34605
[       OK ] Parameters/TestRpc.TestCredentialsPolicy/SSL_TCP (98 ms)
[ RUN      ] Parameters/TestRpc.TestCallLongerThanKeepalive/SSL_TCP
I20260928 19:37:36.781718  2605 acceptor_pool.cc:254] collecting diagnostics on the listening RPC socket 0.0.0.0:36109 every 8 connection(s)
I20260928 19:37:36.782449  2606 acceptor_pool.cc:254] collecting diagnostics on the listening RPC socket 0.0.0.0:36109 every 8 connection(s)
I20260928 19:37:36.809643  2609 rpc-test-base.h:222] got call: sleep_micros: 3000000 deferred: true
I20260928 19:37:39.813956  2609 rpcz_store.cc:275] Call kudu.rpc.GenericCalculatorService.Sleep from 127.0.0.1:60938 (request call id 0) took 3004 ms. Trace:
I20260928 19:37:39.814249  2609 rpcz_store.cc:276] 0928 19:37:36.809380 (+     0us) service_pool.cc:170] Inserting onto call queue
0928 19:37:36.809496 (+   116us) service_pool.cc:227] Handling call
0928 19:37:39.813896 (+3004400us) inbound_call.cc:173] Queueing success response
Metrics: {}
[       OK ] Parameters/TestRpc.TestCallLongerThanKeepalive/SSL_TCP (3071 ms)
[ RUN      ] Parameters/TestRpc.TestRpcSidecar/SSL_TCP
I20260928 19:37:39.841086  2630 acceptor_pool.cc:254] collecting diagnostics on the listening RPC socket 0.0.0.0:35577 every 8 connection(s)
I20260928 19:37:39.841794  2631 acceptor_pool.cc:254] collecting diagnostics on the listening RPC socket 0.0.0.0:35577 every 8 connection(s)
[       OK ] Parameters/TestRpc.TestRpcSidecar/SSL_TCP (534 ms)
[ RUN      ] Parameters/TestRpc.TestRpcSidecarLimits/SSL_TCP
I20260928 19:37:57.656672  2657 acceptor_pool.cc:254] collecting diagnostics on the listening RPC socket 0.0.0.0:40247 every 8 connection(s)
I20260928 19:37:57.657531  2658 acceptor_pool.cc:254] collecting diagnostics on the listening RPC socket 0.0.0.0:40247 every 8 connection(s)
W20260928 19:37:57.674041  2399 serialization.cc:72] Serialized kudu.rpc_test.PushStringsRequestPB (2147483654 bytes) is larger than the maximum configured RPC message size (52428800 bytes). Sending anyway, but peer may reject the data.
W20260928 19:37:57.685681  2654 connection.cc:535] server connection from 127.0.0.1:60074 recv error: Network error: RPC frame had a length of 2147483714, but we only support messages up to 52428800 bytes long.
W20260928 19:37:57.686021  2654 connection.cc:158] shutting down server connection from 127.0.0.1:60074 with pending inbound data: 4/2147483714 bytes received; last active 0 ns ago: status Network error: RPC frame had a length of 2147483714, but we only support messages up to 52428800 bytes long.
W20260928 19:37:57.686832  2670 connection.cc:698] client connection to 0.0.0.0:40247 send error: Network error: failed to write to TLS socket: Connection reset by peer
W20260928 19:37:57.687592  2670 connection.cc:196] Error closing socket: Network error: TlsSocket::Close: Success
[       OK ] Parameters/TestRpc.TestRpcSidecarLimits/SSL_TCP (18018 ms)
[ RUN      ] Parameters/TestRpc.TestCallTimeoutDoesntAffectNegotiation/SSL_TCP
I20260928 19:37:58.395790  2682 acceptor_pool.cc:254] collecting diagnostics on the listening RPC socket 0.0.0.0:45551 every 8 connection(s)
I20260928 19:37:58.396509  2683 acceptor_pool.cc:254] collecting diagnostics on the listening RPC socket 0.0.0.0:45551 every 8 connection(s)
W20260928 19:37:58.415465  2678 negotiation.cc:266] Injecting 500ms delay in negotiation
I20260928 19:37:58.465049  2399 rpc-test-base.h:595] status: Timed out: connection negotiation to 0.0.0.0:45551 for RPC Sleep timed out after 0.050s (ON_OUTBOUND_QUEUE), seconds elapsed: 0.0506951
[       OK ] Parameters/TestRpc.TestCallTimeoutDoesntAffectNegotiation/SSL_TCP (555 ms)
[ RUN      ] Parameters/TestRpc.TestRpcHandlerLatencyMetric/SSL_TCP
I20260928 19:37:58.950927  2707 acceptor_pool.cc:254] collecting diagnostics on the listening RPC socket 0.0.0.0:34631 every 8 connection(s)
I20260928 19:37:58.952282  2708 acceptor_pool.cc:254] collecting diagnostics on the listening RPC socket 0.0.0.0:34631 every 8 connection(s)
I20260928 19:37:59.023231  2399 rpc-test.cc:1236] Sleep() min lat: 21666
I20260928 19:37:59.023428  2399 rpc-test.cc:1237] Sleep() mean lat: 21666
I20260928 19:37:59.023555  2399 rpc-test.cc:1238] Sleep() max lat: 21666
I20260928 19:37:59.023660  2399 rpc-test.cc:1239] Sleep() #calls: 1
[       OK ] Parameters/TestRpc.TestRpcHandlerLatencyMetric/SSL_TCP (98 ms)
[ RUN      ] Parameters/TestRpc.TimedOutOnResponseMetricServiceQueue/SSL_TCP
I20260928 19:37:59.049072  2733 acceptor_pool.cc:254] collecting diagnostics on the listening RPC socket 0.0.0.0:39767 every 8 connection(s)
I20260928 19:37:59.049821  2734 acceptor_pool.cc:254] collecting diagnostics on the listening RPC socket 0.0.0.0:39767 every 8 connection(s)
W20260928 19:37:59.124838  2735 rpcz_store.cc:267] Call kudu.rpc_test.CalculatorService.Sleep from 127.0.0.1:59594 (request call id 2) took 20 ms (client timeout 20 ms). Trace:
W20260928 19:37:59.125185  2735 rpcz_store.cc:269] 0928 19:37:59.104327 (+     0us) service_pool.cc:170] Inserting onto call queue
0928 19:37:59.124699 (+ 20372us) service_pool.cc:214] Skipping call since client already timed out
0928 19:37:59.124793 (+    94us) inbound_call.cc:173] Queueing failure response
Metrics: {}
[       OK ] Parameters/TestRpc.TimedOutOnResponseMetricServiceQueue/SSL_TCP (100 ms)
[ RUN      ] Parameters/TestRpc.RpcPendingConnectionsMetric/SSL_TCP
I20260928 19:37:59.142264  2756 acceptor_pool.cc:254] collecting diagnostics on the listening RPC socket 0.0.0.0:37629 every 8 connection(s)
I20260928 19:37:59.143013  2757 acceptor_pool.cc:254] collecting diagnostics on the listening RPC socket 0.0.0.0:37629 every 8 connection(s)
W20260928 19:37:59.159294  2752 negotiation.cc:337] Failed RPC negotiation. Trace:
0928 19:37:59.157585 (+     0us) reactor.cc:625] Submitting negotiation task for server connection from 127.0.0.1:45302 (local address 127.0.0.1:37629)
0928 19:37:59.158020 (+   435us) server_negotiation.cc:206] Beginning negotiation
0928 19:37:59.158037 (+    17us) server_negotiation.cc:399] Waiting for connection header
0928 19:37:59.158427 (+   390us) negotiation.cc:327] Negotiation complete: Network error: Server connection negotiation failed: server connection from 127.0.0.1:45302: BlockingRecv error: recv got EOF from 127.0.0.1:45302 (error 108)
Metrics: {"server-negotiator.queue_time_us":121}
[       OK ] Parameters/TestRpc.RpcPendingConnectionsMetric/SSL_TCP (40 ms)
[ RUN      ] Parameters/TestRpc.TestRpcContextClientDeadline/SSL_TCP
I20260928 19:37:59.204901  2772 acceptor_pool.cc:254] collecting diagnostics on the listening RPC socket 0.0.0.0:34517 every 8 connection(s)
I20260928 19:37:59.205636  2773 acceptor_pool.cc:254] collecting diagnostics on the listening RPC socket 0.0.0.0:34517 every 8 connection(s)
[       OK ] Parameters/TestRpc.TestRpcContextClientDeadline/SSL_TCP (123 ms)
[ RUN      ] Parameters/TestRpc.TestApplicationFeatureFlagUnsupportedServer/SSL_TCP
I20260928 19:37:59.312578  2797 acceptor_pool.cc:254] collecting diagnostics on the listening RPC socket 0.0.0.0:38315 every 8 connection(s)
I20260928 19:37:59.313294  2798 acceptor_pool.cc:254] collecting diagnostics on the listening RPC socket 0.0.0.0:38315 every 8 connection(s)
[       OK ] Parameters/TestRpc.TestApplicationFeatureFlagUnsupportedServer/SSL_TCP (85 ms)
[ RUN      ] Parameters/TestRpc.TestCancellationAsync/SSL_TCP
I20260928 19:37:59.409226  2822 acceptor_pool.cc:254] collecting diagnostics on the listening RPC socket 0.0.0.0:46825 every 8 connection(s)
I20260928 19:37:59.410019  2823 acceptor_pool.cc:254] collecting diagnostics on the listening RPC socket 0.0.0.0:46825 every 8 connection(s)
I20260928 19:37:59.413275  2399 rpc-test.cc:1716] Connecting to 0.0.0.0:46825
I20260928 19:37:59.429258  2399 test_util.cc:268] Using random seed: 874119274
I20260928 19:37:59.670603  2826 rpc-test-base.h:240] got call: sleep_micros: 500 pattern: 4294967295 num_repetitions: 2097152 sidecar_idx: 0
I20260928 19:37:59.863008  2825 rpc-test-base.h:240] got call: sleep_micros: 500 pattern: 4294967295 num_repetitions: 2097152 sidecar_idx: 0
I20260928 19:38:00.055229  2826 rpc-test-base.h:240] got call: sleep_micros: 500 pattern: 4294967295 num_repetitions: 2097152 sidecar_idx: 0
I20260928 19:38:00.241758  2825 rpc-test-base.h:240] got call: sleep_micros: 500 pattern: 4294967295 num_repetitions: 2097152 sidecar_idx: 0
I20260928 19:38:00.426923  2826 rpc-test-base.h:240] got call: sleep_micros: 500 pattern: 4294967295 num_repetitions: 2097152 sidecar_idx: 0
W20260928 19:38:00.534219  2835 outbound_call.cc:322] RPC callback for RPC call kudu.rpc.GenericCalculatorService.SleepWithSidecar -> {remote=0.0.0.0:46825 (localhost), user_credentials={real_user=slave}} blocked reactor thread for 48895.4us
I20260928 19:38:00.607851  2825 rpc-test-base.h:240] got call: sleep_micros: 500 pattern: 4294967295 num_repetitions: 2097152 sidecar_idx: 0
I20260928 19:38:00.787676  2826 rpc-test-base.h:240] got call: sleep_micros: 500 pattern: 4294967295 num_repetitions: 2097152 sidecar_idx: 0
I20260928 19:38:00.971808  2825 rpc-test-base.h:240] got call: sleep_micros: 500 pattern: 4294967295 num_repetitions: 2097152 sidecar_idx: 0
W20260928 19:38:01.143381  2821 connection.cc:196] Error closing socket: Network error: TlsSocket::Close: Broken pipe
W20260928 19:38:01.166442  2821 connection.cc:441] server connection from 127.0.0.1:40670 torn down before Call kudu.rpc.GenericCalculatorService.SleepWithSidecar from 127.0.0.1:40670 (request call id 8) could send its response
[       OK ] Parameters/TestRpc.TestCancellationAsync/SSL_TCP (1795 ms)
[ RUN      ] Parameters/TestRpc.TestPerformanceBySocketType/SSL_TCP
I20260928 19:38:01.265360  2847 acceptor_pool.cc:254] collecting diagnostics on the listening RPC socket 0.0.0.0:46673 every 8 connection(s)
I20260928 19:38:01.265947  2848 acceptor_pool.cc:254] collecting diagnostics on the listening RPC socket 0.0.0.0:46673 every 8 connection(s)
I20260928 19:38:01.269941  2399 rpc-test.cc:1846] Connecting to 0.0.0.0:46673
I20260928 19:38:20.882937  2399 rpc-test.cc:1859] Sending 1024MB via ssl-enabled tcp socket: real 19.592s	user 17.134s	sys 10.900s
I20260928 19:38:40.294449  2399 rpc-test.cc:1859] Sending 1024MB via ssl-enabled tcp socket: real 19.411s	user 16.526s	sys 11.025s
I20260928 19:38:59.521152  2399 rpc-test.cc:1859] Sending 1024MB via ssl-enabled tcp socket: real 19.226s	user 16.552s	sys 10.760s
I20260928 19:39:18.845628  2399 rpc-test.cc:1859] Sending 1024MB via ssl-enabled tcp socket: real 19.324s	user 16.330s	sys 11.193s
I20260928 19:39:38.148630  2399 rpc-test.cc:1859] Sending 1024MB via ssl-enabled tcp socket: real 19.302s	user 16.428s	sys 10.902s
[       OK ] Parameters/TestRpc.TestPerformanceBySocketType/SSL_TCP (96989 ms)
[----------] 20 tests from Parameters/TestRpc (243380 ms total)

[----------] 1 test from Parameters/TestRpcSocketTxRxQueue
[ RUN      ] Parameters/TestRpcSocketTxRxQueue.OverCapacity/0
W20260928 19:39:38.609724  2901 negotiation.cc:337] Failed RPC negotiation. Trace:
0928 19:39:38.208405 (+     0us) reactor.cc:625] Submitting negotiation task for client connection to 0.0.0.0:33385 (local address 127.0.0.1:44538)
0928 19:39:38.208945 (+   540us) negotiation.cc:107] Waiting for socket to connect
0928 19:39:38.208975 (+    30us) client_negotiation.cc:174] Beginning negotiation
0928 19:39:38.209172 (+   197us) client_negotiation.cc:252] Sending NEGOTIATE NegotiatePB request
0928 19:39:38.605730 (+396558us) negotiation.cc:327] Negotiation complete: Network error: Client connection negotiation failed: client connection to 0.0.0.0:33385: BlockingRecv error: recv error from unknown peer: Transport endpoint is not connected (error 107)
Metrics: {"client-negotiator.queue_time_us":134}
W20260928 19:39:38.609814  2883 negotiation.cc:337] Failed RPC negotiation. Trace:
0928 19:39:38.189345 (+     0us) reactor.cc:625] Submitting negotiation task for client connection to 0.0.0.0:33385 (local address 127.0.0.1:44508)
0928 19:39:38.189870 (+   525us) negotiation.cc:107] Waiting for socket to connect
0928 19:39:38.189898 (+    28us) client_negotiation.cc:174] Beginning negotiation
0928 19:39:38.190085 (+   187us) client_negotiation.cc:252] Sending NEGOTIATE NegotiatePB request
0928 19:39:38.605733 (+415648us) negotiation.cc:327] Negotiation complete: Network error: Client connection negotiation failed: client connection to 0.0.0.0:33385: BlockingRecv error: recv error from unknown peer: Transport endpoint is not connected (error 107)
Metrics: {"client-negotiator.queue_time_us":137}
W20260928 19:39:38.609462  2874 negotiation.cc:337] Failed RPC negotiation. Trace:
0928 19:39:38.182461 (+     0us) reactor.cc:625] Submitting negotiation task for client connection to 0.0.0.0:33385 (local address 127.0.0.1:44506)
0928 19:39:38.183208 (+   747us) negotiation.cc:107] Waiting for socket to connect
0928 19:39:38.183246 (+    38us) client_negotiation.cc:174] Beginning negotiation
0928 19:39:38.183617 (+   371us) client_negotiation.cc:252] Sending NEGOTIATE NegotiatePB request
0928 19:39:38.605822 (+422205us) negotiation.cc:327] Negotiation complete: Network error: Client connection negotiation failed: client connection to 0.0.0.0:33385: BlockingRecv error: recv error from unknown peer: Transport endpoint is not connected (error 107)
Metrics: {"client-negotiator.queue_time_us":162}
W20260928 19:39:38.609504  2892 negotiation.cc:337] Failed RPC negotiation. Trace:
0928 19:39:38.196674 (+     0us) reactor.cc:625] Submitting negotiation task for client connection to 0.0.0.0:33385 (local address 127.0.0.1:44522)
0928 19:39:38.197138 (+   464us) negotiation.cc:107] Waiting for socket to connect
0928 19:39:38.197168 (+    30us) client_negotiation.cc:174] Beginning negotiation
0928 19:39:38.197351 (+   183us) client_negotiation.cc:252] Sending NEGOTIATE NegotiatePB request
0928 19:39:38.605746 (+408395us) negotiation.cc:327] Negotiation complete: Network error: Client connection negotiation failed: client connection to 0.0.0.0:33385: BlockingRecv error: recv error from unknown peer: Transport endpoint is not connected (error 107)
Metrics: {"client-negotiator.queue_time_us":126}
W20260928 19:39:38.610221  2910 negotiation.cc:337] Failed RPC negotiation. Trace:
0928 19:39:38.219806 (+     0us) reactor.cc:625] Submitting negotiation task for client connection to 0.0.0.0:33385 (local address 127.0.0.1:44552)
0928 19:39:38.220400 (+   594us) negotiation.cc:107] Waiting for socket to connect
0928 19:39:38.220433 (+    33us) client_negotiation.cc:174] Beginning negotiation
0928 19:39:38.220643 (+   210us) client_negotiation.cc:252] Sending NEGOTIATE NegotiatePB request
0928 19:39:38.607086 (+386443us) negotiation.cc:327] Negotiation complete: Network error: Client connection negotiation failed: client connection to 0.0.0.0:33385: BlockingRecv error: recv error from unknown peer: Transport endpoint is not connected (error 107)
Metrics: {"client-negotiator.queue_time_us":145}
W20260928 19:39:38.611320  2919 negotiation.cc:337] Failed RPC negotiation. Trace:
0928 19:39:38.231787 (+     0us) reactor.cc:625] Submitting negotiation task for client connection to 0.0.0.0:33385 (local address 127.0.0.1:44558)
0928 19:39:38.232365 (+   578us) negotiation.cc:107] Waiting for socket to connect
0928 19:39:38.232394 (+    29us) client_negotiation.cc:174] Beginning negotiation
0928 19:39:38.232585 (+   191us) client_negotiation.cc:252] Sending NEGOTIATE NegotiatePB request
0928 19:39:38.607770 (+375185us) negotiation.cc:327] Negotiation complete: Network error: Client connection negotiation failed: client connection to 0.0.0.0:33385: BlockingRecv error: recv error from unknown peer: Transport endpoint is not connected (error 107)
Metrics: {"client-negotiator.queue_time_us":157}
[       OK ] Parameters/TestRpcSocketTxRxQueue.OverCapacity/0 (1246 ms)
[----------] 1 test from Parameters/TestRpcSocketTxRxQueue (1246 ms total)

[----------] Global test environment tear-down
[==========] 21 tests from 2 test suites ran. (244627 ms total)
[  PASSED  ] 20 tests.
[  FAILED  ] 1 test, listed below:
[  FAILED  ] Parameters/TestRpc.TestCallWithChainCertAndChainCA/SSL_TCP, where GetParam() = (true, false)

 1 FAILED TEST