Diagnosed failure

Parameters/TestRpc.TestCallWithChainCertAndRootCA/SSL_TCP: /data0/somelongdirectorytoavoidrpathissues/src/kudu/src/kudu/rpc/rpc-test.cc:303: Failure
Failed
Bad status: Runtime error: could not verify certificate chain (error with cert: subject=CN = localhost, ST = sadfjas, C = AS, emailAddress = sdflkdsajf, O = lskdfjlsad, OU = sldfkja, issuer=C = AS, ST = ASDfkjdhf, L = lskdjf, O = saldfja, OU = skdjf, CN = localhost, emailAddress = sadjflkadsj): : certificate has expired
Google Test trace:
/data0/somelongdirectorytoavoidrpathissues/src/kudu/src/kudu/rpc/rpc-test.cc:300: Connecting to 0.0.0.0:33735
I20260927 23:29:19.769670   390 test_util.cc:175] -----------------------------------------------
I20260927 23:29:19.769817   390 test_util.cc:176] Had fatal failures, leaving test files at /tmp/dist-test-taskO8_i2j/test-tmp/rpc-test.1.Parameters_TestRpc.TestCallWithChainCertAndRootCA_SSL_TCP.1790551758358338-390-0

Full log

Note: This is test shard 2 of 8.
[==========] Running 21 tests from 2 test suites.
[----------] Global test environment set-up.
[----------] 1 test from TestRpc
[ RUN      ] TestRpc.TestMethodsByName
[       OK ] TestRpc.TestMethodsByName (5 ms)
[----------] 1 test from TestRpc (5 ms total)

[----------] 20 tests from Parameters/TestRpc
[ RUN      ] Parameters/TestRpc.TestAcceptorPoolStartStop/SSL_TCP
WARNING: Logging before InitGoogleLogging() is written to STDERR
I20260927 23:29:18.450963   405 acceptor_pool.cc:254] collecting diagnostics on the listening RPC socket 0.0.0.0:43905 every 8 connection(s)
W20260927 23:29:19.452935   390 thread.cc:536] Waited for 1000ms trying to join with acceptor (tid 406)
I20260927 23:29:18.452455   406 acceptor_pool.cc:254] collecting diagnostics on the listening RPC socket 0.0.0.0:43905 every 8 connection(s)
I20260927 23:29:19.558733   417 acceptor_pool.cc:254] collecting diagnostics on the listening RPC socket 0.0.0.0:45413 every 8 connection(s)
I20260927 23:29:19.560112   418 acceptor_pool.cc:254] collecting diagnostics on the listening RPC socket 0.0.0.0:45413 every 8 connection(s)
I20260927 23:29:19.577639   428 acceptor_pool.cc:254] collecting diagnostics on the listening RPC socket 0.0.0.0:39033 every 8 connection(s)
I20260927 23:29:19.579349   429 acceptor_pool.cc:254] collecting diagnostics on the listening RPC socket 0.0.0.0:39033 every 8 connection(s)
I20260927 23:29:19.598062   439 acceptor_pool.cc:254] collecting diagnostics on the listening RPC socket 0.0.0.0:42833 every 8 connection(s)
I20260927 23:29:19.598745   440 acceptor_pool.cc:254] collecting diagnostics on the listening RPC socket 0.0.0.0:42833 every 8 connection(s)
I20260927 23:29:19.620299   450 acceptor_pool.cc:254] collecting diagnostics on the listening RPC socket 0.0.0.0:35397 every 8 connection(s)
I20260927 23:29:19.621011   451 acceptor_pool.cc:254] collecting diagnostics on the listening RPC socket 0.0.0.0:35397 every 8 connection(s)
[       OK ] Parameters/TestRpc.TestAcceptorPoolStartStop/SSL_TCP (1210 ms)
[ RUN      ] Parameters/TestRpc.TestCall/SSL_TCP
I20260927 23:29:19.640213   463 acceptor_pool.cc:254] collecting diagnostics on the listening RPC socket 0.0.0.0:34889 every 8 connection(s)
I20260927 23:29:19.642019   464 acceptor_pool.cc:254] collecting diagnostics on the listening RPC socket 0.0.0.0:34889 every 8 connection(s)
I20260927 23:29:19.647564   390 rpc-test.cc:234] Connecting to 0.0.0.0:34889
[       OK ] Parameters/TestRpc.TestCall/SSL_TCP (110 ms)
[ RUN      ] Parameters/TestRpc.TestCallWithChainCertAndRootCA/SSL_TCP
I20260927 23:29:19.750447   488 acceptor_pool.cc:254] collecting diagnostics on the listening RPC socket 0.0.0.0:33735 every 8 connection(s)
I20260927 23:29:19.751171   489 acceptor_pool.cc:254] collecting diagnostics on the listening RPC socket 0.0.0.0:33735 every 8 connection(s)
/data0/somelongdirectorytoavoidrpathissues/src/kudu/src/kudu/rpc/rpc-test.cc:303: Failure
Failed
Bad status: Runtime error: could not verify certificate chain (error with cert: subject=CN = localhost, ST = sadfjas, C = AS, emailAddress = sdflkdsajf, O = lskdfjlsad, OU = sldfkja, issuer=C = AS, ST = ASDfkjdhf, L = lskdjf, O = saldfja, OU = skdjf, CN = localhost, emailAddress = sadjflkadsj): : certificate has expired
Google Test trace:
/data0/somelongdirectorytoavoidrpathissues/src/kudu/src/kudu/rpc/rpc-test.cc:300: Connecting to 0.0.0.0:33735
I20260927 23:29:19.769670   390 test_util.cc:175] -----------------------------------------------
I20260927 23:29:19.769817   390 test_util.cc:176] Had fatal failures, leaving test files at /tmp/dist-test-taskO8_i2j/test-tmp/rpc-test.1.Parameters_TestRpc.TestCallWithChainCertAndRootCA_SSL_TCP.1790551758358338-390-0
[  FAILED  ] Parameters/TestRpc.TestCallWithChainCertAndRootCA/SSL_TCP, where GetParam() = (true, false) (34 ms)
[ RUN      ] Parameters/TestRpc.TestCallWithBadPasswordProtectedKey/SSL_TCP
[       OK ] Parameters/TestRpc.TestCallWithBadPasswordProtectedKey/SSL_TCP (28 ms)
[ RUN      ] Parameters/TestRpc.TestInvalidMethodCall/SSL_TCP
I20260927 23:29:19.815665   525 acceptor_pool.cc:254] collecting diagnostics on the listening RPC socket 0.0.0.0:41209 every 8 connection(s)
I20260927 23:29:19.816489   526 acceptor_pool.cc:254] collecting diagnostics on the listening RPC socket 0.0.0.0:41209 every 8 connection(s)
I20260927 23:29:19.819742   390 rpc-test.cc:406] Connecting to 0.0.0.0:41209
[       OK ] Parameters/TestRpc.TestInvalidMethodCall/SSL_TCP (68 ms)
[ RUN      ] Parameters/TestRpc.TestHighFDs/SSL_TCP
I20260927 23:29:20.074198   550 acceptor_pool.cc:254] collecting diagnostics on the listening RPC socket 0.0.0.0:40027 every 8 connection(s)
I20260927 23:29:20.075115   551 acceptor_pool.cc:254] collecting diagnostics on the listening RPC socket 0.0.0.0:40027 every 8 connection(s)
[       OK ] Parameters/TestRpc.TestHighFDs/SSL_TCP (254 ms)
[ RUN      ] Parameters/TestRpc.TestConnectionAlwaysKeepalive/SSL_TCP
I20260927 23:29:20.149268   573 acceptor_pool.cc:254] collecting diagnostics on the listening RPC socket 0.0.0.0:44905 every 8 connection(s)
I20260927 23:29:20.149959   574 acceptor_pool.cc:254] collecting diagnostics on the listening RPC socket 0.0.0.0:44905 every 8 connection(s)
I20260927 23:29:20.152872   390 rpc-test.cc:532] Connecting to 0.0.0.0:44905
[       OK ] Parameters/TestRpc.TestConnectionAlwaysKeepalive/SSL_TCP (3078 ms)
[ RUN      ] Parameters/TestRpc.TestReopenOutboundConnections/SSL_TCP
I20260927 23:29:23.220170   596 acceptor_pool.cc:254] collecting diagnostics on the listening RPC socket 0.0.0.0:39939 every 8 connection(s)
I20260927 23:29:23.220866   597 acceptor_pool.cc:254] collecting diagnostics on the listening RPC socket 0.0.0.0:39939 every 8 connection(s)
I20260927 23:29:23.223948   390 rpc-test.cc:658] Connecting to 0.0.0.0:39939
[       OK ] Parameters/TestRpc.TestReopenOutboundConnections/SSL_TCP (380 ms)
[ RUN      ] Parameters/TestRpc.TestConnectionNetworkPlane/SSL_TCP
I20260927 23:29:23.598013   619 acceptor_pool.cc:254] collecting diagnostics on the listening RPC socket 0.0.0.0:39449 every 8 connection(s)
I20260927 23:29:23.598829   620 acceptor_pool.cc:254] collecting diagnostics on the listening RPC socket 0.0.0.0:39449 every 8 connection(s)
I20260927 23:29:23.601717   390 rpc-test.cc:772] Connecting to 0.0.0.0:39449
[       OK ] Parameters/TestRpc.TestConnectionNetworkPlane/SSL_TCP (82 ms)
[ RUN      ] Parameters/TestRpc.TestTCPKeepalive/SSL_TCP
I20260927 23:29:23.687055   644 acceptor_pool.cc:254] collecting diagnostics on the listening RPC socket 0.0.0.0:38575 every 8 connection(s)
I20260927 23:29:23.687762   645 acceptor_pool.cc:254] collecting diagnostics on the listening RPC socket 0.0.0.0:38575 every 8 connection(s)
I20260927 23:29:23.711915   648 rpc-test-base.h:222] got call: sleep_micros: 8000000 deferred: true
I20260927 23:29:31.715924   648 rpcz_store.cc:275] Call kudu.rpc.GenericCalculatorService.Sleep from 127.0.0.1:45656 (request call id 0) took 8004 ms. Trace:
I20260927 23:29:31.716334   648 rpcz_store.cc:276] 0927 23:29:23.711676 (+     0us) service_pool.cc:170] Inserting onto call queue
0927 23:29:23.711765 (+    89us) service_pool.cc:227] Handling call
0927 23:29:31.715766 (+8004001us) inbound_call.cc:173] Queueing success response
Metrics: {}
[       OK ] Parameters/TestRpc.TestTCPKeepalive/SSL_TCP (8064 ms)
[ RUN      ] Parameters/TestRpc.TestMaxSmallSidecars/SSL_TCP
I20260927 23:29:31.748245   670 acceptor_pool.cc:254] collecting diagnostics on the listening RPC socket 0.0.0.0:41165 every 8 connection(s)
I20260927 23:29:31.748970   671 acceptor_pool.cc:254] collecting diagnostics on the listening RPC socket 0.0.0.0:41165 every 8 connection(s)
[       OK ] Parameters/TestRpc.TestMaxSmallSidecars/SSL_TCP (196 ms)
[ RUN      ] Parameters/TestRpc.TestCallTimeout/SSL_TCP
I20260927 23:29:31.944159   695 acceptor_pool.cc:254] collecting diagnostics on the listening RPC socket 0.0.0.0:34443 every 8 connection(s)
I20260927 23:29:31.944792   696 acceptor_pool.cc:254] collecting diagnostics on the listening RPC socket 0.0.0.0:34443 every 8 connection(s)
I20260927 23:29:31.967023   390 rpc-test-base.h:595] status: Timed out: connection negotiation to 0.0.0.0:34443 for RPC Sleep timed out after 0.000s (ON_OUTBOUND_QUEUE), seconds elapsed: 0.00223919
I20260927 23:29:31.974988   699 rpc-test-base.h:222] got call: sleep_micros: 700000
I20260927 23:29:32.168670   390 rpc-test-base.h:595] status: Timed out: Sleep RPC to 0.0.0.0:34443 timed out after 0.200s (SENT), seconds elapsed: 0.201284
I20260927 23:29:32.170073   698 rpc-test-base.h:222] got call: sleep_micros: 2000000
W20260927 23:29:32.675624   699 rpcz_store.cc:267] Call kudu.rpc.GenericCalculatorService.Sleep from 127.0.0.1:34144 (request call id 1) took 700 ms (client timeout 200 ms). Trace:
W20260927 23:29:32.676005   699 rpcz_store.cc:269] 0927 23:29:31.974847 (+     0us) service_pool.cc:170] Inserting onto call queue
0927 23:29:31.974940 (+    93us) service_pool.cc:227] Handling call
0927 23:29:32.675552 (+700612us) inbound_call.cc:173] Queueing success response
Metrics: {}
I20260927 23:29:33.670765   390 rpc-test-base.h:595] status: Timed out: Sleep RPC to 0.0.0.0:34443 timed out after 1.500s (SENT), seconds elapsed: 1.5018
W20260927 23:29:34.170588   698 rpcz_store.cc:267] Call kudu.rpc.GenericCalculatorService.Sleep from 127.0.0.1:34144 (request call id 2) took 2000 ms (client timeout 1500 ms). Trace:
W20260927 23:29:34.170907   698 rpcz_store.cc:269] 0927 23:29:32.169783 (+     0us) service_pool.cc:170] Inserting onto call queue
0927 23:29:32.169920 (+   137us) service_pool.cc:227] Handling call
0927 23:29:34.170531 (+2000611us) inbound_call.cc:173] Queueing success response
Metrics: {}
W20260927 23:29:34.171518   692 connection.cc:441] server connection from 127.0.0.1:34144 torn down before Call kudu.rpc.GenericCalculatorService.Sleep from 127.0.0.1:34144 (request call id 2) could send its response
[       OK ] Parameters/TestRpc.TestCallTimeout/SSL_TCP (2250 ms)
[ RUN      ] Parameters/TestRpc.TestServerShutsDown/SSL_TCP
I20260927 23:29:34.177716   390 rpc-test.cc:1125] Connecting to 0.0.0.0:35219
W20260927 23:29:34.186645   712 negotiation.cc:337] Failed RPC negotiation. Trace:
0927 23:29:34.185262 (+     0us) reactor.cc:625] Submitting negotiation task for client connection to 0.0.0.0:35219 (local address 127.0.0.1:35500)
0927 23:29:34.185653 (+   391us) negotiation.cc:107] Waiting for socket to connect
0927 23:29:34.185681 (+    28us) client_negotiation.cc:174] Beginning negotiation
0927 23:29:34.185873 (+   192us) client_negotiation.cc:252] Sending NEGOTIATE NegotiatePB request
0927 23:29:34.186109 (+   236us) negotiation.cc:327] Negotiation complete: Network error: Client connection negotiation failed: client connection to 0.0.0.0:35219: BlockingWrite error: write error: Broken pipe (error 32)
Metrics: {"client-negotiator.queue_time_us":96}
[       OK ] Parameters/TestRpc.TestServerShutsDown/SSL_TCP (12 ms)
[ RUN      ] Parameters/TestRpc.TimedOutOnResponseMetric/SSL_TCP
I20260927 23:29:34.204360   729 acceptor_pool.cc:254] collecting diagnostics on the listening RPC socket 0.0.0.0:39049 every 8 connection(s)
I20260927 23:29:34.205061   730 acceptor_pool.cc:254] collecting diagnostics on the listening RPC socket 0.0.0.0:39049 every 8 connection(s)
W20260927 23:29:34.449342   733 rpcz_store.cc:267] Call kudu.rpc_test.CalculatorService.Sleep from 127.0.0.1:38172 (request call id 3) took 50 ms (client timeout 25 ms). Trace:
W20260927 23:29:34.449630   733 rpcz_store.cc:269] 0927 23:29:34.398855 (+     0us) service_pool.cc:170] Inserting onto call queue
0927 23:29:34.398950 (+    95us) service_pool.cc:227] Handling call
0927 23:29:34.449291 (+ 50341us) inbound_call.cc:173] Queueing success response
Related trace 'test_child':
Metrics: {"test_sleep_us":50000,"child_traces":[["test_child",{"related_trace_metric":1}]]}
W20260927 23:29:34.508908   733 rpcz_store.cc:267] Call kudu.rpc_test.CalculatorService.Sleep from 127.0.0.1:38172 (request call id 4) took 50 ms (client timeout 50 ms). Trace:
W20260927 23:29:34.509131   733 rpcz_store.cc:269] 0927 23:29:34.458332 (+     0us) service_pool.cc:170] Inserting onto call queue
0927 23:29:34.458474 (+   142us) service_pool.cc:227] Handling call
0927 23:29:34.508865 (+ 50391us) inbound_call.cc:173] Queueing success response
Related trace 'test_child':
Metrics: {"test_sleep_us":50000,"child_traces":[["test_child",{"related_trace_metric":1}]]}
[       OK ] Parameters/TestRpc.TimedOutOnResponseMetric/SSL_TCP (327 ms)
[ RUN      ] Parameters/TestRpc.AcceptorDispatchingTimesMetric/SSL_TCP
I20260927 23:29:34.527935   754 acceptor_pool.cc:254] collecting diagnostics on the listening RPC socket 0.0.0.0:37363 every 8 connection(s)
I20260927 23:29:34.528494   755 acceptor_pool.cc:254] collecting diagnostics on the listening RPC socket 0.0.0.0:37363 every 8 connection(s)
W20260927 23:29:34.534150   750 negotiation.cc:337] Failed RPC negotiation. Trace:
0927 23:29:34.532123 (+     0us) reactor.cc:625] Submitting negotiation task for server connection from 127.0.0.1:51502 (local address 127.0.0.1:37363)
0927 23:29:34.532670 (+   547us) server_negotiation.cc:206] Beginning negotiation
0927 23:29:34.532696 (+    26us) server_negotiation.cc:399] Waiting for connection header
0927 23:29:34.533087 (+   391us) negotiation.cc:327] Negotiation complete: Network error: Server connection negotiation failed: server connection from 127.0.0.1:51502: BlockingRecv error: recv got EOF from 127.0.0.1:51502 (error 108)
Metrics: {"server-negotiator.queue_time_us":96}
[       OK ] Parameters/TestRpc.AcceptorDispatchingTimesMetric/SSL_TCP (19 ms)
[ RUN      ] Parameters/TestRpc.TestRpcCallbackDestroysMessenger/SSL_TCP
[       OK ] Parameters/TestRpc.TestRpcCallbackDestroysMessenger/SSL_TCP (22 ms)
[ RUN      ] Parameters/TestRpc.TestApplicationFeatureFlag/SSL_TCP
I20260927 23:29:34.576948   779 acceptor_pool.cc:254] collecting diagnostics on the listening RPC socket 0.0.0.0:38885 every 8 connection(s)
I20260927 23:29:34.577652   780 acceptor_pool.cc:254] collecting diagnostics on the listening RPC socket 0.0.0.0:38885 every 8 connection(s)
W20260927 23:29:34.608289   777 messenger.cc:357] Unable to handle RPC call: Not implemented: call requires unsupported application feature flags: 99
[       OK ] Parameters/TestRpc.TestApplicationFeatureFlag/SSL_TCP (55 ms)
[ RUN      ] Parameters/TestRpc.TestCancellation/SSL_TCP
I20260927 23:29:34.642096   804 acceptor_pool.cc:254] collecting diagnostics on the listening RPC socket 0.0.0.0:37593 every 8 connection(s)
I20260927 23:29:34.642776   805 acceptor_pool.cc:254] collecting diagnostics on the listening RPC socket 0.0.0.0:37593 every 8 connection(s)
I20260927 23:29:34.645424   390 rpc-test.cc:1648] Connecting to 0.0.0.0:37593
I20260927 23:29:34.744931   390 rpc-test-base.h:595] status: Aborted: Sleep RPC to 0.0.0.0:37593 is cancelled in state READY, seconds elapsed: 0.000260637
I20260927 23:29:34.874748   390 rpc-test-base.h:595] status: Aborted: Sleep RPC to 0.0.0.0:37593 is cancelled in state SENT, seconds elapsed: 0.000837986
I20260927 23:29:34.914934   807 rpc-test-base.h:222] got call: sleep_micros: 510000
I20260927 23:29:35.062166   390 rpc-test-base.h:595] status: Aborted: Sleep RPC to 0.0.0.0:37593 is cancelled in state SENT, seconds elapsed: 0.000921135
I20260927 23:29:35.095643   806 rpc-test-base.h:222] got call: sleep_micros: 510000
I20260927 23:29:35.209393   390 rpc-test-base.h:595] status: Aborted: Sleep RPC to 0.0.0.0:37593 is cancelled in state SENT, seconds elapsed: 0.00075359
W20260927 23:29:35.247121   808 rpcz_store.cc:267] Call kudu.rpc.GenericCalculatorService.Sleep from 127.0.0.1:52506 (request call id 11) took 14 ms (client timeout 10 ms). Trace:
W20260927 23:29:35.247414   808 rpcz_store.cc:269] 0927 23:29:35.232867 (+     0us) service_pool.cc:170] Inserting onto call queue
0927 23:29:35.246841 (+ 13974us) service_pool.cc:214] Skipping call since client already timed out
0927 23:29:35.246952 (+   111us) inbound_call.cc:173] Queueing failure response
Metrics: {}
I20260927 23:29:35.247924   808 rpc-test-base.h:222] got call: sleep_micros: 1500000
W20260927 23:29:35.425568   807 rpcz_store.cc:267] Call kudu.rpc.GenericCalculatorService.Sleep from 127.0.0.1:52506 (request call id 3) took 510 ms (client timeout 10 ms). Trace:
W20260927 23:29:35.425880   807 rpcz_store.cc:269] 0927 23:29:34.914730 (+     0us) service_pool.cc:170] Inserting onto call queue
0927 23:29:34.914866 (+   136us) service_pool.cc:227] Handling call
0927 23:29:35.425520 (+510654us) inbound_call.cc:173] Queueing success response
Metrics: {}
W20260927 23:29:35.606299   806 rpcz_store.cc:267] Call kudu.rpc.GenericCalculatorService.Sleep from 127.0.0.1:52506 (request call id 7) took 519 ms (client timeout 10 ms). Trace:
W20260927 23:29:35.606613   806 rpcz_store.cc:269] 0927 23:29:35.086804 (+     0us) service_pool.cc:170] Inserting onto call queue
0927 23:29:35.095564 (+  8760us) service_pool.cc:227] Handling call
0927 23:29:35.606251 (+510687us) inbound_call.cc:173] Queueing success response
Metrics: {}
I20260927 23:29:36.211004   390 rpc-test-base.h:595] status: Timed out: Sleep RPC to 0.0.0.0:37593 timed out after 1.000s (SENT), seconds elapsed: 1.00123
I20260927 23:29:36.212306   806 rpc-test-base.h:222] got call: sleep_micros: 1500000
W20260927 23:29:36.748382   808 rpcz_store.cc:267] Call kudu.rpc.GenericCalculatorService.Sleep from 127.0.0.1:52506 (request call id 12) took 1515 ms (client timeout 1000 ms). Trace:
W20260927 23:29:36.748662   808 rpcz_store.cc:269] 0927 23:29:35.233186 (+     0us) service_pool.cc:170] Inserting onto call queue
0927 23:29:35.247893 (+ 14707us) service_pool.cc:227] Handling call
0927 23:29:36.748336 (+1500443us) inbound_call.cc:173] Queueing success response
Metrics: {}
I20260927 23:29:37.212320   390 rpc-test-base.h:595] status: Timed out: Sleep RPC to 0.0.0.0:37593 timed out after 1.000s (SENT), seconds elapsed: 1.00098
W20260927 23:29:37.213713   802 messenger.cc:357] Unable to handle RPC call: Not implemented: call requires unsupported application feature flags: 99, 1
W20260927 23:29:37.215106   802 messenger.cc:357] Unable to handle RPC call: Not implemented: call requires unsupported application feature flags: 99, 1
W20260927 23:29:37.712874   806 rpcz_store.cc:267] Call kudu.rpc.GenericCalculatorService.Sleep from 127.0.0.1:52506 (request call id 13) took 1500 ms (client timeout 1000 ms). Trace:
W20260927 23:29:37.713150   806 rpcz_store.cc:269] 0927 23:29:36.212136 (+     0us) service_pool.cc:170] Inserting onto call queue
0927 23:29:36.212255 (+   119us) service_pool.cc:227] Handling call
0927 23:29:37.712829 (+1500574us) inbound_call.cc:173] Queueing success response
Metrics: {}
W20260927 23:29:37.713624   802 connection.cc:441] server connection from 127.0.0.1:52506 torn down before Call kudu.rpc.GenericCalculatorService.Sleep from 127.0.0.1:52506 (request call id 13) could send its response
[       OK ] Parameters/TestRpc.TestCancellation/SSL_TCP (3103 ms)
[ RUN      ] Parameters/TestRpc.TestCancellationMultiThreads/SSL_TCP
I20260927 23:29:37.743695   829 acceptor_pool.cc:254] collecting diagnostics on the listening RPC socket 0.0.0.0:36293 every 8 connection(s)
I20260927 23:29:37.744395   830 acceptor_pool.cc:254] collecting diagnostics on the listening RPC socket 0.0.0.0:36293 every 8 connection(s)
I20260927 23:29:37.747280   390 rpc-test.cc:1808] Connecting to 0.0.0.0:36293
I20260927 23:29:37.882828   843 test_util.cc:268] Using random seed: 1387016879
I20260927 23:29:37.883924   844 test_util.cc:268] Using random seed: 1387017982
I20260927 23:29:37.885653   845 test_util.cc:268] Using random seed: 1387019693
I20260927 23:29:37.886953   846 test_util.cc:268] Using random seed: 1387020995
I20260927 23:29:37.888441   847 test_util.cc:268] Using random seed: 1387022370
I20260927 23:29:37.889751   848 test_util.cc:268] Using random seed: 1387023672
I20260927 23:29:37.891345   849 test_util.cc:268] Using random seed: 1387025259
I20260927 23:29:37.892885   850 test_util.cc:268] Using random seed: 1387026812
I20260927 23:29:37.894834   851 test_util.cc:268] Using random seed: 1387028744
I20260927 23:29:37.896157   852 test_util.cc:268] Using random seed: 1387030097
I20260927 23:29:37.898010   853 test_util.cc:268] Using random seed: 1387031943
I20260927 23:29:37.899677   854 test_util.cc:268] Using random seed: 1387033611
I20260927 23:29:37.901619   855 test_util.cc:268] Using random seed: 1387035555
I20260927 23:29:37.902817   856 test_util.cc:268] Using random seed: 1387036755
I20260927 23:29:37.905293   857 test_util.cc:268] Using random seed: 1387039168
I20260927 23:29:37.907284   858 test_util.cc:268] Using random seed: 1387041161
I20260927 23:29:37.916004   859 test_util.cc:268] Using random seed: 1387049917
I20260927 23:29:37.918169   860 test_util.cc:268] Using random seed: 1387051598
I20260927 23:29:37.920656   861 test_util.cc:268] Using random seed: 1387054169
I20260927 23:29:37.924798   862 test_util.cc:268] Using random seed: 1387058592
I20260927 23:29:37.927670   863 test_util.cc:268] Using random seed: 1387061563
I20260927 23:29:37.929867   864 test_util.cc:268] Using random seed: 1387063772
I20260927 23:29:37.932677   865 test_util.cc:268] Using random seed: 1387066585
I20260927 23:29:37.936262   866 test_util.cc:268] Using random seed: 1387070170
I20260927 23:29:37.938256   867 test_util.cc:268] Using random seed: 1387072207
I20260927 23:29:37.940259   868 test_util.cc:268] Using random seed: 1387074178
I20260927 23:29:37.942260   869 test_util.cc:268] Using random seed: 1387075735
I20260927 23:29:37.944280   870 test_util.cc:268] Using random seed: 1387077755
I20260927 23:29:37.947433   871 test_util.cc:268] Using random seed: 1387081359
I20260927 23:29:37.949483   872 test_util.cc:268] Using random seed: 1387083426
[       OK ] Parameters/TestRpc.TestCancellationMultiThreads/SSL_TCP (16669 ms)
[ RUN      ] Parameters/TestRpc.TestCallId/SSL_TCP
I20260927 23:29:54.418720   886 acceptor_pool.cc:254] collecting diagnostics on the listening RPC socket 0.0.0.0:38213 every 8 connection(s)
I20260927 23:29:54.419515   887 acceptor_pool.cc:254] collecting diagnostics on the listening RPC socket 0.0.0.0:38213 every 8 connection(s)
[       OK ] Parameters/TestRpc.TestCallId/SSL_TCP (85 ms)
[----------] 20 tests from Parameters/TestRpc (36060 ms total)

[----------] Global test environment tear-down
[==========] 21 tests from 2 test suites ran. (36067 ms total)
[  PASSED  ] 20 tests.
[  FAILED  ] 1 test, listed below:
[  FAILED  ] Parameters/TestRpc.TestCallWithChainCertAndRootCA/SSL_TCP, where GetParam() = (true, false)

 1 FAILED TEST