Diagnosed failure

Parameters/TestRpc.TestCallWithChainCertAndChainCA/SSL_TCP: /data0/somelongdirectorytoavoidrpathissues/src/kudu/src/kudu/rpc/rpc-test.cc:270: Failure
Failed
Bad status: Runtime error: could not verify certificate chain (error with cert: subject=CN = localhost, ST = sadfjas, C = AS, emailAddress = sdflkdsajf, O = lskdfjlsad, OU = sldfkja, issuer=C = AS, ST = ASDfkjdhf, L = lskdjf, O = saldfja, OU = skdjf, CN = localhost, emailAddress = sadjflkadsj): : certificate has expired
Google Test trace:
/data0/somelongdirectorytoavoidrpathissues/src/kudu/src/kudu/rpc/rpc-test.cc:267: Connecting to 0.0.0.0:35449
I20260928 22:45:18.573702  1642 test_util.cc:175] -----------------------------------------------
I20260928 22:45:18.573760  1642 test_util.cc:176] Had fatal failures, leaving test files at /tmp/dist-test-tasks7j8V7/test-tmp/rpc-test.5.Parameters_TestRpc.TestCallWithChainCertAndChainCA_SSL_TCP.1790635518512660-1642-0

Full log

Note: This is test shard 6 of 8.
[==========] Running 21 tests from 2 test suites.
[----------] Global test environment set-up.
[----------] 20 tests from Parameters/TestRpc
[ RUN      ] Parameters/TestRpc.TestMessengerCreateDestroy/SSL_TCP
WARNING: Logging before InitGoogleLogging() is written to STDERR
I20260928 22:45:18.538612  1642 rpc-test.cc:169] started messenger TestCreateDestroy
[       OK ] Parameters/TestRpc.TestMessengerCreateDestroy/SSL_TCP (24 ms)
[ RUN      ] Parameters/TestRpc.TestNegotiationDeadlock/SSL_TCP
I20260928 22:45:18.555050  1662 acceptor_pool.cc:254] collecting diagnostics on the listening RPC socket 0.0.0.0:40815 every 8 connection(s)
I20260928 22:45:18.555060  1663 acceptor_pool.cc:254] collecting diagnostics on the listening RPC socket 0.0.0.0:40815 every 8 connection(s)
[       OK ] Parameters/TestRpc.TestNegotiationDeadlock/SSL_TCP (22 ms)
[ RUN      ] Parameters/TestRpc.TestCallWithChainCertAndChainCA/SSL_TCP
I20260928 22:45:18.569901  1678 acceptor_pool.cc:254] collecting diagnostics on the listening RPC socket 0.0.0.0:35449 every 8 connection(s)
I20260928 22:45:18.569928  1679 acceptor_pool.cc:254] collecting diagnostics on the listening RPC socket 0.0.0.0:35449 every 8 connection(s)
/data0/somelongdirectorytoavoidrpathissues/src/kudu/src/kudu/rpc/rpc-test.cc:270: Failure
Failed
Bad status: Runtime error: could not verify certificate chain (error with cert: subject=CN = localhost, ST = sadfjas, C = AS, emailAddress = sdflkdsajf, O = lskdfjlsad, OU = sldfkja, issuer=C = AS, ST = ASDfkjdhf, L = lskdjf, O = saldfja, OU = skdjf, CN = localhost, emailAddress = sadjflkadsj): : certificate has expired
Google Test trace:
/data0/somelongdirectorytoavoidrpathissues/src/kudu/src/kudu/rpc/rpc-test.cc:267: Connecting to 0.0.0.0:35449
I20260928 22:45:18.573702  1642 test_util.cc:175] -----------------------------------------------
I20260928 22:45:18.573760  1642 test_util.cc:176] Had fatal failures, leaving test files at /tmp/dist-test-tasks7j8V7/test-tmp/rpc-test.5.Parameters_TestRpc.TestCallWithChainCertAndChainCA_SSL_TCP.1790635518512660-1642-0
[  FAILED  ] Parameters/TestRpc.TestCallWithChainCertAndChainCA/SSL_TCP, where GetParam() = (true, false) (11 ms)
[ RUN      ] Parameters/TestRpc.TestCallWithPasswordProtectedKey/SSL_TCP
I20260928 22:45:18.580472  1703 acceptor_pool.cc:254] collecting diagnostics on the listening RPC socket 0.0.0.0:39803 every 8 connection(s)
I20260928 22:45:18.580500  1704 acceptor_pool.cc:254] collecting diagnostics on the listening RPC socket 0.0.0.0:39803 every 8 connection(s)
[       OK ] Parameters/TestRpc.TestCallWithPasswordProtectedKey/SSL_TCP (19 ms)
[ RUN      ] Parameters/TestRpc.TestCallToBadServer/SSL_TCP
I20260928 22:45:18.608062  1642 rpc-test.cc:394] Status: Network error: Client connection negotiation failed: client connection to 0.0.0.0:0: connect: Connection refused (error 111)
I20260928 22:45:18.608403  1642 rpc-test.cc:394] Status: Network error: Client connection negotiation failed: client connection to 0.0.0.0:0: connect: Connection refused (error 111)
I20260928 22:45:18.608628  1642 rpc-test.cc:394] Status: Network error: Client connection negotiation failed: client connection to 0.0.0.0:0: connect: Connection refused (error 111)
I20260928 22:45:18.608798  1642 rpc-test.cc:394] Status: Network error: Client connection negotiation failed: client connection to 0.0.0.0:0: connect: Connection refused (error 111)
I20260928 22:45:18.608947  1642 rpc-test.cc:394] Status: Network error: Client connection negotiation failed: client connection to 0.0.0.0:0: connect: Connection refused (error 111)
[       OK ] Parameters/TestRpc.TestCallToBadServer/SSL_TCP (16 ms)
[ RUN      ] Parameters/TestRpc.TestWrongService/SSL_TCP
I20260928 22:45:18.643129  1738 acceptor_pool.cc:254] collecting diagnostics on the listening RPC socket 0.0.0.0:40721 every 8 connection(s)
I20260928 22:45:18.643143  1739 acceptor_pool.cc:254] collecting diagnostics on the listening RPC socket 0.0.0.0:40721 every 8 connection(s)
I20260928 22:45:18.655767  1735 messenger.cc:345] service WrongServiceName not registered on TestServer
[       OK ] Parameters/TestRpc.TestWrongService/SSL_TCP (47 ms)
[ RUN      ] Parameters/TestRpc.TestConnectionKeepalive/SSL_TCP
I20260928 22:45:18.668473  1761 acceptor_pool.cc:254] collecting diagnostics on the listening RPC socket 0.0.0.0:35607 every 8 connection(s)
I20260928 22:45:18.668512  1762 acceptor_pool.cc:254] collecting diagnostics on the listening RPC socket 0.0.0.0:35607 every 8 connection(s)
I20260928 22:45:18.668663  1642 rpc-test.cc:488] Connecting to 0.0.0.0:35607
[       OK ] Parameters/TestRpc.TestConnectionKeepalive/SSL_TCP (1038 ms)
[ RUN      ] Parameters/TestRpc.TestClientConnectionMetrics/SSL_TCP
I20260928 22:45:19.706993  1786 acceptor_pool.cc:254] collecting diagnostics on the listening RPC socket 0.0.0.0:40477 every 8 connection(s)
I20260928 22:45:19.707023  1787 acceptor_pool.cc:254] collecting diagnostics on the listening RPC socket 0.0.0.0:40477 every 8 connection(s)
I20260928 22:45:19.707145  1642 rpc-test.cc:569] Connecting to 0.0.0.0:40477
[       OK ] Parameters/TestRpc.TestClientConnectionMetrics/SSL_TCP (8369 ms)
[ RUN      ] Parameters/TestRpc.TestCredentialsPolicy/SSL_TCP
I20260928 22:45:28.072962  1809 acceptor_pool.cc:254] collecting diagnostics on the listening RPC socket 0.0.0.0:43881 every 8 connection(s)
I20260928 22:45:28.073021  1810 acceptor_pool.cc:254] collecting diagnostics on the listening RPC socket 0.0.0.0:43881 every 8 connection(s)
I20260928 22:45:28.073166  1642 rpc-test.cc:700] Connecting to 0.0.0.0:43881
[       OK ] Parameters/TestRpc.TestCredentialsPolicy/SSL_TCP (26 ms)
[ RUN      ] Parameters/TestRpc.TestCallLongerThanKeepalive/SSL_TCP
I20260928 22:45:28.113572  1834 acceptor_pool.cc:254] collecting diagnostics on the listening RPC socket 0.0.0.0:35249 every 8 connection(s)
I20260928 22:45:28.113595  1835 acceptor_pool.cc:254] collecting diagnostics on the listening RPC socket 0.0.0.0:35249 every 8 connection(s)
I20260928 22:45:28.126341  1837 rpc-test-base.h:222] got call: sleep_micros: 3000000 deferred: true
I20260928 22:45:31.127027  1837 rpcz_store.cc:275] Call kudu.rpc.GenericCalculatorService.Sleep from 127.0.0.1:44292 (request call id 0) took 3000 ms. Trace:
I20260928 22:45:31.127138  1837 rpcz_store.cc:276] 0928 22:45:28.126282 (+     0us) service_pool.cc:170] Inserting onto call queue
0928 22:45:28.126316 (+    34us) service_pool.cc:227] Handling call
0928 22:45:31.127010 (+3000694us) inbound_call.cc:173] Queueing success response
Metrics: {}
[       OK ] Parameters/TestRpc.TestCallLongerThanKeepalive/SSL_TCP (3037 ms)
[ RUN      ] Parameters/TestRpc.TestRpcSidecar/SSL_TCP
I20260928 22:45:31.135569  1859 acceptor_pool.cc:254] collecting diagnostics on the listening RPC socket 0.0.0.0:46079 every 8 connection(s)
I20260928 22:45:31.135643  1860 acceptor_pool.cc:254] collecting diagnostics on the listening RPC socket 0.0.0.0:46079 every 8 connection(s)
[       OK ] Parameters/TestRpc.TestRpcSidecar/SSL_TCP (60 ms)
[ RUN      ] Parameters/TestRpc.TestRpcSidecarLimits/SSL_TCP
I20260928 22:45:32.702785  1884 acceptor_pool.cc:254] collecting diagnostics on the listening RPC socket 0.0.0.0:39317 every 8 connection(s)
I20260928 22:45:32.702811  1885 acceptor_pool.cc:254] collecting diagnostics on the listening RPC socket 0.0.0.0:39317 every 8 connection(s)
W20260928 22:45:32.710655  1642 serialization.cc:72] Serialized kudu.rpc_test.PushStringsRequestPB (2147483654 bytes) is larger than the maximum configured RPC message size (52428800 bytes). Sending anyway, but peer may reject the data.
W20260928 22:45:32.713726  1881 connection.cc:535] server connection from 127.0.0.1:53294 recv error: Network error: RPC frame had a length of 2147483714, but we only support messages up to 52428800 bytes long.
W20260928 22:45:32.713794  1881 connection.cc:158] shutting down server connection from 127.0.0.1:53294 with pending inbound data: 4/2147483714 bytes received; last active 0 ns ago: status Network error: RPC frame had a length of 2147483714, but we only support messages up to 52428800 bytes long.
W20260928 22:45:32.713939  1897 connection.cc:698] client connection to 0.0.0.0:39317 send error: Network error: failed to write to TLS socket: Connection reset by peer
W20260928 22:45:32.714044  1897 connection.cc:196] Error closing socket: Network error: TlsSocket::Close: Success
I20260928 22:45:32.722011  1909 acceptor_pool.cc:254] collecting diagnostics on the listening RPC socket 0.0.0.0:43603 every 8 connection(s)
I20260928 22:45:32.722049  1910 acceptor_pool.cc:254] collecting diagnostics on the listening RPC socket 0.0.0.0:43603 every 8 connection(s)
W20260928 22:45:36.153551  1907 connection.cc:577] server connection from 127.0.0.1:51460: received bad data: 'Corruption: Invalid packet: message had a length of 2147483710, but we only support messages up to 2147483647 bytes
'
[       OK ] Parameters/TestRpc.TestRpcSidecarLimits/SSL_TCP (4965 ms)
[ RUN      ] Parameters/TestRpc.TestCallTimeoutDoesntAffectNegotiation/SSL_TCP
I20260928 22:45:36.163460  1934 acceptor_pool.cc:254] collecting diagnostics on the listening RPC socket 0.0.0.0:32993 every 8 connection(s)
I20260928 22:45:36.163503  1935 acceptor_pool.cc:254] collecting diagnostics on the listening RPC socket 0.0.0.0:32993 every 8 connection(s)
W20260928 22:45:36.176743  1930 negotiation.cc:266] Injecting 500ms delay in negotiation
I20260928 22:45:36.227088  1642 rpc-test-base.h:595] status: Timed out: connection negotiation to 0.0.0.0:32993 for RPC Sleep timed out after 0.050s (ON_OUTBOUND_QUEUE), seconds elapsed: 0.0506792
[       OK ] Parameters/TestRpc.TestCallTimeoutDoesntAffectNegotiation/SSL_TCP (526 ms)
[ RUN      ] Parameters/TestRpc.TestRpcHandlerLatencyMetric/SSL_TCP
I20260928 22:45:36.689574  1959 acceptor_pool.cc:254] collecting diagnostics on the listening RPC socket 0.0.0.0:35157 every 8 connection(s)
I20260928 22:45:36.689674  1960 acceptor_pool.cc:254] collecting diagnostics on the listening RPC socket 0.0.0.0:35157 every 8 connection(s)
I20260928 22:45:36.723171  1642 rpc-test.cc:1236] Sleep() min lat: 20277
I20260928 22:45:36.723238  1642 rpc-test.cc:1237] Sleep() mean lat: 20277
I20260928 22:45:36.723263  1642 rpc-test.cc:1238] Sleep() max lat: 20277
I20260928 22:45:36.723274  1642 rpc-test.cc:1239] Sleep() #calls: 1
[       OK ] Parameters/TestRpc.TestRpcHandlerLatencyMetric/SSL_TCP (42 ms)
[ RUN      ] Parameters/TestRpc.TimedOutOnResponseMetricServiceQueue/SSL_TCP
I20260928 22:45:36.737069  1985 acceptor_pool.cc:254] collecting diagnostics on the listening RPC socket 0.0.0.0:41097 every 8 connection(s)
I20260928 22:45:36.737105  1986 acceptor_pool.cc:254] collecting diagnostics on the listening RPC socket 0.0.0.0:41097 every 8 connection(s)
W20260928 22:45:36.789634  1987 rpcz_store.cc:267] Call kudu.rpc_test.CalculatorService.Sleep from 127.0.0.1:46838 (request call id 2) took 20 ms (client timeout 20 ms). Trace:
W20260928 22:45:36.789740  1987 rpcz_store.cc:269] 0928 22:45:36.769401 (+     0us) service_pool.cc:170] Inserting onto call queue
0928 22:45:36.789601 (+ 20200us) service_pool.cc:214] Skipping call since client already timed out
0928 22:45:36.789614 (+    13us) inbound_call.cc:173] Queueing failure response
Metrics: {}
[       OK ] Parameters/TestRpc.TimedOutOnResponseMetricServiceQueue/SSL_TCP (66 ms)
[ RUN      ] Parameters/TestRpc.RpcPendingConnectionsMetric/SSL_TCP
I20260928 22:45:36.792714  2008 acceptor_pool.cc:254] collecting diagnostics on the listening RPC socket 0.0.0.0:34193 every 8 connection(s)
I20260928 22:45:36.792771  2009 acceptor_pool.cc:254] collecting diagnostics on the listening RPC socket 0.0.0.0:34193 every 8 connection(s)
W20260928 22:45:36.802049  2004 negotiation.cc:337] Failed RPC negotiation. Trace:
0928 22:45:36.801728 (+     0us) reactor.cc:625] Submitting negotiation task for server connection from 127.0.0.1:33880 (local address 127.0.0.1:34193)
0928 22:45:36.801854 (+   126us) server_negotiation.cc:206] Beginning negotiation
0928 22:45:36.801856 (+     2us) server_negotiation.cc:399] Waiting for connection header
0928 22:45:36.801957 (+   101us) negotiation.cc:327] Negotiation complete: Network error: Server connection negotiation failed: server connection from 127.0.0.1:33880: BlockingRecv error: recv got EOF from 127.0.0.1:33880 (error 108)
Metrics: {"server-negotiator.queue_time_us":87}
[       OK ] Parameters/TestRpc.RpcPendingConnectionsMetric/SSL_TCP (21 ms)
[ RUN      ] Parameters/TestRpc.TestRpcContextClientDeadline/SSL_TCP
I20260928 22:45:36.831712  2024 acceptor_pool.cc:254] collecting diagnostics on the listening RPC socket 0.0.0.0:39979 every 8 connection(s)
I20260928 22:45:36.831730  2025 acceptor_pool.cc:254] collecting diagnostics on the listening RPC socket 0.0.0.0:39979 every 8 connection(s)
[       OK ] Parameters/TestRpc.TestRpcContextClientDeadline/SSL_TCP (49 ms)
[ RUN      ] Parameters/TestRpc.TestApplicationFeatureFlagUnsupportedServer/SSL_TCP
I20260928 22:45:36.869726  2049 acceptor_pool.cc:254] collecting diagnostics on the listening RPC socket 0.0.0.0:32915 every 8 connection(s)
I20260928 22:45:36.869764  2050 acceptor_pool.cc:254] collecting diagnostics on the listening RPC socket 0.0.0.0:32915 every 8 connection(s)
[       OK ] Parameters/TestRpc.TestApplicationFeatureFlagUnsupportedServer/SSL_TCP (27 ms)
[ RUN      ] Parameters/TestRpc.TestCancellationAsync/SSL_TCP
I20260928 22:45:36.903723  2075 acceptor_pool.cc:254] collecting diagnostics on the listening RPC socket 0.0.0.0:39703 every 8 connection(s)
I20260928 22:45:36.903719  2074 acceptor_pool.cc:254] collecting diagnostics on the listening RPC socket 0.0.0.0:39703 every 8 connection(s)
I20260928 22:45:36.903858  1642 rpc-test.cc:1716] Connecting to 0.0.0.0:39703
I20260928 22:45:36.909870  1642 test_util.cc:268] Using random seed: -753301973
I20260928 22:45:36.924855  2078 rpc-test-base.h:240] got call: sleep_micros: 500 pattern: 4294967295 num_repetitions: 2097152 sidecar_idx: 0
I20260928 22:45:36.936518  2078 rpc-test-base.h:240] got call: sleep_micros: 500 pattern: 4294967295 num_repetitions: 2097152 sidecar_idx: 0
I20260928 22:45:36.947556  2078 rpc-test-base.h:240] got call: sleep_micros: 500 pattern: 4294967295 num_repetitions: 2097152 sidecar_idx: 0
I20260928 22:45:36.958628  2078 rpc-test-base.h:240] got call: sleep_micros: 500 pattern: 4294967295 num_repetitions: 2097152 sidecar_idx: 0
I20260928 22:45:36.970191  2078 rpc-test-base.h:240] got call: sleep_micros: 500 pattern: 4294967295 num_repetitions: 2097152 sidecar_idx: 0
I20260928 22:45:36.982134  2078 rpc-test-base.h:240] got call: sleep_micros: 500 pattern: 4294967295 num_repetitions: 2097152 sidecar_idx: 0
I20260928 22:45:36.993935  2078 rpc-test-base.h:240] got call: sleep_micros: 500 pattern: 4294967295 num_repetitions: 2097152 sidecar_idx: 0
I20260928 22:45:37.005311  2078 rpc-test-base.h:240] got call: sleep_micros: 500 pattern: 4294967295 num_repetitions: 2097152 sidecar_idx: 0
W20260928 22:45:37.008390  2073 connection.cc:441] server connection from 127.0.0.1:56138 torn down before Call kudu.rpc.GenericCalculatorService.SleepWithSidecar from 127.0.0.1:56138 (request call id 9) could send its response
[       OK ] Parameters/TestRpc.TestCancellationAsync/SSL_TCP (119 ms)
[ RUN      ] Parameters/TestRpc.TestPerformanceBySocketType/SSL_TCP
I20260928 22:45:37.027858  2099 acceptor_pool.cc:254] collecting diagnostics on the listening RPC socket 0.0.0.0:35497 every 8 connection(s)
I20260928 22:45:37.027884  2100 acceptor_pool.cc:254] collecting diagnostics on the listening RPC socket 0.0.0.0:35497 every 8 connection(s)
I20260928 22:45:37.028000  1642 rpc-test.cc:1846] Connecting to 0.0.0.0:35497
I20260928 22:45:38.656108  1642 rpc-test.cc:1859] Sending 1024MB via ssl-enabled tcp socket: real 1.613s	user 1.514s	sys 1.324s
I20260928 22:45:40.337471  1642 rpc-test.cc:1859] Sending 1024MB via ssl-enabled tcp socket: real 1.681s	user 1.679s	sys 1.271s
I20260928 22:45:41.951002  1642 rpc-test.cc:1859] Sending 1024MB via ssl-enabled tcp socket: real 1.613s	user 1.482s	sys 1.352s
I20260928 22:45:43.528241  1642 rpc-test.cc:1859] Sending 1024MB via ssl-enabled tcp socket: real 1.577s	user 1.511s	sys 1.273s
I20260928 22:45:45.146512  1642 rpc-test.cc:1859] Sending 1024MB via ssl-enabled tcp socket: real 1.618s	user 1.582s	sys 1.265s
[       OK ] Parameters/TestRpc.TestPerformanceBySocketType/SSL_TCP (8138 ms)
[----------] 20 tests from Parameters/TestRpc (26632 ms total)

[----------] 1 test from Parameters/TestRpcSocketTxRxQueue
[ RUN      ] Parameters/TestRpcSocketTxRxQueue.OverCapacity/0
W20260928 22:45:45.411700  2116 negotiation.cc:337] Failed RPC negotiation. Trace:
0928 22:45:45.149418 (+     0us) reactor.cc:625] Submitting negotiation task for client connection to 0.0.0.0:35475 (local address 127.0.0.1:48602)
0928 22:45:45.149471 (+    53us) negotiation.cc:107] Waiting for socket to connect
0928 22:45:45.149483 (+    12us) client_negotiation.cc:174] Beginning negotiation
0928 22:45:45.149534 (+    51us) client_negotiation.cc:252] Sending NEGOTIATE NegotiatePB request
0928 22:45:45.411545 (+262011us) negotiation.cc:327] Negotiation complete: Network error: Client connection negotiation failed: client connection to 0.0.0.0:35475: BlockingRecv error: recv error from unknown peer: Transport endpoint is not connected (error 107)
Metrics: {"client-negotiator.queue_time_us":17}
W20260928 22:45:45.411706  2152 negotiation.cc:337] Failed RPC negotiation. Trace:
0928 22:45:45.152686 (+     0us) reactor.cc:625] Submitting negotiation task for client connection to 0.0.0.0:35475 (local address 127.0.0.1:48644)
0928 22:45:45.152740 (+    54us) negotiation.cc:107] Waiting for socket to connect
0928 22:45:45.152749 (+     9us) client_negotiation.cc:174] Beginning negotiation
0928 22:45:45.152785 (+    36us) client_negotiation.cc:252] Sending NEGOTIATE NegotiatePB request
0928 22:45:45.411659 (+258874us) negotiation.cc:327] Negotiation complete: Network error: Client connection negotiation failed: client connection to 0.0.0.0:35475: BlockingRecv error: recv error from unknown peer: Transport endpoint is not connected (error 107)
Metrics: {"client-negotiator.queue_time_us":32}
W20260928 22:45:45.411898  2134 negotiation.cc:337] Failed RPC negotiation. Trace:
0928 22:45:45.151067 (+     0us) reactor.cc:625] Submitting negotiation task for client connection to 0.0.0.0:35475 (local address 127.0.0.1:48620)
0928 22:45:45.151104 (+    37us) negotiation.cc:107] Waiting for socket to connect
0928 22:45:45.151112 (+     8us) client_negotiation.cc:174] Beginning negotiation
0928 22:45:45.151146 (+    34us) client_negotiation.cc:252] Sending NEGOTIATE NegotiatePB request
0928 22:45:45.411590 (+260444us) negotiation.cc:327] Negotiation complete: Network error: Client connection negotiation failed: client connection to 0.0.0.0:35475: BlockingRecv error: recv error from unknown peer: Transport endpoint is not connected (error 107)
Metrics: {"client-negotiator.queue_time_us":19}
W20260928 22:45:45.411710  2125 negotiation.cc:337] Failed RPC negotiation. Trace:
0928 22:45:45.150213 (+     0us) reactor.cc:625] Submitting negotiation task for client connection to 0.0.0.0:35475 (local address 127.0.0.1:48614)
0928 22:45:45.150282 (+    69us) negotiation.cc:107] Waiting for socket to connect
0928 22:45:45.150292 (+    10us) client_negotiation.cc:174] Beginning negotiation
0928 22:45:45.150334 (+    42us) client_negotiation.cc:252] Sending NEGOTIATE NegotiatePB request
0928 22:45:45.411589 (+261255us) negotiation.cc:327] Negotiation complete: Network error: Client connection negotiation failed: client connection to 0.0.0.0:35475: BlockingRecv error: recv error from unknown peer: Transport endpoint is not connected (error 107)
Metrics: {"client-negotiator.queue_time_us":42}
W20260928 22:45:45.411785  2143 negotiation.cc:337] Failed RPC negotiation. Trace:
0928 22:45:45.151893 (+     0us) reactor.cc:625] Submitting negotiation task for client connection to 0.0.0.0:35475 (local address 127.0.0.1:48636)
0928 22:45:45.151939 (+    46us) negotiation.cc:107] Waiting for socket to connect
0928 22:45:45.151947 (+     8us) client_negotiation.cc:174] Beginning negotiation
0928 22:45:45.152008 (+    61us) client_negotiation.cc:252] Sending NEGOTIATE NegotiatePB request
0928 22:45:45.411736 (+259728us) negotiation.cc:327] Negotiation complete: Network error: Client connection negotiation failed: client connection to 0.0.0.0:35475: BlockingRecv error: recv error from unknown peer: Transport endpoint is not connected (error 107)
Metrics: {"client-negotiator.queue_time_us":28}
W20260928 22:45:45.411702  2161 negotiation.cc:337] Failed RPC negotiation. Trace:
0928 22:45:45.153464 (+     0us) reactor.cc:625] Submitting negotiation task for client connection to 0.0.0.0:35475 (local address 127.0.0.1:48648)
0928 22:45:45.153503 (+    39us) negotiation.cc:107] Waiting for socket to connect
0928 22:45:45.153511 (+     8us) client_negotiation.cc:174] Beginning negotiation
0928 22:45:45.153543 (+    32us) client_negotiation.cc:252] Sending NEGOTIATE NegotiatePB request
0928 22:45:45.411570 (+258027us) negotiation.cc:327] Negotiation complete: Network error: Client connection negotiation failed: client connection to 0.0.0.0:35475: BlockingRecv error: recv error from unknown peer: Transport endpoint is not connected (error 107)
Metrics: {"client-negotiator.queue_time_us":17}
[       OK ] Parameters/TestRpcSocketTxRxQueue.OverCapacity/0 (1038 ms)
[----------] 1 test from Parameters/TestRpcSocketTxRxQueue (1038 ms total)

[----------] Global test environment tear-down
[==========] 21 tests from 2 test suites ran. (27671 ms total)
[  PASSED  ] 20 tests.
[  FAILED  ] 1 test, listed below:
[  FAILED  ] Parameters/TestRpc.TestCallWithChainCertAndChainCA/SSL_TCP, where GetParam() = (true, false)

 1 FAILED TEST