Diagnosed failure

Parameters/TestRpc.TestCallWithChainCertAndChainCA/SSL_UnixSocket: /data0/somelongdirectorytoavoidrpathissues/src/kudu/src/kudu/rpc/rpc-test.cc:270: Failure
Failed
Bad status: Runtime error: could not verify certificate chain (error with cert: subject=CN = localhost, ST = sadfjas, C = AS, emailAddress = sdflkdsajf, O = lskdfjlsad, OU = sldfkja, issuer=C = AS, ST = ASDfkjdhf, L = lskdjf, O = saldfja, OU = skdjf, CN = localhost, emailAddress = sadjflkadsj): : certificate has expired
Google Test trace:
/data0/somelongdirectorytoavoidrpathissues/src/kudu/src/kudu/rpc/rpc-test.cc:267: Connecting to unix:/tmp/dist-test-task_vdudw/test-tmp/rpc-test-ceb9485afd1e49398415455db6d5b7f1.sock
I20260924 15:19:06.421758 28657 test_util.cc:175] -----------------------------------------------
I20260924 15:19:06.421803 28657 test_util.cc:176] Had fatal failures, leaving test files at /tmp/dist-test-task_vdudw/test-tmp/rpc-test.6.Parameters_TestRpc.TestCallWithChainCertAndChainCA_SSL_UnixSocket.1790263146352839-28657-0

Full log

Note: This is test shard 7 of 8.
[==========] Running 21 tests from 2 test suites.
[----------] Global test environment set-up.
[----------] 20 tests from Parameters/TestRpc
[ RUN      ] Parameters/TestRpc.TestMessengerCreateDestroy/SSL_UnixSocket
WARNING: Logging before InitGoogleLogging() is written to STDERR
I20260924 15:19:06.382280 28657 rpc-test.cc:169] started messenger TestCreateDestroy
[       OK ] Parameters/TestRpc.TestMessengerCreateDestroy/SSL_UnixSocket (27 ms)
[ RUN      ] Parameters/TestRpc.TestNegotiationDeadlock/SSL_UnixSocket
I20260924 15:19:06.397957 28677 acceptor_pool.cc:254] collecting diagnostics on the listening RPC socket unix:/tmp/dist-test-task_vdudw/test-tmp/rpc-test-18717941727a42f2b5b546f692afa3c4.sock every 8 connection(s)
I20260924 15:19:06.397960 28678 acceptor_pool.cc:254] collecting diagnostics on the listening RPC socket unix:/tmp/dist-test-task_vdudw/test-tmp/rpc-test-18717941727a42f2b5b546f692afa3c4.sock every 8 connection(s)
[       OK ] Parameters/TestRpc.TestNegotiationDeadlock/SSL_UnixSocket (21 ms)
[ RUN      ] Parameters/TestRpc.TestCallWithChainCertAndChainCA/SSL_UnixSocket
I20260924 15:19:06.418078 28695 acceptor_pool.cc:254] collecting diagnostics on the listening RPC socket unix:/tmp/dist-test-task_vdudw/test-tmp/rpc-test-ceb9485afd1e49398415455db6d5b7f1.sock every 8 connection(s)
I20260924 15:19:06.418126 28696 acceptor_pool.cc:254] collecting diagnostics on the listening RPC socket unix:/tmp/dist-test-task_vdudw/test-tmp/rpc-test-ceb9485afd1e49398415455db6d5b7f1.sock every 8 connection(s)
/data0/somelongdirectorytoavoidrpathissues/src/kudu/src/kudu/rpc/rpc-test.cc:270: Failure
Failed
Bad status: Runtime error: could not verify certificate chain (error with cert: subject=CN = localhost, ST = sadfjas, C = AS, emailAddress = sdflkdsajf, O = lskdfjlsad, OU = sldfkja, issuer=C = AS, ST = ASDfkjdhf, L = lskdjf, O = saldfja, OU = skdjf, CN = localhost, emailAddress = sadjflkadsj): : certificate has expired
Google Test trace:
/data0/somelongdirectorytoavoidrpathissues/src/kudu/src/kudu/rpc/rpc-test.cc:267: Connecting to unix:/tmp/dist-test-task_vdudw/test-tmp/rpc-test-ceb9485afd1e49398415455db6d5b7f1.sock
I20260924 15:19:06.421758 28657 test_util.cc:175] -----------------------------------------------
I20260924 15:19:06.421803 28657 test_util.cc:176] Had fatal failures, leaving test files at /tmp/dist-test-task_vdudw/test-tmp/rpc-test.6.Parameters_TestRpc.TestCallWithChainCertAndChainCA_SSL_UnixSocket.1790263146352839-28657-0
[  FAILED  ] Parameters/TestRpc.TestCallWithChainCertAndChainCA/SSL_UnixSocket, where GetParam() = (true, true) (17 ms)
[ RUN      ] Parameters/TestRpc.TestCallWithPasswordProtectedKey/SSL_UnixSocket
I20260924 15:19:06.435261 28721 acceptor_pool.cc:254] collecting diagnostics on the listening RPC socket unix:/tmp/dist-test-task_vdudw/test-tmp/rpc-test-15c507adc55c4c7d93ab694038a96864.sock every 8 connection(s)
I20260924 15:19:06.435300 28722 acceptor_pool.cc:254] collecting diagnostics on the listening RPC socket unix:/tmp/dist-test-task_vdudw/test-tmp/rpc-test-15c507adc55c4c7d93ab694038a96864.sock every 8 connection(s)
W20260924 15:19:06.446175 28718 connection.cc:196] Error closing socket: Network error: TlsSocket::Close: Broken pipe
[       OK ] Parameters/TestRpc.TestCallWithPasswordProtectedKey/SSL_UnixSocket (25 ms)
[ RUN      ] Parameters/TestRpc.TestCallToBadServer/SSL_UnixSocket
I20260924 15:19:06.466974 28657 rpc-test.cc:394] Status: Network error: Client connection negotiation failed: client connection to 0.0.0.0:0: connect: Connection refused (error 111)
I20260924 15:19:06.467417 28657 rpc-test.cc:394] Status: Network error: Client connection negotiation failed: client connection to 0.0.0.0:0: connect: Connection refused (error 111)
I20260924 15:19:06.467705 28657 rpc-test.cc:394] Status: Network error: Client connection negotiation failed: client connection to 0.0.0.0:0: connect: Connection refused (error 111)
I20260924 15:19:06.467945 28657 rpc-test.cc:394] Status: Network error: Client connection negotiation failed: client connection to 0.0.0.0:0: connect: Connection refused (error 111)
I20260924 15:19:06.468132 28657 rpc-test.cc:394] Status: Network error: Client connection negotiation failed: client connection to 0.0.0.0:0: connect: Connection refused (error 111)
[       OK ] Parameters/TestRpc.TestCallToBadServer/SSL_UnixSocket (21 ms)
[ RUN      ] Parameters/TestRpc.TestWrongService/SSL_UnixSocket
I20260924 15:19:06.485575 28757 acceptor_pool.cc:254] collecting diagnostics on the listening RPC socket unix:/tmp/dist-test-task_vdudw/test-tmp/rpc-test-f8468d9a40c44c4bbd7bb5ee4350aa9a.sock every 8 connection(s)
I20260924 15:19:06.485610 28758 acceptor_pool.cc:254] collecting diagnostics on the listening RPC socket unix:/tmp/dist-test-task_vdudw/test-tmp/rpc-test-f8468d9a40c44c4bbd7bb5ee4350aa9a.sock every 8 connection(s)
I20260924 15:19:06.493410 28754 messenger.cc:345] service WrongServiceName not registered on TestServer
[       OK ] Parameters/TestRpc.TestWrongService/SSL_UnixSocket (26 ms)
[ RUN      ] Parameters/TestRpc.TestConnectionKeepalive/SSL_UnixSocket
I20260924 15:19:06.513538 28780 acceptor_pool.cc:254] collecting diagnostics on the listening RPC socket unix:/tmp/dist-test-task_vdudw/test-tmp/rpc-test-8192c47bf5eb44bf8098890a22fcf60e.sock every 8 connection(s)
I20260924 15:19:06.513588 28781 acceptor_pool.cc:254] collecting diagnostics on the listening RPC socket unix:/tmp/dist-test-task_vdudw/test-tmp/rpc-test-8192c47bf5eb44bf8098890a22fcf60e.sock every 8 connection(s)
I20260924 15:19:06.513736 28657 rpc-test.cc:488] Connecting to unix:/tmp/dist-test-task_vdudw/test-tmp/rpc-test-8192c47bf5eb44bf8098890a22fcf60e.sock
W20260924 15:19:06.996452 28794 connection.cc:196] Error closing socket: Network error: TlsSocket::Close: Broken pipe
[       OK ] Parameters/TestRpc.TestConnectionKeepalive/SSL_UnixSocket (1039 ms)
[ RUN      ] Parameters/TestRpc.TestClientConnectionMetrics/SSL_UnixSocket
I20260924 15:19:07.545044 28806 acceptor_pool.cc:254] collecting diagnostics on the listening RPC socket unix:/tmp/dist-test-task_vdudw/test-tmp/rpc-test-c13c856100fa47d8b8955458e240a10a.sock every 8 connection(s)
I20260924 15:19:07.545233 28657 rpc-test.cc:569] Connecting to unix:/tmp/dist-test-task_vdudw/test-tmp/rpc-test-c13c856100fa47d8b8955458e240a10a.sock
I20260924 15:19:07.545411 28807 acceptor_pool.cc:254] collecting diagnostics on the listening RPC socket unix:/tmp/dist-test-task_vdudw/test-tmp/rpc-test-c13c856100fa47d8b8955458e240a10a.sock every 8 connection(s)
W20260924 15:19:15.893234 28803 connection.cc:196] Error closing socket: Network error: TlsSocket::Close: Broken pipe
[       OK ] Parameters/TestRpc.TestClientConnectionMetrics/SSL_UnixSocket (8359 ms)
[ RUN      ] Parameters/TestRpc.TestCredentialsPolicy/SSL_UnixSocket
I20260924 15:19:15.909569 28829 acceptor_pool.cc:254] collecting diagnostics on the listening RPC socket unix:/tmp/dist-test-task_vdudw/test-tmp/rpc-test-cbff525164694b0cb9edc1441f3e91e0.sock every 8 connection(s)
I20260924 15:19:15.909672 28830 acceptor_pool.cc:254] collecting diagnostics on the listening RPC socket unix:/tmp/dist-test-task_vdudw/test-tmp/rpc-test-cbff525164694b0cb9edc1441f3e91e0.sock every 8 connection(s)
I20260924 15:19:15.909816 28657 rpc-test.cc:700] Connecting to unix:/tmp/dist-test-task_vdudw/test-tmp/rpc-test-cbff525164694b0cb9edc1441f3e91e0.sock
W20260924 15:19:15.927436 28828 connection.cc:196] Error closing socket: Network error: TlsSocket::Close: Broken pipe
[       OK ] Parameters/TestRpc.TestCredentialsPolicy/SSL_UnixSocket (38 ms)
[ RUN      ] Parameters/TestRpc.TestCallLongerThanKeepalive/SSL_UnixSocket
I20260924 15:19:15.947952 28854 acceptor_pool.cc:254] collecting diagnostics on the listening RPC socket unix:/tmp/dist-test-task_vdudw/test-tmp/rpc-test-288caaf366d14210827e678321d3787b.sock every 8 connection(s)
I20260924 15:19:15.948001 28855 acceptor_pool.cc:254] collecting diagnostics on the listening RPC socket unix:/tmp/dist-test-task_vdudw/test-tmp/rpc-test-288caaf366d14210827e678321d3787b.sock every 8 connection(s)
I20260924 15:19:15.964543 28858 rpc-test-base.h:222] got call: sleep_micros: 3000000 deferred: true
I20260924 15:19:18.965255 28858 rpcz_store.cc:275] Call kudu.rpc.GenericCalculatorService.Sleep from unix:<unnamed> (request call id 0) took 3000 ms. Trace:
I20260924 15:19:18.965390 28858 rpcz_store.cc:276] 0924 15:19:15.964489 (+     0us) service_pool.cc:170] Inserting onto call queue
0924 15:19:15.964522 (+    33us) service_pool.cc:227] Handling call
0924 15:19:18.965236 (+3000714us) inbound_call.cc:173] Queueing success response
Metrics: {}
W20260924 15:19:18.966487 28851 connection.cc:196] Error closing socket: Network error: TlsSocket::Close: Broken pipe
[       OK ] Parameters/TestRpc.TestCallLongerThanKeepalive/SSL_UnixSocket (3035 ms)
[ RUN      ] Parameters/TestRpc.TestRpcSidecar/SSL_UnixSocket
I20260924 15:19:18.988986 28879 acceptor_pool.cc:254] collecting diagnostics on the listening RPC socket unix:/tmp/dist-test-task_vdudw/test-tmp/rpc-test-aeb09c85283546d8bcce8dfd9a83cfcf.sock every 8 connection(s)
I20260924 15:19:18.989017 28880 acceptor_pool.cc:254] collecting diagnostics on the listening RPC socket unix:/tmp/dist-test-task_vdudw/test-tmp/rpc-test-aeb09c85283546d8bcce8dfd9a83cfcf.sock every 8 connection(s)
W20260924 15:19:19.031373 28876 connection.cc:196] Error closing socket: Network error: TlsSocket::Close: Broken pipe
[       OK ] Parameters/TestRpc.TestRpcSidecar/SSL_UnixSocket (65 ms)
[ RUN      ] Parameters/TestRpc.TestRpcSidecarLimits/SSL_UnixSocket
I20260924 15:19:20.770875 28904 acceptor_pool.cc:254] collecting diagnostics on the listening RPC socket unix:/tmp/dist-test-task_vdudw/test-tmp/rpc-test-97036280a7d9486693a4973fca0f3729.sock every 8 connection(s)
I20260924 15:19:20.770920 28905 acceptor_pool.cc:254] collecting diagnostics on the listening RPC socket unix:/tmp/dist-test-task_vdudw/test-tmp/rpc-test-97036280a7d9486693a4973fca0f3729.sock every 8 connection(s)
W20260924 15:19:20.807181 28657 serialization.cc:72] Serialized kudu.rpc_test.PushStringsRequestPB (2147483654 bytes) is larger than the maximum configured RPC message size (52428800 bytes). Sending anyway, but peer may reject the data.
W20260924 15:19:20.810339 28901 connection.cc:535] server connection from unix:<unnamed> recv error: Network error: RPC frame had a length of 2147483714, but we only support messages up to 52428800 bytes long.
W20260924 15:19:20.810402 28901 connection.cc:158] shutting down server connection from unix:<unnamed> with pending inbound data: 4/2147483714 bytes received; last active 0 ns ago: status Network error: RPC frame had a length of 2147483714, but we only support messages up to 52428800 bytes long.
W20260924 15:19:20.810554 28917 connection.cc:698] client connection to unix:/tmp/dist-test-task_vdudw/test-tmp/rpc-test-97036280a7d9486693a4973fca0f3729.sock send error: Network error: failed to write to TLS socket: Broken pipe
W20260924 15:19:20.810683 28917 connection.cc:196] Error closing socket: Network error: TlsSocket::Close: Success
I20260924 15:19:20.829864 28931 acceptor_pool.cc:254] collecting diagnostics on the listening RPC socket unix:/tmp/dist-test-task_vdudw/test-tmp/rpc-test-97036280a7d9486693a4973fca0f3729.sock every 8 connection(s)
I20260924 15:19:20.829977 28929 acceptor_pool.cc:254] collecting diagnostics on the listening RPC socket unix:/tmp/dist-test-task_vdudw/test-tmp/rpc-test-97036280a7d9486693a4973fca0f3729.sock every 8 connection(s)
W20260924 15:19:25.157802 28926 connection.cc:577] server connection from unix:<unnamed>: received bad data: 'Corruption: Invalid packet: message had a length of 2147483710, but we only support messages up to 2147483647 bytes
'
W20260924 15:19:25.158097 28943 connection.cc:196] Error closing socket: Network error: TlsSocket::Close: Broken pipe
[       OK ] Parameters/TestRpc.TestRpcSidecarLimits/SSL_UnixSocket (6127 ms)
[ RUN      ] Parameters/TestRpc.TestCallTimeoutDoesntAffectNegotiation/SSL_UnixSocket
I20260924 15:19:25.194585 28956 acceptor_pool.cc:254] collecting diagnostics on the listening RPC socket unix:/tmp/dist-test-task_vdudw/test-tmp/rpc-test-dd02cd5bdf7c486aaba876192cdebdfb.sock every 8 connection(s)
I20260924 15:19:25.194630 28957 acceptor_pool.cc:254] collecting diagnostics on the listening RPC socket unix:/tmp/dist-test-task_vdudw/test-tmp/rpc-test-dd02cd5bdf7c486aaba876192cdebdfb.sock every 8 connection(s)
W20260924 15:19:25.211306 28952 negotiation.cc:266] Injecting 500ms delay in negotiation
I20260924 15:19:25.261683 28657 rpc-test-base.h:595] status: Timed out: connection negotiation to unix:/tmp/dist-test-task_vdudw/test-tmp/rpc-test-dd02cd5bdf7c486aaba876192cdebdfb.sock for RPC Sleep timed out after 0.050s (ON_OUTBOUND_QUEUE), seconds elapsed: 0.0506736
[       OK ] Parameters/TestRpc.TestCallTimeoutDoesntAffectNegotiation/SSL_UnixSocket (556 ms)
[ RUN      ] Parameters/TestRpc.TestRpcHandlerLatencyMetric/SSL_UnixSocket
I20260924 15:19:25.741277 28982 acceptor_pool.cc:254] collecting diagnostics on the listening RPC socket unix:/tmp/dist-test-task_vdudw/test-tmp/rpc-test-af03ab3fe9d14767aa2183fc5dc53c62.sock every 8 connection(s)
I20260924 15:19:25.741257 28981 acceptor_pool.cc:254] collecting diagnostics on the listening RPC socket unix:/tmp/dist-test-task_vdudw/test-tmp/rpc-test-af03ab3fe9d14767aa2183fc5dc53c62.sock every 8 connection(s)
I20260924 15:19:25.769959 28657 rpc-test.cc:1236] Sleep() min lat: 20348
I20260924 15:19:25.770043 28657 rpc-test.cc:1237] Sleep() mean lat: 20348
I20260924 15:19:25.770078 28657 rpc-test.cc:1238] Sleep() max lat: 20348
I20260924 15:19:25.770099 28657 rpc-test.cc:1239] Sleep() #calls: 1
W20260924 15:19:25.770823 28978 connection.cc:196] Error closing socket: Network error: TlsSocket::Close: Broken pipe
[       OK ] Parameters/TestRpc.TestRpcHandlerLatencyMetric/SSL_UnixSocket (55 ms)
[ RUN      ] Parameters/TestRpc.TimedOutOnResponseMetricServiceQueue/SSL_UnixSocket
I20260924 15:19:25.780920 29007 acceptor_pool.cc:254] collecting diagnostics on the listening RPC socket unix:/tmp/dist-test-task_vdudw/test-tmp/rpc-test-aedfc77d8ce8488a8fac9a35bd966790.sock every 8 connection(s)
I20260924 15:19:25.780983 29008 acceptor_pool.cc:254] collecting diagnostics on the listening RPC socket unix:/tmp/dist-test-task_vdudw/test-tmp/rpc-test-aedfc77d8ce8488a8fac9a35bd966790.sock every 8 connection(s)
W20260924 15:19:25.830706 29009 rpcz_store.cc:267] Call kudu.rpc_test.CalculatorService.Sleep from unix:<unnamed> (request call id 2) took 20 ms (client timeout 20 ms). Trace:
W20260924 15:19:25.830806 29009 rpcz_store.cc:269] 0924 15:19:25.810419 (+     0us) service_pool.cc:170] Inserting onto call queue
0924 15:19:25.830676 (+ 20257us) service_pool.cc:214] Skipping call since client already timed out
0924 15:19:25.830687 (+    11us) inbound_call.cc:173] Queueing failure response
Metrics: {}
[       OK ] Parameters/TestRpc.TimedOutOnResponseMetricServiceQueue/SSL_UnixSocket (60 ms)
[ RUN      ] Parameters/TestRpc.RpcPendingConnectionsMetric/SSL_UnixSocket
I20260924 15:19:25.833969 29031 acceptor_pool.cc:254] collecting diagnostics on the listening RPC socket 0.0.0.0:35635 every 8 connection(s)
I20260924 15:19:25.834064 29032 acceptor_pool.cc:254] collecting diagnostics on the listening RPC socket 0.0.0.0:35635 every 8 connection(s)
W20260924 15:19:25.834628 29027 negotiation.cc:337] Failed RPC negotiation. Trace:
0924 15:19:25.834467 (+     0us) reactor.cc:625] Submitting negotiation task for server connection from 127.0.0.1:60192 (local address 127.0.0.1:35635)
0924 15:19:25.834511 (+    44us) server_negotiation.cc:206] Beginning negotiation
0924 15:19:25.834513 (+     2us) server_negotiation.cc:399] Waiting for connection header
0924 15:19:25.834581 (+    68us) negotiation.cc:327] Negotiation complete: Network error: Server connection negotiation failed: server connection from 127.0.0.1:60192: BlockingRecv error: recv got EOF from 127.0.0.1:60192 (error 108)
Metrics: {"server-negotiator.queue_time_us":14}
[       OK ] Parameters/TestRpc.RpcPendingConnectionsMetric/SSL_UnixSocket (13 ms)
[ RUN      ] Parameters/TestRpc.TestRpcContextClientDeadline/SSL_UnixSocket
I20260924 15:19:25.863714 29047 acceptor_pool.cc:254] collecting diagnostics on the listening RPC socket unix:/tmp/dist-test-task_vdudw/test-tmp/rpc-test-29894f4232244dc3ab78fc907c3d0743.sock every 8 connection(s)
I20260924 15:19:25.863770 29048 acceptor_pool.cc:254] collecting diagnostics on the listening RPC socket unix:/tmp/dist-test-task_vdudw/test-tmp/rpc-test-29894f4232244dc3ab78fc907c3d0743.sock every 8 connection(s)
[       OK ] Parameters/TestRpc.TestRpcContextClientDeadline/SSL_UnixSocket (63 ms)
[ RUN      ] Parameters/TestRpc.TestApplicationFeatureFlagUnsupportedServer/SSL_UnixSocket
I20260924 15:19:25.916153 29072 acceptor_pool.cc:254] collecting diagnostics on the listening RPC socket unix:/tmp/dist-test-task_vdudw/test-tmp/rpc-test-293ae3d54c58496aa3ce271922c742a1.sock every 8 connection(s)
I20260924 15:19:25.916203 29073 acceptor_pool.cc:254] collecting diagnostics on the listening RPC socket unix:/tmp/dist-test-task_vdudw/test-tmp/rpc-test-293ae3d54c58496aa3ce271922c742a1.sock every 8 connection(s)
W20260924 15:19:25.925184 29069 connection.cc:196] Error closing socket: Network error: TlsSocket::Close: Broken pipe
[       OK ] Parameters/TestRpc.TestApplicationFeatureFlagUnsupportedServer/SSL_UnixSocket (16 ms)
[ RUN      ] Parameters/TestRpc.TestCancellationAsync/SSL_UnixSocket
I20260924 15:19:25.935761 29098 acceptor_pool.cc:254] collecting diagnostics on the listening RPC socket unix:/tmp/dist-test-task_vdudw/test-tmp/rpc-test-c122d1c23e38446c9c2d7a7fe3217f11.sock every 8 connection(s)
I20260924 15:19:25.935819 29100 acceptor_pool.cc:254] collecting diagnostics on the listening RPC socket unix:/tmp/dist-test-task_vdudw/test-tmp/rpc-test-c122d1c23e38446c9c2d7a7fe3217f11.sock every 8 connection(s)
I20260924 15:19:25.936002 28657 rpc-test.cc:1716] Connecting to unix:/tmp/dist-test-task_vdudw/test-tmp/rpc-test-c122d1c23e38446c9c2d7a7fe3217f11.sock
I20260924 15:19:25.953179 28657 test_util.cc:268] Using random seed: 537896088
I20260924 15:19:25.967032 29103 rpc-test-base.h:240] got call: sleep_micros: 500 pattern: 4294967295 num_repetitions: 2097152 sidecar_idx: 0
I20260924 15:19:25.977962 29103 rpc-test-base.h:240] got call: sleep_micros: 500 pattern: 4294967295 num_repetitions: 2097152 sidecar_idx: 0
I20260924 15:19:25.988498 29103 rpc-test-base.h:240] got call: sleep_micros: 500 pattern: 4294967295 num_repetitions: 2097152 sidecar_idx: 0
I20260924 15:19:25.999444 29103 rpc-test-base.h:240] got call: sleep_micros: 500 pattern: 4294967295 num_repetitions: 2097152 sidecar_idx: 0
I20260924 15:19:26.010370 29103 rpc-test-base.h:240] got call: sleep_micros: 500 pattern: 4294967295 num_repetitions: 2097152 sidecar_idx: 0
I20260924 15:19:26.020793 29103 rpc-test-base.h:240] got call: sleep_micros: 500 pattern: 4294967295 num_repetitions: 2097152 sidecar_idx: 0
I20260924 15:19:26.031322 29103 rpc-test-base.h:240] got call: sleep_micros: 500 pattern: 4294967295 num_repetitions: 2097152 sidecar_idx: 0
I20260924 15:19:26.041558 29103 rpc-test-base.h:240] got call: sleep_micros: 500 pattern: 4294967295 num_repetitions: 2097152 sidecar_idx: 0
W20260924 15:19:26.042939 29095 connection.cc:196] Error closing socket: Network error: TlsSocket::Close: Broken pipe
W20260924 15:19:26.044534 29095 connection.cc:441] server connection from unix:<unnamed> torn down before Call kudu.rpc.GenericCalculatorService.SleepWithSidecar from unix:<unnamed> (request call id 9) could send its response
[       OK ] Parameters/TestRpc.TestCancellationAsync/SSL_UnixSocket (119 ms)
[ RUN      ] Parameters/TestRpc.TestPerformanceBySocketType/SSL_UnixSocket
I20260924 15:19:26.058965 29125 acceptor_pool.cc:254] collecting diagnostics on the listening RPC socket unix:/tmp/dist-test-task_vdudw/test-tmp/rpc-test-46dee9eb7bc14c2fba6b79590835144e.sock every 8 connection(s)
I20260924 15:19:26.058987 29124 acceptor_pool.cc:254] collecting diagnostics on the listening RPC socket unix:/tmp/dist-test-task_vdudw/test-tmp/rpc-test-46dee9eb7bc14c2fba6b79590835144e.sock every 8 connection(s)
I20260924 15:19:26.059129 28657 rpc-test.cc:1846] Connecting to unix:/tmp/dist-test-task_vdudw/test-tmp/rpc-test-46dee9eb7bc14c2fba6b79590835144e.sock
I20260924 15:19:27.332440 28657 rpc-test.cc:1859] Sending 1024MB via ssl-enabled unix socket: real 1.264s	user 1.399s	sys 0.870s
I20260924 15:19:28.619102 28657 rpc-test.cc:1859] Sending 1024MB via ssl-enabled unix socket: real 1.287s	user 1.490s	sys 0.831s
I20260924 15:19:29.824537 28657 rpc-test.cc:1859] Sending 1024MB via ssl-enabled unix socket: real 1.205s	user 1.257s	sys 0.916s
I20260924 15:19:31.001281 28657 rpc-test.cc:1859] Sending 1024MB via ssl-enabled unix socket: real 1.177s	user 1.265s	sys 0.862s
I20260924 15:19:32.227679 28657 rpc-test.cc:1859] Sending 1024MB via ssl-enabled unix socket: real 1.226s	user 1.320s	sys 0.887s
W20260924 15:19:32.228384 29121 connection.cc:196] Error closing socket: Network error: TlsSocket::Close: Broken pipe
[       OK ] Parameters/TestRpc.TestPerformanceBySocketType/SSL_UnixSocket (6183 ms)
[----------] 20 tests from Parameters/TestRpc (25874 ms total)

[----------] 1 test from Parameters/TestRpcSocketTxRxQueue
[ RUN      ] Parameters/TestRpcSocketTxRxQueue.AcceptorRxQueueSizeMetric/0
I20260924 15:19:32.254595 29149 acceptor_pool.cc:254] collecting diagnostics on the listening RPC socket 0.0.0.0:40165 every 1 connection(s)
I20260924 15:19:32.254657 29150 acceptor_pool.cc:254] collecting diagnostics on the listening RPC socket 0.0.0.0:40165 every 1 connection(s)
W20260924 15:19:32.255268 29145 negotiation.cc:337] Failed RPC negotiation. Trace:
0924 15:19:32.255122 (+     0us) reactor.cc:625] Submitting negotiation task for server connection from 127.0.0.1:60180 (local address 127.0.0.1:40165)
0924 15:19:32.255174 (+    52us) server_negotiation.cc:206] Beginning negotiation
0924 15:19:32.255175 (+     1us) server_negotiation.cc:399] Waiting for connection header
0924 15:19:32.255237 (+    62us) negotiation.cc:327] Negotiation complete: Network error: Server connection negotiation failed: server connection from 127.0.0.1:60180: BlockingRecv error: recv got EOF from 127.0.0.1:60180 (error 108)
Metrics: {"server-negotiator.queue_time_us":25}
[       OK ] Parameters/TestRpcSocketTxRxQueue.AcceptorRxQueueSizeMetric/0 (27 ms)
[----------] 1 test from Parameters/TestRpcSocketTxRxQueue (27 ms total)

[----------] Global test environment tear-down
[==========] 21 tests from 2 test suites ran. (25902 ms total)
[  PASSED  ] 20 tests.
[  FAILED  ] 1 test, listed below:
[  FAILED  ] Parameters/TestRpc.TestCallWithChainCertAndChainCA/SSL_UnixSocket, where GetParam() = (true, true)

 1 FAILED TEST