Diagnosed failure
Parameters/TestRpc.TestCallWithChainCertAndChainCA/SSL_UnixSocket: /data0/somelongdirectorytoavoidrpathissues/src/kudu/src/kudu/rpc/rpc-test.cc:270: Failure
Failed
Bad status: Runtime error: could not verify certificate chain (error with cert: subject=CN = localhost, ST = sadfjas, C = AS, emailAddress = sdflkdsajf, O = lskdfjlsad, OU = sldfkja, issuer=C = AS, ST = ASDfkjdhf, L = lskdjf, O = saldfja, OU = skdjf, CN = localhost, emailAddress = sadjflkadsj): : certificate has expired
Google Test trace:
/data0/somelongdirectorytoavoidrpathissues/src/kudu/src/kudu/rpc/rpc-test.cc:267: Connecting to unix:/tmp/dist-test-task_MgS8j/test-tmp/rpc-test-295f601349ba4ddb8f5d41b00aa65535.sock
I20260924 07:12:20.441291 6995 test_util.cc:175] -----------------------------------------------
I20260924 07:12:20.441342 6995 test_util.cc:176] Had fatal failures, leaving test files at /tmp/dist-test-task_MgS8j/test-tmp/rpc-test.6.Parameters_TestRpc.TestCallWithChainCertAndChainCA_SSL_UnixSocket.1790233940374872-6995-0
Full log
Note: This is test shard 7 of 8.
[==========] Running 21 tests from 2 test suites.
[----------] Global test environment set-up.
[----------] 20 tests from Parameters/TestRpc
[ RUN ] Parameters/TestRpc.TestMessengerCreateDestroy/SSL_UnixSocket
WARNING: Logging before InitGoogleLogging() is written to STDERR
I20260924 07:12:20.391266 6995 rpc-test.cc:169] started messenger TestCreateDestroy
[ OK ] Parameters/TestRpc.TestMessengerCreateDestroy/SSL_UnixSocket (14 ms)
[ RUN ] Parameters/TestRpc.TestNegotiationDeadlock/SSL_UnixSocket
I20260924 07:12:20.410542 7015 acceptor_pool.cc:254] collecting diagnostics on the listening RPC socket unix:/tmp/dist-test-task_MgS8j/test-tmp/rpc-test-2047f4efd6f54784bccbc8f64936fbee.sock every 8 connection(s)
I20260924 07:12:20.410554 7016 acceptor_pool.cc:254] collecting diagnostics on the listening RPC socket unix:/tmp/dist-test-task_MgS8j/test-tmp/rpc-test-2047f4efd6f54784bccbc8f64936fbee.sock every 8 connection(s)
[ OK ] Parameters/TestRpc.TestNegotiationDeadlock/SSL_UnixSocket (25 ms)
[ RUN ] Parameters/TestRpc.TestCallWithChainCertAndChainCA/SSL_UnixSocket
I20260924 07:12:20.437392 7032 acceptor_pool.cc:254] collecting diagnostics on the listening RPC socket unix:/tmp/dist-test-task_MgS8j/test-tmp/rpc-test-295f601349ba4ddb8f5d41b00aa65535.sock every 8 connection(s)
I20260924 07:12:20.437392 7031 acceptor_pool.cc:254] collecting diagnostics on the listening RPC socket unix:/tmp/dist-test-task_MgS8j/test-tmp/rpc-test-295f601349ba4ddb8f5d41b00aa65535.sock every 8 connection(s)
/data0/somelongdirectorytoavoidrpathissues/src/kudu/src/kudu/rpc/rpc-test.cc:270: Failure
Failed
Bad status: Runtime error: could not verify certificate chain (error with cert: subject=CN = localhost, ST = sadfjas, C = AS, emailAddress = sdflkdsajf, O = lskdfjlsad, OU = sldfkja, issuer=C = AS, ST = ASDfkjdhf, L = lskdjf, O = saldfja, OU = skdjf, CN = localhost, emailAddress = sadjflkadsj): : certificate has expired
Google Test trace:
/data0/somelongdirectorytoavoidrpathissues/src/kudu/src/kudu/rpc/rpc-test.cc:267: Connecting to unix:/tmp/dist-test-task_MgS8j/test-tmp/rpc-test-295f601349ba4ddb8f5d41b00aa65535.sock
I20260924 07:12:20.441291 6995 test_util.cc:175] -----------------------------------------------
I20260924 07:12:20.441342 6995 test_util.cc:176] Had fatal failures, leaving test files at /tmp/dist-test-task_MgS8j/test-tmp/rpc-test.6.Parameters_TestRpc.TestCallWithChainCertAndChainCA_SSL_UnixSocket.1790233940374872-6995-0
[ FAILED ] Parameters/TestRpc.TestCallWithChainCertAndChainCA/SSL_UnixSocket, where GetParam() = (true, true) (24 ms)
[ RUN ] Parameters/TestRpc.TestCallWithPasswordProtectedKey/SSL_UnixSocket
I20260924 07:12:20.449576 7056 acceptor_pool.cc:254] collecting diagnostics on the listening RPC socket unix:/tmp/dist-test-task_MgS8j/test-tmp/rpc-test-fa44d9ffb5ee4e4c940795111531774e.sock every 8 connection(s)
I20260924 07:12:20.449577 7057 acceptor_pool.cc:254] collecting diagnostics on the listening RPC socket unix:/tmp/dist-test-task_MgS8j/test-tmp/rpc-test-fa44d9ffb5ee4e4c940795111531774e.sock every 8 connection(s)
W20260924 07:12:20.461037 7053 connection.cc:196] Error closing socket: Network error: TlsSocket::Close: Broken pipe
[ OK ] Parameters/TestRpc.TestCallWithPasswordProtectedKey/SSL_UnixSocket (20 ms)
[ RUN ] Parameters/TestRpc.TestCallToBadServer/SSL_UnixSocket
I20260924 07:12:20.474790 6995 rpc-test.cc:394] Status: Network error: Client connection negotiation failed: client connection to 0.0.0.0:0: connect: Connection refused (error 111)
I20260924 07:12:20.475116 6995 rpc-test.cc:394] Status: Network error: Client connection negotiation failed: client connection to 0.0.0.0:0: connect: Connection refused (error 111)
I20260924 07:12:20.475436 6995 rpc-test.cc:394] Status: Network error: Client connection negotiation failed: client connection to 0.0.0.0:0: connect: Connection refused (error 111)
I20260924 07:12:20.475682 6995 rpc-test.cc:394] Status: Network error: Client connection negotiation failed: client connection to 0.0.0.0:0: connect: Connection refused (error 111)
I20260924 07:12:20.475929 6995 rpc-test.cc:394] Status: Network error: Client connection negotiation failed: client connection to 0.0.0.0:0: connect: Connection refused (error 111)
[ OK ] Parameters/TestRpc.TestCallToBadServer/SSL_UnixSocket (14 ms)
[ RUN ] Parameters/TestRpc.TestWrongService/SSL_UnixSocket
I20260924 07:12:20.485302 7091 acceptor_pool.cc:254] collecting diagnostics on the listening RPC socket unix:/tmp/dist-test-task_MgS8j/test-tmp/rpc-test-01f4d4c6b2cd4c38851670ee9f80df9b.sock every 8 connection(s)
I20260924 07:12:20.485351 7092 acceptor_pool.cc:254] collecting diagnostics on the listening RPC socket unix:/tmp/dist-test-task_MgS8j/test-tmp/rpc-test-01f4d4c6b2cd4c38851670ee9f80df9b.sock every 8 connection(s)
I20260924 07:12:20.506987 7088 messenger.cc:345] service WrongServiceName not registered on TestServer
[ OK ] Parameters/TestRpc.TestWrongService/SSL_UnixSocket (32 ms)
[ RUN ] Parameters/TestRpc.TestConnectionKeepalive/SSL_UnixSocket
I20260924 07:12:20.516141 7114 acceptor_pool.cc:254] collecting diagnostics on the listening RPC socket unix:/tmp/dist-test-task_MgS8j/test-tmp/rpc-test-279aafba10b94dd99d4eb54d518b4790.sock every 8 connection(s)
I20260924 07:12:20.516191 7115 acceptor_pool.cc:254] collecting diagnostics on the listening RPC socket unix:/tmp/dist-test-task_MgS8j/test-tmp/rpc-test-279aafba10b94dd99d4eb54d518b4790.sock every 8 connection(s)
I20260924 07:12:20.516362 6995 rpc-test.cc:488] Connecting to unix:/tmp/dist-test-task_MgS8j/test-tmp/rpc-test-279aafba10b94dd99d4eb54d518b4790.sock
W20260924 07:12:21.010018 7127 connection.cc:196] Error closing socket: Network error: TlsSocket::Close: Broken pipe
[ OK ] Parameters/TestRpc.TestConnectionKeepalive/SSL_UnixSocket (1055 ms)
[ RUN ] Parameters/TestRpc.TestClientConnectionMetrics/SSL_UnixSocket
I20260924 07:12:21.574709 7139 acceptor_pool.cc:254] collecting diagnostics on the listening RPC socket unix:/tmp/dist-test-task_MgS8j/test-tmp/rpc-test-8b081d84a1b24e248bbf57c7fa88401f.sock every 8 connection(s)
I20260924 07:12:21.574829 7140 acceptor_pool.cc:254] collecting diagnostics on the listening RPC socket unix:/tmp/dist-test-task_MgS8j/test-tmp/rpc-test-8b081d84a1b24e248bbf57c7fa88401f.sock every 8 connection(s)
I20260924 07:12:21.574957 6995 rpc-test.cc:569] Connecting to unix:/tmp/dist-test-task_MgS8j/test-tmp/rpc-test-8b081d84a1b24e248bbf57c7fa88401f.sock
W20260924 07:12:29.854735 7136 connection.cc:196] Error closing socket: Network error: TlsSocket::Close: Broken pipe
[ OK ] Parameters/TestRpc.TestClientConnectionMetrics/SSL_UnixSocket (8291 ms)
[ RUN ] Parameters/TestRpc.TestCredentialsPolicy/SSL_UnixSocket
I20260924 07:12:29.880795 7162 acceptor_pool.cc:254] collecting diagnostics on the listening RPC socket unix:/tmp/dist-test-task_MgS8j/test-tmp/rpc-test-d93555fd67944f25bbf7936d2c458388.sock every 8 connection(s)
I20260924 07:12:29.880842 7163 acceptor_pool.cc:254] collecting diagnostics on the listening RPC socket unix:/tmp/dist-test-task_MgS8j/test-tmp/rpc-test-d93555fd67944f25bbf7936d2c458388.sock every 8 connection(s)
I20260924 07:12:29.880997 6995 rpc-test.cc:700] Connecting to unix:/tmp/dist-test-task_MgS8j/test-tmp/rpc-test-d93555fd67944f25bbf7936d2c458388.sock
W20260924 07:12:29.906262 7161 connection.cc:196] Error closing socket: Network error: TlsSocket::Close: Broken pipe
[ OK ] Parameters/TestRpc.TestCredentialsPolicy/SSL_UnixSocket (54 ms)
[ RUN ] Parameters/TestRpc.TestCallLongerThanKeepalive/SSL_UnixSocket
I20260924 07:12:29.929000 7187 acceptor_pool.cc:254] collecting diagnostics on the listening RPC socket unix:/tmp/dist-test-task_MgS8j/test-tmp/rpc-test-e4beeab053ee4880893d6670de6bcfb0.sock every 8 connection(s)
I20260924 07:12:29.929052 7188 acceptor_pool.cc:254] collecting diagnostics on the listening RPC socket unix:/tmp/dist-test-task_MgS8j/test-tmp/rpc-test-e4beeab053ee4880893d6670de6bcfb0.sock every 8 connection(s)
I20260924 07:12:29.958527 7191 rpc-test-base.h:222] got call: sleep_micros: 3000000 deferred: true
I20260924 07:12:32.959163 7191 rpcz_store.cc:275] Call kudu.rpc.GenericCalculatorService.Sleep from unix:<unnamed> (request call id 0) took 3000 ms. Trace:
I20260924 07:12:32.959259 7191 rpcz_store.cc:276] 0924 07:12:29.958462 (+ 0us) service_pool.cc:170] Inserting onto call queue
0924 07:12:29.958510 (+ 48us) service_pool.cc:227] Handling call
0924 07:12:32.959148 (+3000638us) inbound_call.cc:173] Queueing success response
Metrics: {}
W20260924 07:12:32.960139 7184 connection.cc:196] Error closing socket: Network error: TlsSocket::Close: Broken pipe
[ OK ] Parameters/TestRpc.TestCallLongerThanKeepalive/SSL_UnixSocket (3050 ms)
[ RUN ] Parameters/TestRpc.TestRpcSidecar/SSL_UnixSocket
I20260924 07:12:32.971517 7212 acceptor_pool.cc:254] collecting diagnostics on the listening RPC socket unix:/tmp/dist-test-task_MgS8j/test-tmp/rpc-test-fa00206ce4e34509a055206e8d8b2a21.sock every 8 connection(s)
I20260924 07:12:32.971570 7213 acceptor_pool.cc:254] collecting diagnostics on the listening RPC socket unix:/tmp/dist-test-task_MgS8j/test-tmp/rpc-test-fa00206ce4e34509a055206e8d8b2a21.sock every 8 connection(s)
W20260924 07:12:33.017289 7209 connection.cc:196] Error closing socket: Network error: TlsSocket::Close: Broken pipe
[ OK ] Parameters/TestRpc.TestRpcSidecar/SSL_UnixSocket (57 ms)
[ RUN ] Parameters/TestRpc.TestRpcSidecarLimits/SSL_UnixSocket
I20260924 07:12:34.730139 7237 acceptor_pool.cc:254] collecting diagnostics on the listening RPC socket unix:/tmp/dist-test-task_MgS8j/test-tmp/rpc-test-30501a580d85482ba7bb1fee0b6bbfb1.sock every 8 connection(s)
I20260924 07:12:34.730185 7238 acceptor_pool.cc:254] collecting diagnostics on the listening RPC socket unix:/tmp/dist-test-task_MgS8j/test-tmp/rpc-test-30501a580d85482ba7bb1fee0b6bbfb1.sock every 8 connection(s)
W20260924 07:12:34.746980 6995 serialization.cc:72] Serialized kudu.rpc_test.PushStringsRequestPB (2147483654 bytes) is larger than the maximum configured RPC message size (52428800 bytes). Sending anyway, but peer may reject the data.
W20260924 07:12:34.750046 7234 connection.cc:535] server connection from unix:<unnamed> recv error: Network error: RPC frame had a length of 2147483714, but we only support messages up to 52428800 bytes long.
W20260924 07:12:34.750115 7234 connection.cc:158] shutting down server connection from unix:<unnamed> with pending inbound data: 4/2147483714 bytes received; last active 0 ns ago: status Network error: RPC frame had a length of 2147483714, but we only support messages up to 52428800 bytes long.
W20260924 07:12:34.750309 7250 connection.cc:196] Error closing socket: Network error: TlsSocket::Close: Broken pipe
I20260924 07:12:34.769508 7262 acceptor_pool.cc:254] collecting diagnostics on the listening RPC socket unix:/tmp/dist-test-task_MgS8j/test-tmp/rpc-test-30501a580d85482ba7bb1fee0b6bbfb1.sock every 8 connection(s)
I20260924 07:12:34.769538 7263 acceptor_pool.cc:254] collecting diagnostics on the listening RPC socket unix:/tmp/dist-test-task_MgS8j/test-tmp/rpc-test-30501a580d85482ba7bb1fee0b6bbfb1.sock every 8 connection(s)
W20260924 07:12:38.951113 7259 connection.cc:577] server connection from unix:<unnamed>: received bad data: 'Corruption: Invalid packet: message had a length of 2147483710, but we only support messages up to 2147483647 bytes
'
W20260924 07:12:38.951371 7275 connection.cc:196] Error closing socket: Network error: TlsSocket::Close: Broken pipe
[ OK ] Parameters/TestRpc.TestRpcSidecarLimits/SSL_UnixSocket (5934 ms)
[ RUN ] Parameters/TestRpc.TestCallTimeoutDoesntAffectNegotiation/SSL_UnixSocket
I20260924 07:12:38.972802 7287 acceptor_pool.cc:254] collecting diagnostics on the listening RPC socket unix:/tmp/dist-test-task_MgS8j/test-tmp/rpc-test-c4b1e52925604e9da70185e6387ec08a.sock every 8 connection(s)
I20260924 07:12:38.972831 7288 acceptor_pool.cc:254] collecting diagnostics on the listening RPC socket unix:/tmp/dist-test-task_MgS8j/test-tmp/rpc-test-c4b1e52925604e9da70185e6387ec08a.sock every 8 connection(s)
W20260924 07:12:38.978518 7283 negotiation.cc:266] Injecting 500ms delay in negotiation
I20260924 07:12:39.028733 6995 rpc-test-base.h:595] status: Timed out: connection negotiation to unix:/tmp/dist-test-task_MgS8j/test-tmp/rpc-test-c4b1e52925604e9da70185e6387ec08a.sock for RPC Sleep timed out after 0.050s (ON_OUTBOUND_QUEUE), seconds elapsed: 0.0505103
[ OK ] Parameters/TestRpc.TestCallTimeoutDoesntAffectNegotiation/SSL_UnixSocket (530 ms)
[ RUN ] Parameters/TestRpc.TestRpcHandlerLatencyMetric/SSL_UnixSocket
I20260924 07:12:39.492314 7313 acceptor_pool.cc:254] collecting diagnostics on the listening RPC socket unix:/tmp/dist-test-task_MgS8j/test-tmp/rpc-test-51e210b9a70a4deeb2d0e9a0a42f8672.sock every 8 connection(s)
I20260924 07:12:39.492304 7312 acceptor_pool.cc:254] collecting diagnostics on the listening RPC socket unix:/tmp/dist-test-task_MgS8j/test-tmp/rpc-test-51e210b9a70a4deeb2d0e9a0a42f8672.sock every 8 connection(s)
I20260924 07:12:39.527124 6995 rpc-test.cc:1236] Sleep() min lat: 20297
I20260924 07:12:39.527204 6995 rpc-test.cc:1237] Sleep() mean lat: 20297
I20260924 07:12:39.527232 6995 rpc-test.cc:1238] Sleep() max lat: 20297
I20260924 07:12:39.527246 6995 rpc-test.cc:1239] Sleep() #calls: 1
[ OK ] Parameters/TestRpc.TestRpcHandlerLatencyMetric/SSL_UnixSocket (45 ms)
[ RUN ] Parameters/TestRpc.TimedOutOnResponseMetricServiceQueue/SSL_UnixSocket
I20260924 07:12:39.583524 7338 acceptor_pool.cc:254] collecting diagnostics on the listening RPC socket unix:/tmp/dist-test-task_MgS8j/test-tmp/rpc-test-9843edb4b50c42cb872bf08000768330.sock every 8 connection(s)
I20260924 07:12:39.583578 7339 acceptor_pool.cc:254] collecting diagnostics on the listening RPC socket unix:/tmp/dist-test-task_MgS8j/test-tmp/rpc-test-9843edb4b50c42cb872bf08000768330.sock every 8 connection(s)
W20260924 07:12:39.644219 7340 rpcz_store.cc:267] Call kudu.rpc_test.CalculatorService.Sleep from unix:<unnamed> (request call id 2) took 20 ms (client timeout 20 ms). Trace:
W20260924 07:12:39.644326 7340 rpcz_store.cc:269] 0924 07:12:39.624022 (+ 0us) service_pool.cc:170] Inserting onto call queue
0924 07:12:39.644196 (+ 20174us) service_pool.cc:214] Skipping call since client already timed out
0924 07:12:39.644206 (+ 10us) inbound_call.cc:173] Queueing failure response
Metrics: {}
W20260924 07:12:39.644855 7335 connection.cc:196] Error closing socket: Network error: TlsSocket::Close: Broken pipe
[ OK ] Parameters/TestRpc.TimedOutOnResponseMetricServiceQueue/SSL_UnixSocket (116 ms)
[ RUN ] Parameters/TestRpc.RpcPendingConnectionsMetric/SSL_UnixSocket
I20260924 07:12:39.647586 7361 acceptor_pool.cc:254] collecting diagnostics on the listening RPC socket 0.0.0.0:43517 every 8 connection(s)
I20260924 07:12:39.647652 7362 acceptor_pool.cc:254] collecting diagnostics on the listening RPC socket 0.0.0.0:43517 every 8 connection(s)
W20260924 07:12:39.648311 7357 negotiation.cc:337] Failed RPC negotiation. Trace:
0924 07:12:39.648152 (+ 0us) reactor.cc:625] Submitting negotiation task for server connection from 127.0.0.1:42314 (local address 127.0.0.1:43517)
0924 07:12:39.648194 (+ 42us) server_negotiation.cc:206] Beginning negotiation
0924 07:12:39.648196 (+ 2us) server_negotiation.cc:399] Waiting for connection header
0924 07:12:39.648264 (+ 68us) negotiation.cc:327] Negotiation complete: Network error: Server connection negotiation failed: server connection from 127.0.0.1:42314: BlockingRecv error: recv got EOF from 127.0.0.1:42314 (error 108)
Metrics: {"server-negotiator.queue_time_us":15}
[ OK ] Parameters/TestRpc.RpcPendingConnectionsMetric/SSL_UnixSocket (13 ms)
[ RUN ] Parameters/TestRpc.TestRpcContextClientDeadline/SSL_UnixSocket
I20260924 07:12:39.686627 7377 acceptor_pool.cc:254] collecting diagnostics on the listening RPC socket unix:/tmp/dist-test-task_MgS8j/test-tmp/rpc-test-f99d09b676c44ef2b58f3cbf4cc60eb7.sock every 8 connection(s)
I20260924 07:12:39.686685 7378 acceptor_pool.cc:254] collecting diagnostics on the listening RPC socket unix:/tmp/dist-test-task_MgS8j/test-tmp/rpc-test-f99d09b676c44ef2b58f3cbf4cc60eb7.sock every 8 connection(s)
W20260924 07:12:39.726922 7374 connection.cc:196] Error closing socket: Network error: TlsSocket::Close: Broken pipe
[ OK ] Parameters/TestRpc.TestRpcContextClientDeadline/SSL_UnixSocket (68 ms)
[ RUN ] Parameters/TestRpc.TestApplicationFeatureFlagUnsupportedServer/SSL_UnixSocket
I20260924 07:12:39.750594 7402 acceptor_pool.cc:254] collecting diagnostics on the listening RPC socket unix:/tmp/dist-test-task_MgS8j/test-tmp/rpc-test-800b5976dbc541a3aa2a0a2109fcd3d9.sock every 8 connection(s)
I20260924 07:12:39.750622 7403 acceptor_pool.cc:254] collecting diagnostics on the listening RPC socket unix:/tmp/dist-test-task_MgS8j/test-tmp/rpc-test-800b5976dbc541a3aa2a0a2109fcd3d9.sock every 8 connection(s)
[ OK ] Parameters/TestRpc.TestApplicationFeatureFlagUnsupportedServer/SSL_UnixSocket (44 ms)
[ RUN ] Parameters/TestRpc.TestCancellationAsync/SSL_UnixSocket
I20260924 07:12:39.782871 7427 acceptor_pool.cc:254] collecting diagnostics on the listening RPC socket unix:/tmp/dist-test-task_MgS8j/test-tmp/rpc-test-8ad8f4fd3a7149e0beb0f9a2b565a3b2.sock every 8 connection(s)
I20260924 07:12:39.782922 7428 acceptor_pool.cc:254] collecting diagnostics on the listening RPC socket unix:/tmp/dist-test-task_MgS8j/test-tmp/rpc-test-8ad8f4fd3a7149e0beb0f9a2b565a3b2.sock every 8 connection(s)
I20260924 07:12:39.783116 6995 rpc-test.cc:1716] Connecting to unix:/tmp/dist-test-task_MgS8j/test-tmp/rpc-test-8ad8f4fd3a7149e0beb0f9a2b565a3b2.sock
I20260924 07:12:39.802773 6995 test_util.cc:268] Using random seed: 1396516755
I20260924 07:12:39.820724 7431 rpc-test-base.h:240] got call: sleep_micros: 500 pattern: 4294967295 num_repetitions: 2097152 sidecar_idx: 0
I20260924 07:12:39.834837 7431 rpc-test-base.h:240] got call: sleep_micros: 500 pattern: 4294967295 num_repetitions: 2097152 sidecar_idx: 0
I20260924 07:12:39.848505 7431 rpc-test-base.h:240] got call: sleep_micros: 500 pattern: 4294967295 num_repetitions: 2097152 sidecar_idx: 0
I20260924 07:12:39.861891 7431 rpc-test-base.h:240] got call: sleep_micros: 500 pattern: 4294967295 num_repetitions: 2097152 sidecar_idx: 0
I20260924 07:12:39.873178 7431 rpc-test-base.h:240] got call: sleep_micros: 500 pattern: 4294967295 num_repetitions: 2097152 sidecar_idx: 0
I20260924 07:12:39.883108 7431 rpc-test-base.h:240] got call: sleep_micros: 500 pattern: 4294967295 num_repetitions: 2097152 sidecar_idx: 0
I20260924 07:12:39.892980 7431 rpc-test-base.h:240] got call: sleep_micros: 500 pattern: 4294967295 num_repetitions: 2097152 sidecar_idx: 0
I20260924 07:12:39.903318 7431 rpc-test-base.h:240] got call: sleep_micros: 500 pattern: 4294967295 num_repetitions: 2097152 sidecar_idx: 0
W20260924 07:12:39.904528 7424 connection.cc:196] Error closing socket: Network error: TlsSocket::Close: Broken pipe
W20260924 07:12:39.906210 7424 connection.cc:441] server connection from unix:<unnamed> torn down before Call kudu.rpc.GenericCalculatorService.SleepWithSidecar from unix:<unnamed> (request call id 9) could send its response
[ OK ] Parameters/TestRpc.TestCancellationAsync/SSL_UnixSocket (134 ms)
[ RUN ] Parameters/TestRpc.TestPerformanceBySocketType/SSL_UnixSocket
I20260924 07:12:39.923601 7452 acceptor_pool.cc:254] collecting diagnostics on the listening RPC socket unix:/tmp/dist-test-task_MgS8j/test-tmp/rpc-test-0b0fa5403089458484a8ead8ec0c8db7.sock every 8 connection(s)
I20260924 07:12:39.923641 7453 acceptor_pool.cc:254] collecting diagnostics on the listening RPC socket unix:/tmp/dist-test-task_MgS8j/test-tmp/rpc-test-0b0fa5403089458484a8ead8ec0c8db7.sock every 8 connection(s)
I20260924 07:12:39.923815 6995 rpc-test.cc:1846] Connecting to unix:/tmp/dist-test-task_MgS8j/test-tmp/rpc-test-0b0fa5403089458484a8ead8ec0c8db7.sock
I20260924 07:12:41.157132 6995 rpc-test.cc:1859] Sending 1024MB via ssl-enabled unix socket: real 1.210s user 1.239s sys 0.953s
I20260924 07:12:42.351451 6995 rpc-test.cc:1859] Sending 1024MB via ssl-enabled unix socket: real 1.194s user 1.246s sys 0.914s
I20260924 07:12:43.531970 6995 rpc-test.cc:1859] Sending 1024MB via ssl-enabled unix socket: real 1.180s user 1.293s sys 0.846s
I20260924 07:12:44.706830 6995 rpc-test.cc:1859] Sending 1024MB via ssl-enabled unix socket: real 1.175s user 1.326s sys 0.805s
I20260924 07:12:45.953995 6995 rpc-test.cc:1859] Sending 1024MB via ssl-enabled unix socket: real 1.247s user 1.421s sys 0.836s
W20260924 07:12:45.954679 7449 connection.cc:196] Error closing socket: Network error: TlsSocket::Close: Broken pipe
[ OK ] Parameters/TestRpc.TestPerformanceBySocketType/SSL_UnixSocket (6048 ms)
[----------] 20 tests from Parameters/TestRpc (25578 ms total)
[----------] 1 test from Parameters/TestRpcSocketTxRxQueue
[ RUN ] Parameters/TestRpcSocketTxRxQueue.AcceptorRxQueueSizeMetric/0
I20260924 07:12:45.961174 7477 acceptor_pool.cc:254] collecting diagnostics on the listening RPC socket 0.0.0.0:38091 every 1 connection(s)
I20260924 07:12:45.961292 7478 acceptor_pool.cc:254] collecting diagnostics on the listening RPC socket 0.0.0.0:38091 every 1 connection(s)
W20260924 07:12:45.961743 7473 negotiation.cc:337] Failed RPC negotiation. Trace:
0924 07:12:45.961610 (+ 0us) reactor.cc:625] Submitting negotiation task for server connection from 127.0.0.1:56654 (local address 127.0.0.1:38091)
0924 07:12:45.961658 (+ 48us) server_negotiation.cc:206] Beginning negotiation
0924 07:12:45.961661 (+ 3us) server_negotiation.cc:399] Waiting for connection header
0924 07:12:45.961716 (+ 55us) negotiation.cc:327] Negotiation complete: Network error: Server connection negotiation failed: server connection from 127.0.0.1:56654: BlockingRecv error: recv got EOF from 127.0.0.1:56654 (error 108)
Metrics: {"server-negotiator.queue_time_us":16}
[ OK ] Parameters/TestRpcSocketTxRxQueue.AcceptorRxQueueSizeMetric/0 (8 ms)
[----------] 1 test from Parameters/TestRpcSocketTxRxQueue (8 ms total)
[----------] Global test environment tear-down
[==========] 21 tests from 2 test suites ran. (25586 ms total)
[ PASSED ] 20 tests.
[ FAILED ] 1 test, listed below:
[ FAILED ] Parameters/TestRpc.TestCallWithChainCertAndChainCA/SSL_UnixSocket, where GetParam() = (true, true)
1 FAILED TEST