Diagnosed failure
Parameters/TestRpc.TestCallWithChainCertAndChainCA/SSL_UnixSocket: /data0/somelongdirectorytoavoidrpathissues/src/kudu/src/kudu/rpc/rpc-test.cc:270: Failure
Failed
Bad status: Runtime error: could not verify certificate chain (error with cert: subject=CN = localhost, ST = sadfjas, C = AS, emailAddress = sdflkdsajf, O = lskdfjlsad, OU = sldfkja, issuer=C = AS, ST = ASDfkjdhf, L = lskdjf, O = saldfja, OU = skdjf, CN = localhost, emailAddress = sadjflkadsj): : certificate has expired
Google Test trace:
/data0/somelongdirectorytoavoidrpathissues/src/kudu/src/kudu/rpc/rpc-test.cc:267: Connecting to unix:/tmp/dist-test-taskeRnX0B/test-tmp/rpc-test-74125a6eb93e4d508476f3baa66ca160.sock
I20260926 13:43:34.908569 9152 test_util.cc:175] -----------------------------------------------
I20260926 13:43:34.908622 9152 test_util.cc:176] Had fatal failures, leaving test files at /tmp/dist-test-taskeRnX0B/test-tmp/rpc-test.6.Parameters_TestRpc.TestCallWithChainCertAndChainCA_SSL_UnixSocket.1790430214823293-9152-0
Full log
Note: This is test shard 7 of 8.
[==========] Running 21 tests from 2 test suites.
[----------] Global test environment set-up.
[----------] 20 tests from Parameters/TestRpc
[ RUN ] Parameters/TestRpc.TestMessengerCreateDestroy/SSL_UnixSocket
WARNING: Logging before InitGoogleLogging() is written to STDERR
I20260926 13:43:34.861150 9152 rpc-test.cc:169] started messenger TestCreateDestroy
[ OK ] Parameters/TestRpc.TestMessengerCreateDestroy/SSL_UnixSocket (33 ms)
[ RUN ] Parameters/TestRpc.TestNegotiationDeadlock/SSL_UnixSocket
I20260926 13:43:34.883882 9172 acceptor_pool.cc:254] collecting diagnostics on the listening RPC socket unix:/tmp/dist-test-taskeRnX0B/test-tmp/rpc-test-e689ccfecd344eebb4fa8ecbfafd35d7.sock every 8 connection(s)
I20260926 13:43:34.883925 9173 acceptor_pool.cc:254] collecting diagnostics on the listening RPC socket unix:/tmp/dist-test-taskeRnX0B/test-tmp/rpc-test-e689ccfecd344eebb4fa8ecbfafd35d7.sock every 8 connection(s)
[ OK ] Parameters/TestRpc.TestNegotiationDeadlock/SSL_UnixSocket (31 ms)
[ RUN ] Parameters/TestRpc.TestCallWithChainCertAndChainCA/SSL_UnixSocket
I20260926 13:43:34.903674 9188 acceptor_pool.cc:254] collecting diagnostics on the listening RPC socket unix:/tmp/dist-test-taskeRnX0B/test-tmp/rpc-test-74125a6eb93e4d508476f3baa66ca160.sock every 8 connection(s)
I20260926 13:43:34.903724 9189 acceptor_pool.cc:254] collecting diagnostics on the listening RPC socket unix:/tmp/dist-test-taskeRnX0B/test-tmp/rpc-test-74125a6eb93e4d508476f3baa66ca160.sock every 8 connection(s)
/data0/somelongdirectorytoavoidrpathissues/src/kudu/src/kudu/rpc/rpc-test.cc:270: Failure
Failed
Bad status: Runtime error: could not verify certificate chain (error with cert: subject=CN = localhost, ST = sadfjas, C = AS, emailAddress = sdflkdsajf, O = lskdfjlsad, OU = sldfkja, issuer=C = AS, ST = ASDfkjdhf, L = lskdjf, O = saldfja, OU = skdjf, CN = localhost, emailAddress = sadjflkadsj): : certificate has expired
Google Test trace:
/data0/somelongdirectorytoavoidrpathissues/src/kudu/src/kudu/rpc/rpc-test.cc:267: Connecting to unix:/tmp/dist-test-taskeRnX0B/test-tmp/rpc-test-74125a6eb93e4d508476f3baa66ca160.sock
I20260926 13:43:34.908569 9152 test_util.cc:175] -----------------------------------------------
I20260926 13:43:34.908622 9152 test_util.cc:176] Had fatal failures, leaving test files at /tmp/dist-test-taskeRnX0B/test-tmp/rpc-test.6.Parameters_TestRpc.TestCallWithChainCertAndChainCA_SSL_UnixSocket.1790430214823293-9152-0
[ FAILED ] Parameters/TestRpc.TestCallWithChainCertAndChainCA/SSL_UnixSocket, where GetParam() = (true, true) (14 ms)
[ RUN ] Parameters/TestRpc.TestCallWithPasswordProtectedKey/SSL_UnixSocket
I20260926 13:43:34.920513 9213 acceptor_pool.cc:254] collecting diagnostics on the listening RPC socket unix:/tmp/dist-test-taskeRnX0B/test-tmp/rpc-test-3fbd6c941f0e484e936b1cceb6bd6af0.sock every 8 connection(s)
I20260926 13:43:34.920576 9214 acceptor_pool.cc:254] collecting diagnostics on the listening RPC socket unix:/tmp/dist-test-taskeRnX0B/test-tmp/rpc-test-3fbd6c941f0e484e936b1cceb6bd6af0.sock every 8 connection(s)
W20260926 13:43:34.934616 9210 connection.cc:196] Error closing socket: Network error: TlsSocket::Close: Broken pipe
[ OK ] Parameters/TestRpc.TestCallWithPasswordProtectedKey/SSL_UnixSocket (26 ms)
[ RUN ] Parameters/TestRpc.TestCallToBadServer/SSL_UnixSocket
I20260926 13:43:34.949012 9152 rpc-test.cc:394] Status: Network error: Client connection negotiation failed: client connection to 0.0.0.0:0: connect: Connection refused (error 111)
I20260926 13:43:34.949525 9152 rpc-test.cc:394] Status: Network error: Client connection negotiation failed: client connection to 0.0.0.0:0: connect: Connection refused (error 111)
I20260926 13:43:34.949985 9152 rpc-test.cc:394] Status: Network error: Client connection negotiation failed: client connection to 0.0.0.0:0: connect: Connection refused (error 111)
I20260926 13:43:34.950368 9152 rpc-test.cc:394] Status: Network error: Client connection negotiation failed: client connection to 0.0.0.0:0: connect: Connection refused (error 111)
I20260926 13:43:34.950771 9152 rpc-test.cc:394] Status: Network error: Client connection negotiation failed: client connection to 0.0.0.0:0: connect: Connection refused (error 111)
[ OK ] Parameters/TestRpc.TestCallToBadServer/SSL_UnixSocket (16 ms)
[ RUN ] Parameters/TestRpc.TestWrongService/SSL_UnixSocket
I20260926 13:43:34.979492 9248 acceptor_pool.cc:254] collecting diagnostics on the listening RPC socket unix:/tmp/dist-test-taskeRnX0B/test-tmp/rpc-test-5a3d933f430d43e29d45266882ad747c.sock every 8 connection(s)
I20260926 13:43:34.979537 9249 acceptor_pool.cc:254] collecting diagnostics on the listening RPC socket unix:/tmp/dist-test-taskeRnX0B/test-tmp/rpc-test-5a3d933f430d43e29d45266882ad747c.sock every 8 connection(s)
I20260926 13:43:35.000023 9245 messenger.cc:345] service WrongServiceName not registered on TestServer
[ OK ] Parameters/TestRpc.TestWrongService/SSL_UnixSocket (49 ms)
[ RUN ] Parameters/TestRpc.TestConnectionKeepalive/SSL_UnixSocket
I20260926 13:43:35.022943 9271 acceptor_pool.cc:254] collecting diagnostics on the listening RPC socket unix:/tmp/dist-test-taskeRnX0B/test-tmp/rpc-test-eebe9b27bc0b4e5e83f1a24d643de211.sock every 8 connection(s)
I20260926 13:43:35.022987 9272 acceptor_pool.cc:254] collecting diagnostics on the listening RPC socket unix:/tmp/dist-test-taskeRnX0B/test-tmp/rpc-test-eebe9b27bc0b4e5e83f1a24d643de211.sock every 8 connection(s)
I20260926 13:43:35.023276 9152 rpc-test.cc:488] Connecting to unix:/tmp/dist-test-taskeRnX0B/test-tmp/rpc-test-eebe9b27bc0b4e5e83f1a24d643de211.sock
W20260926 13:43:35.504310 9284 connection.cc:196] Error closing socket: Network error: TlsSocket::Close: Broken pipe
[ OK ] Parameters/TestRpc.TestConnectionKeepalive/SSL_UnixSocket (1046 ms)
[ RUN ] Parameters/TestRpc.TestClientConnectionMetrics/SSL_UnixSocket
I20260926 13:43:36.067199 9296 acceptor_pool.cc:254] collecting diagnostics on the listening RPC socket unix:/tmp/dist-test-taskeRnX0B/test-tmp/rpc-test-fc607ef3ecc44210bb3bfe5af1e45461.sock every 8 connection(s)
I20260926 13:43:36.067200 9297 acceptor_pool.cc:254] collecting diagnostics on the listening RPC socket unix:/tmp/dist-test-taskeRnX0B/test-tmp/rpc-test-fc607ef3ecc44210bb3bfe5af1e45461.sock every 8 connection(s)
I20260926 13:43:36.067559 9152 rpc-test.cc:569] Connecting to unix:/tmp/dist-test-taskeRnX0B/test-tmp/rpc-test-fc607ef3ecc44210bb3bfe5af1e45461.sock
W20260926 13:43:46.563265 9293 connection.cc:196] Error closing socket: Network error: TlsSocket::Close: Broken pipe
[ OK ] Parameters/TestRpc.TestClientConnectionMetrics/SSL_UnixSocket (10516 ms)
[ RUN ] Parameters/TestRpc.TestCredentialsPolicy/SSL_UnixSocket
I20260926 13:43:46.575616 9319 acceptor_pool.cc:254] collecting diagnostics on the listening RPC socket unix:/tmp/dist-test-taskeRnX0B/test-tmp/rpc-test-238cecbafa0a48608f7d7644addc5436.sock every 8 connection(s)
I20260926 13:43:46.575820 9320 acceptor_pool.cc:254] collecting diagnostics on the listening RPC socket unix:/tmp/dist-test-taskeRnX0B/test-tmp/rpc-test-238cecbafa0a48608f7d7644addc5436.sock every 8 connection(s)
I20260926 13:43:46.576063 9152 rpc-test.cc:700] Connecting to unix:/tmp/dist-test-taskeRnX0B/test-tmp/rpc-test-238cecbafa0a48608f7d7644addc5436.sock
W20260926 13:43:46.600495 9318 connection.cc:196] Error closing socket: Network error: TlsSocket::Close: Broken pipe
[ OK ] Parameters/TestRpc.TestCredentialsPolicy/SSL_UnixSocket (42 ms)
[ RUN ] Parameters/TestRpc.TestCallLongerThanKeepalive/SSL_UnixSocket
I20260926 13:43:46.630649 9344 acceptor_pool.cc:254] collecting diagnostics on the listening RPC socket unix:/tmp/dist-test-taskeRnX0B/test-tmp/rpc-test-9acb10a315724149a2e8ff4d48a42d82.sock every 8 connection(s)
I20260926 13:43:46.630667 9345 acceptor_pool.cc:254] collecting diagnostics on the listening RPC socket unix:/tmp/dist-test-taskeRnX0B/test-tmp/rpc-test-9acb10a315724149a2e8ff4d48a42d82.sock every 8 connection(s)
I20260926 13:43:46.646845 9348 rpc-test-base.h:222] got call: sleep_micros: 3000000 deferred: true
I20260926 13:43:49.647801 9348 rpcz_store.cc:275] Call kudu.rpc.GenericCalculatorService.Sleep from unix:<unnamed> (request call id 0) took 3001 ms. Trace:
I20260926 13:43:49.647953 9348 rpcz_store.cc:276] 0926 13:43:46.646762 (+ 0us) service_pool.cc:170] Inserting onto call queue
0926 13:43:46.646823 (+ 61us) service_pool.cc:227] Handling call
0926 13:43:49.647781 (+3000958us) inbound_call.cc:173] Queueing success response
Metrics: {}
W20260926 13:43:49.649701 9341 connection.cc:196] Error closing socket: Network error: TlsSocket::Close: Broken pipe
[ OK ] Parameters/TestRpc.TestCallLongerThanKeepalive/SSL_UnixSocket (3043 ms)
[ RUN ] Parameters/TestRpc.TestRpcSidecar/SSL_UnixSocket
I20260926 13:43:49.672847 9369 acceptor_pool.cc:254] collecting diagnostics on the listening RPC socket unix:/tmp/dist-test-taskeRnX0B/test-tmp/rpc-test-9128de9a53d74817992157b300328f37.sock every 8 connection(s)
I20260926 13:43:49.672880 9370 acceptor_pool.cc:254] collecting diagnostics on the listening RPC socket unix:/tmp/dist-test-taskeRnX0B/test-tmp/rpc-test-9128de9a53d74817992157b300328f37.sock every 8 connection(s)
[ OK ] Parameters/TestRpc.TestRpcSidecar/SSL_UnixSocket (107 ms)
[ RUN ] Parameters/TestRpc.TestRpcSidecarLimits/SSL_UnixSocket
I20260926 13:43:51.562798 9394 acceptor_pool.cc:254] collecting diagnostics on the listening RPC socket unix:/tmp/dist-test-taskeRnX0B/test-tmp/rpc-test-0d0b3410a69e472fa33799d5ae9b5573.sock every 8 connection(s)
I20260926 13:43:51.562824 9395 acceptor_pool.cc:254] collecting diagnostics on the listening RPC socket unix:/tmp/dist-test-taskeRnX0B/test-tmp/rpc-test-0d0b3410a69e472fa33799d5ae9b5573.sock every 8 connection(s)
W20260926 13:43:51.569056 9152 serialization.cc:72] Serialized kudu.rpc_test.PushStringsRequestPB (2147483654 bytes) is larger than the maximum configured RPC message size (52428800 bytes). Sending anyway, but peer may reject the data.
W20260926 13:43:51.585536 9391 connection.cc:535] server connection from unix:<unnamed> recv error: Network error: RPC frame had a length of 2147483714, but we only support messages up to 52428800 bytes long.
W20260926 13:43:51.585614 9391 connection.cc:158] shutting down server connection from unix:<unnamed> with pending inbound data: 4/2147483714 bytes received; last active 0 ns ago: status Network error: RPC frame had a length of 2147483714, but we only support messages up to 52428800 bytes long.
W20260926 13:43:51.585821 9407 connection.cc:698] client connection to unix:/tmp/dist-test-taskeRnX0B/test-tmp/rpc-test-0d0b3410a69e472fa33799d5ae9b5573.sock send error: Network error: failed to write to TLS socket: Broken pipe
W20260926 13:43:51.586028 9407 connection.cc:196] Error closing socket: Network error: TlsSocket::Close: Success
I20260926 13:43:51.597596 9419 acceptor_pool.cc:254] collecting diagnostics on the listening RPC socket unix:/tmp/dist-test-taskeRnX0B/test-tmp/rpc-test-0d0b3410a69e472fa33799d5ae9b5573.sock every 8 connection(s)
I20260926 13:43:51.597739 9420 acceptor_pool.cc:254] collecting diagnostics on the listening RPC socket unix:/tmp/dist-test-taskeRnX0B/test-tmp/rpc-test-0d0b3410a69e472fa33799d5ae9b5573.sock every 8 connection(s)
W20260926 13:43:56.573508 9416 connection.cc:577] server connection from unix:<unnamed>: received bad data: 'Corruption: Invalid packet: message had a length of 2147483710, but we only support messages up to 2147483647 bytes
'
W20260926 13:43:56.573896 9432 connection.cc:196] Error closing socket: Network error: TlsSocket::Close: Broken pipe
[ OK ] Parameters/TestRpc.TestRpcSidecarLimits/SSL_UnixSocket (6818 ms)
[ RUN ] Parameters/TestRpc.TestCallTimeoutDoesntAffectNegotiation/SSL_UnixSocket
I20260926 13:43:56.605989 9444 acceptor_pool.cc:254] collecting diagnostics on the listening RPC socket unix:/tmp/dist-test-taskeRnX0B/test-tmp/rpc-test-cd4676057ea647c095db8065f0bfc57e.sock every 8 connection(s)
I20260926 13:43:56.606025 9445 acceptor_pool.cc:254] collecting diagnostics on the listening RPC socket unix:/tmp/dist-test-taskeRnX0B/test-tmp/rpc-test-cd4676057ea647c095db8065f0bfc57e.sock every 8 connection(s)
W20260926 13:43:56.619035 9440 negotiation.cc:266] Injecting 500ms delay in negotiation
I20260926 13:43:56.669457 9152 rpc-test-base.h:595] status: Timed out: connection negotiation to unix:/tmp/dist-test-taskeRnX0B/test-tmp/rpc-test-cd4676057ea647c095db8065f0bfc57e.sock for RPC Sleep timed out after 0.050s (ON_OUTBOUND_QUEUE), seconds elapsed: 0.0509449
[ OK ] Parameters/TestRpc.TestCallTimeoutDoesntAffectNegotiation/SSL_UnixSocket (548 ms)
[ RUN ] Parameters/TestRpc.TestRpcHandlerLatencyMetric/SSL_UnixSocket
I20260926 13:43:57.140740 9469 acceptor_pool.cc:254] collecting diagnostics on the listening RPC socket unix:/tmp/dist-test-taskeRnX0B/test-tmp/rpc-test-2687ec4d1b744564a0aea3a1036bb271.sock every 8 connection(s)
I20260926 13:43:57.140748 9470 acceptor_pool.cc:254] collecting diagnostics on the listening RPC socket unix:/tmp/dist-test-taskeRnX0B/test-tmp/rpc-test-2687ec4d1b744564a0aea3a1036bb271.sock every 8 connection(s)
I20260926 13:43:57.177464 9152 rpc-test.cc:1236] Sleep() min lat: 20439
I20260926 13:43:57.177536 9152 rpc-test.cc:1237] Sleep() mean lat: 20439
I20260926 13:43:57.177565 9152 rpc-test.cc:1238] Sleep() max lat: 20439
I20260926 13:43:57.177579 9152 rpc-test.cc:1239] Sleep() #calls: 1
[ OK ] Parameters/TestRpc.TestRpcHandlerLatencyMetric/SSL_UnixSocket (54 ms)
[ RUN ] Parameters/TestRpc.TimedOutOnResponseMetricServiceQueue/SSL_UnixSocket
I20260926 13:43:57.196782 9495 acceptor_pool.cc:254] collecting diagnostics on the listening RPC socket unix:/tmp/dist-test-taskeRnX0B/test-tmp/rpc-test-d502dd4231b94376bd423a559f2f3730.sock every 8 connection(s)
I20260926 13:43:57.196796 9496 acceptor_pool.cc:254] collecting diagnostics on the listening RPC socket unix:/tmp/dist-test-taskeRnX0B/test-tmp/rpc-test-d502dd4231b94376bd423a559f2f3730.sock every 8 connection(s)
W20260926 13:43:57.254637 9497 rpcz_store.cc:267] Call kudu.rpc_test.CalculatorService.Sleep from unix:<unnamed> (request call id 2) took 20 ms (client timeout 20 ms). Trace:
W20260926 13:43:57.254770 9497 rpcz_store.cc:269] 0926 13:43:57.234138 (+ 0us) service_pool.cc:170] Inserting onto call queue
0926 13:43:57.254582 (+ 20444us) service_pool.cc:214] Skipping call since client already timed out
0926 13:43:57.254618 (+ 36us) inbound_call.cc:173] Queueing failure response
Metrics: {}
[ OK ] Parameters/TestRpc.TimedOutOnResponseMetricServiceQueue/SSL_UnixSocket (76 ms)
[ RUN ] Parameters/TestRpc.RpcPendingConnectionsMetric/SSL_UnixSocket
I20260926 13:43:57.259223 9518 acceptor_pool.cc:254] collecting diagnostics on the listening RPC socket 0.0.0.0:35757 every 8 connection(s)
I20260926 13:43:57.259263 9519 acceptor_pool.cc:254] collecting diagnostics on the listening RPC socket 0.0.0.0:35757 every 8 connection(s)
W20260926 13:43:57.260416 9514 negotiation.cc:337] Failed RPC negotiation. Trace:
0926 13:43:57.260008 (+ 0us) reactor.cc:625] Submitting negotiation task for server connection from 127.0.0.1:55518 (local address 127.0.0.1:35757)
0926 13:43:57.260120 (+ 112us) server_negotiation.cc:206] Beginning negotiation
0926 13:43:57.260124 (+ 4us) server_negotiation.cc:399] Waiting for connection header
0926 13:43:57.260213 (+ 89us) negotiation.cc:327] Negotiation complete: Network error: Server connection negotiation failed: server connection from 127.0.0.1:55518: BlockingRecv error: recv got EOF from 127.0.0.1:55518 (error 108)
Metrics: {"server-negotiator.queue_time_us":42}
[ OK ] Parameters/TestRpc.RpcPendingConnectionsMetric/SSL_UnixSocket (15 ms)
[ RUN ] Parameters/TestRpc.TestRpcContextClientDeadline/SSL_UnixSocket
I20260926 13:43:57.294312 9534 acceptor_pool.cc:254] collecting diagnostics on the listening RPC socket unix:/tmp/dist-test-taskeRnX0B/test-tmp/rpc-test-c7e524d00224493b9ba59ab9dae2308a.sock every 8 connection(s)
I20260926 13:43:57.294351 9535 acceptor_pool.cc:254] collecting diagnostics on the listening RPC socket unix:/tmp/dist-test-taskeRnX0B/test-tmp/rpc-test-c7e524d00224493b9ba59ab9dae2308a.sock every 8 connection(s)
[ OK ] Parameters/TestRpc.TestRpcContextClientDeadline/SSL_UnixSocket (75 ms)
[ RUN ] Parameters/TestRpc.TestApplicationFeatureFlagUnsupportedServer/SSL_UnixSocket
I20260926 13:43:57.363634 9559 acceptor_pool.cc:254] collecting diagnostics on the listening RPC socket unix:/tmp/dist-test-taskeRnX0B/test-tmp/rpc-test-781ea496fed64699900b787e1e7614dc.sock every 8 connection(s)
I20260926 13:43:57.363670 9560 acceptor_pool.cc:254] collecting diagnostics on the listening RPC socket unix:/tmp/dist-test-taskeRnX0B/test-tmp/rpc-test-781ea496fed64699900b787e1e7614dc.sock every 8 connection(s)
[ OK ] Parameters/TestRpc.TestApplicationFeatureFlagUnsupportedServer/SSL_UnixSocket (52 ms)
[ RUN ] Parameters/TestRpc.TestCancellationAsync/SSL_UnixSocket
I20260926 13:43:57.411931 9584 acceptor_pool.cc:254] collecting diagnostics on the listening RPC socket unix:/tmp/dist-test-taskeRnX0B/test-tmp/rpc-test-a9590f898a3344e7bca40583d7ae5ab0.sock every 8 connection(s)
I20260926 13:43:57.411947 9585 acceptor_pool.cc:254] collecting diagnostics on the listening RPC socket unix:/tmp/dist-test-taskeRnX0B/test-tmp/rpc-test-a9590f898a3344e7bca40583d7ae5ab0.sock every 8 connection(s)
I20260926 13:43:57.412266 9152 rpc-test.cc:1716] Connecting to unix:/tmp/dist-test-taskeRnX0B/test-tmp/rpc-test-a9590f898a3344e7bca40583d7ae5ab0.sock
I20260926 13:43:57.431646 9152 test_util.cc:268] Using random seed: 105650011
I20260926 13:43:57.452370 9588 rpc-test-base.h:240] got call: sleep_micros: 500 pattern: 4294967295 num_repetitions: 2097152 sidecar_idx: 0
I20260926 13:43:57.468667 9587 rpc-test-base.h:240] got call: sleep_micros: 500 pattern: 4294967295 num_repetitions: 2097152 sidecar_idx: 0
I20260926 13:43:57.486821 9588 rpc-test-base.h:240] got call: sleep_micros: 500 pattern: 4294967295 num_repetitions: 2097152 sidecar_idx: 0
I20260926 13:43:57.508363 9587 rpc-test-base.h:240] got call: sleep_micros: 500 pattern: 4294967295 num_repetitions: 2097152 sidecar_idx: 0
I20260926 13:43:57.524930 9588 rpc-test-base.h:240] got call: sleep_micros: 500 pattern: 4294967295 num_repetitions: 2097152 sidecar_idx: 0
I20260926 13:43:57.546193 9587 rpc-test-base.h:240] got call: sleep_micros: 500 pattern: 4294967295 num_repetitions: 2097152 sidecar_idx: 0
I20260926 13:43:57.564311 9588 rpc-test-base.h:240] got call: sleep_micros: 500 pattern: 4294967295 num_repetitions: 2097152 sidecar_idx: 0
I20260926 13:43:57.581171 9587 rpc-test-base.h:240] got call: sleep_micros: 500 pattern: 4294967295 num_repetitions: 2097152 sidecar_idx: 0
W20260926 13:43:57.583002 9581 connection.cc:196] Error closing socket: Network error: TlsSocket::Close: Broken pipe
W20260926 13:43:57.588538 9581 connection.cc:441] server connection from unix:<unnamed> torn down before Call kudu.rpc.GenericCalculatorService.SleepWithSidecar from unix:<unnamed> (request call id 8) could send its response
W20260926 13:43:57.599416 9581 connection.cc:441] server connection from unix:<unnamed> torn down before Call kudu.rpc.GenericCalculatorService.SleepWithSidecar from unix:<unnamed> (request call id 9) could send its response
[ OK ] Parameters/TestRpc.TestCancellationAsync/SSL_UnixSocket (200 ms)
[ RUN ] Parameters/TestRpc.TestPerformanceBySocketType/SSL_UnixSocket
I20260926 13:43:57.620885 9609 acceptor_pool.cc:254] collecting diagnostics on the listening RPC socket unix:/tmp/dist-test-taskeRnX0B/test-tmp/rpc-test-72c77f5e3e194837a70b1e5c99ad643b.sock every 8 connection(s)
I20260926 13:43:57.620919 9610 acceptor_pool.cc:254] collecting diagnostics on the listening RPC socket unix:/tmp/dist-test-taskeRnX0B/test-tmp/rpc-test-72c77f5e3e194837a70b1e5c99ad643b.sock every 8 connection(s)
I20260926 13:43:57.621282 9152 rpc-test.cc:1846] Connecting to unix:/tmp/dist-test-taskeRnX0B/test-tmp/rpc-test-72c77f5e3e194837a70b1e5c99ad643b.sock
I20260926 13:43:59.276525 9152 rpc-test.cc:1859] Sending 1024MB via ssl-enabled unix socket: real 1.650s user 2.158s sys 0.825s
I20260926 13:44:00.952895 9152 rpc-test.cc:1859] Sending 1024MB via ssl-enabled unix socket: real 1.676s user 2.134s sys 0.878s
I20260926 13:44:02.575276 9152 rpc-test.cc:1859] Sending 1024MB via ssl-enabled unix socket: real 1.622s user 2.051s sys 0.862s
I20260926 13:44:04.159003 9152 rpc-test.cc:1859] Sending 1024MB via ssl-enabled unix socket: real 1.584s user 1.995s sys 0.868s
I20260926 13:44:05.751845 9152 rpc-test.cc:1859] Sending 1024MB via ssl-enabled unix socket: real 1.593s user 1.904s sys 0.988s
W20260926 13:44:05.752802 9606 connection.cc:196] Error closing socket: Network error: TlsSocket::Close: Broken pipe
[ OK ] Parameters/TestRpc.TestPerformanceBySocketType/SSL_UnixSocket (8152 ms)
[----------] 20 tests from Parameters/TestRpc (30924 ms total)
[----------] 1 test from Parameters/TestRpcSocketTxRxQueue
[ RUN ] Parameters/TestRpcSocketTxRxQueue.AcceptorRxQueueSizeMetric/0
I20260926 13:44:05.763121 9634 acceptor_pool.cc:254] collecting diagnostics on the listening RPC socket 0.0.0.0:44301 every 1 connection(s)
I20260926 13:44:05.763219 9635 acceptor_pool.cc:254] collecting diagnostics on the listening RPC socket 0.0.0.0:44301 every 1 connection(s)
W20260926 13:44:05.764076 9630 negotiation.cc:337] Failed RPC negotiation. Trace:
0926 13:44:05.763792 (+ 0us) reactor.cc:625] Submitting negotiation task for server connection from 127.0.0.1:35656 (local address 127.0.0.1:44301)
0926 13:44:05.763904 (+ 112us) server_negotiation.cc:206] Beginning negotiation
0926 13:44:05.763907 (+ 3us) server_negotiation.cc:399] Waiting for connection header
0926 13:44:05.764008 (+ 101us) negotiation.cc:327] Negotiation complete: Network error: Server connection negotiation failed: server connection from 127.0.0.1:35656: BlockingRecv error: recv got EOF from 127.0.0.1:35656 (error 108)
Metrics: {"server-negotiator.queue_time_us":47}
[ OK ] Parameters/TestRpcSocketTxRxQueue.AcceptorRxQueueSizeMetric/0 (12 ms)
[----------] 1 test from Parameters/TestRpcSocketTxRxQueue (12 ms total)
[----------] Global test environment tear-down
[==========] 21 tests from 2 test suites ran. (30936 ms total)
[ PASSED ] 20 tests.
[ FAILED ] 1 test, listed below:
[ FAILED ] Parameters/TestRpc.TestCallWithChainCertAndChainCA/SSL_UnixSocket, where GetParam() = (true, true)
1 FAILED TEST