Diagnosed failure

Parameters/TestRpc.TestCallWithChainCertAndRootCA/SSL_UnixSocket: /data0/somelongdirectorytoavoidrpathissues/src/kudu/src/kudu/rpc/rpc-test.cc:303: Failure
Failed
Bad status: Runtime error: could not verify certificate chain (error with cert: subject=CN = localhost, ST = sadfjas, C = AS, emailAddress = sdflkdsajf, O = lskdfjlsad, OU = sldfkja, issuer=C = AS, ST = ASDfkjdhf, L = lskdjf, O = saldfja, OU = skdjf, CN = localhost, emailAddress = sadjflkadsj): : certificate has expired
Google Test trace:
/data0/somelongdirectorytoavoidrpathissues/src/kudu/src/kudu/rpc/rpc-test.cc:300: Connecting to unix:/tmp/dist-test-task4a3fyS/test-tmp/rpc-test-2a951ebb2f134e75991327ee3fc8b1b8.sock
I20260926 16:13:46.383222  6610 test_util.cc:175] -----------------------------------------------
I20260926 16:13:46.383409  6610 test_util.cc:176] Had fatal failures, leaving test files at /tmp/dist-test-task4a3fyS/test-tmp/rpc-test.2.Parameters_TestRpc.TestCallWithChainCertAndRootCA_SSL_UnixSocket.1790439222749019-6610-0

Full log

Note: This is test shard 3 of 8.
[==========] Running 21 tests from 2 test suites.
[----------] Global test environment set-up.
[----------] 1 test from TestRpc
[ RUN      ] TestRpc.TestNegotiationTimeout
WARNING: Logging before InitGoogleLogging() is written to STDERR
I20260926 16:13:42.933277  6610 rpc-test-base.h:595] status: Timed out: connection negotiation to 0.0.0.0:37211 for RPC Sleep timed out after 0.100s (ON_OUTBOUND_QUEUE), seconds elapsed: 0.101773
W20260926 16:13:46.049345  6620 negotiation.cc:337] Failed RPC negotiation. Trace:
0926 16:13:42.832487 (+     0us) reactor.cc:625] Submitting negotiation task for client connection to 0.0.0.0:37211 (local address 127.0.0.1:55112)
0926 16:13:42.833258 (+   771us) negotiation.cc:107] Waiting for socket to connect
0926 16:13:42.833307 (+    49us) client_negotiation.cc:174] Beginning negotiation
0926 16:13:42.847304 (+ 13997us) client_negotiation.cc:252] Sending NEGOTIATE NegotiatePB request
0926 16:13:46.048227 (+3200923us) negotiation.cc:327] Negotiation complete: Timed out: Client connection negotiation failed: client connection to 0.0.0.0:37211: received 0 of 4 requested bytes
Metrics: {"client-negotiator.queue_time_us":207}
[       OK ] TestRpc.TestNegotiationTimeout (3252 ms)
[----------] 1 test from TestRpc (3252 ms total)

[----------] 20 tests from Parameters/TestRpc
[ RUN      ] Parameters/TestRpc.TestAcceptorPoolStartStop/SSL_UnixSocket
I20260926 16:13:46.092083  6636 acceptor_pool.cc:254] collecting diagnostics on the listening RPC socket unix:/tmp/dist-test-task4a3fyS/test-tmp/rpc-test-f31ff70bc36948e9bce5274fbe9c9b17.sock every 8 connection(s)
I20260926 16:13:46.093528  6637 acceptor_pool.cc:254] collecting diagnostics on the listening RPC socket unix:/tmp/dist-test-task4a3fyS/test-tmp/rpc-test-f31ff70bc36948e9bce5274fbe9c9b17.sock every 8 connection(s)
I20260926 16:13:46.134243  6647 acceptor_pool.cc:254] collecting diagnostics on the listening RPC socket unix:/tmp/dist-test-task4a3fyS/test-tmp/rpc-test-f31ff70bc36948e9bce5274fbe9c9b17.sock every 8 connection(s)
I20260926 16:13:46.136054  6648 acceptor_pool.cc:254] collecting diagnostics on the listening RPC socket unix:/tmp/dist-test-task4a3fyS/test-tmp/rpc-test-f31ff70bc36948e9bce5274fbe9c9b17.sock every 8 connection(s)
I20260926 16:13:46.163635  6658 acceptor_pool.cc:254] collecting diagnostics on the listening RPC socket unix:/tmp/dist-test-task4a3fyS/test-tmp/rpc-test-f31ff70bc36948e9bce5274fbe9c9b17.sock every 8 connection(s)
I20260926 16:13:46.164292  6659 acceptor_pool.cc:254] collecting diagnostics on the listening RPC socket unix:/tmp/dist-test-task4a3fyS/test-tmp/rpc-test-f31ff70bc36948e9bce5274fbe9c9b17.sock every 8 connection(s)
I20260926 16:13:46.206302  6669 acceptor_pool.cc:254] collecting diagnostics on the listening RPC socket unix:/tmp/dist-test-task4a3fyS/test-tmp/rpc-test-f31ff70bc36948e9bce5274fbe9c9b17.sock every 8 connection(s)
I20260926 16:13:46.207012  6670 acceptor_pool.cc:254] collecting diagnostics on the listening RPC socket unix:/tmp/dist-test-task4a3fyS/test-tmp/rpc-test-f31ff70bc36948e9bce5274fbe9c9b17.sock every 8 connection(s)
I20260926 16:13:46.249192  6680 acceptor_pool.cc:254] collecting diagnostics on the listening RPC socket unix:/tmp/dist-test-task4a3fyS/test-tmp/rpc-test-f31ff70bc36948e9bce5274fbe9c9b17.sock every 8 connection(s)
I20260926 16:13:46.249879  6681 acceptor_pool.cc:254] collecting diagnostics on the listening RPC socket unix:/tmp/dist-test-task4a3fyS/test-tmp/rpc-test-f31ff70bc36948e9bce5274fbe9c9b17.sock every 8 connection(s)
[       OK ] Parameters/TestRpc.TestAcceptorPoolStartStop/SSL_UnixSocket (200 ms)
[ RUN      ] Parameters/TestRpc.TestCall/SSL_UnixSocket
I20260926 16:13:46.276295  6693 acceptor_pool.cc:254] collecting diagnostics on the listening RPC socket unix:/tmp/dist-test-task4a3fyS/test-tmp/rpc-test-7359349a7a2449d183200a372a14aea8.sock every 8 connection(s)
I20260926 16:13:46.278210  6694 acceptor_pool.cc:254] collecting diagnostics on the listening RPC socket unix:/tmp/dist-test-task4a3fyS/test-tmp/rpc-test-7359349a7a2449d183200a372a14aea8.sock every 8 connection(s)
I20260926 16:13:46.283447  6610 rpc-test.cc:234] Connecting to unix:/tmp/dist-test-task4a3fyS/test-tmp/rpc-test-7359349a7a2449d183200a372a14aea8.sock
[       OK ] Parameters/TestRpc.TestCall/SSL_UnixSocket (83 ms)
[ RUN      ] Parameters/TestRpc.TestCallWithChainCertAndRootCA/SSL_UnixSocket
I20260926 16:13:46.362819  6718 acceptor_pool.cc:254] collecting diagnostics on the listening RPC socket unix:/tmp/dist-test-task4a3fyS/test-tmp/rpc-test-2a951ebb2f134e75991327ee3fc8b1b8.sock every 8 connection(s)
I20260926 16:13:46.363588  6719 acceptor_pool.cc:254] collecting diagnostics on the listening RPC socket unix:/tmp/dist-test-task4a3fyS/test-tmp/rpc-test-2a951ebb2f134e75991327ee3fc8b1b8.sock every 8 connection(s)
/data0/somelongdirectorytoavoidrpathissues/src/kudu/src/kudu/rpc/rpc-test.cc:303: Failure
Failed
Bad status: Runtime error: could not verify certificate chain (error with cert: subject=CN = localhost, ST = sadfjas, C = AS, emailAddress = sdflkdsajf, O = lskdfjlsad, OU = sldfkja, issuer=C = AS, ST = ASDfkjdhf, L = lskdjf, O = saldfja, OU = skdjf, CN = localhost, emailAddress = sadjflkadsj): : certificate has expired
Google Test trace:
/data0/somelongdirectorytoavoidrpathissues/src/kudu/src/kudu/rpc/rpc-test.cc:300: Connecting to unix:/tmp/dist-test-task4a3fyS/test-tmp/rpc-test-2a951ebb2f134e75991327ee3fc8b1b8.sock
I20260926 16:13:46.383222  6610 test_util.cc:175] -----------------------------------------------
I20260926 16:13:46.383409  6610 test_util.cc:176] Had fatal failures, leaving test files at /tmp/dist-test-task4a3fyS/test-tmp/rpc-test.2.Parameters_TestRpc.TestCallWithChainCertAndRootCA_SSL_UnixSocket.1790439222749019-6610-0
[  FAILED  ] Parameters/TestRpc.TestCallWithChainCertAndRootCA/SSL_UnixSocket, where GetParam() = (true, true) (46 ms)
[ RUN      ] Parameters/TestRpc.TestCallWithBadPasswordProtectedKey/SSL_UnixSocket
[       OK ] Parameters/TestRpc.TestCallWithBadPasswordProtectedKey/SSL_UnixSocket (30 ms)
[ RUN      ] Parameters/TestRpc.TestInvalidMethodCall/SSL_UnixSocket
I20260926 16:13:46.430473  6755 acceptor_pool.cc:254] collecting diagnostics on the listening RPC socket unix:/tmp/dist-test-task4a3fyS/test-tmp/rpc-test-b9015ed512a14ab2b23446f1ab50867d.sock every 8 connection(s)
I20260926 16:13:46.431195  6756 acceptor_pool.cc:254] collecting diagnostics on the listening RPC socket unix:/tmp/dist-test-task4a3fyS/test-tmp/rpc-test-b9015ed512a14ab2b23446f1ab50867d.sock every 8 connection(s)
I20260926 16:13:46.434499  6610 rpc-test.cc:406] Connecting to unix:/tmp/dist-test-task4a3fyS/test-tmp/rpc-test-b9015ed512a14ab2b23446f1ab50867d.sock
[       OK ] Parameters/TestRpc.TestInvalidMethodCall/SSL_UnixSocket (57 ms)
[ RUN      ] Parameters/TestRpc.TestHighFDs/SSL_UnixSocket
I20260926 16:13:46.692628  6780 acceptor_pool.cc:254] collecting diagnostics on the listening RPC socket unix:/tmp/dist-test-task4a3fyS/test-tmp/rpc-test-cff9b37a5e944733881a53c4748bfb35.sock every 8 connection(s)
I20260926 16:13:46.693277  6781 acceptor_pool.cc:254] collecting diagnostics on the listening RPC socket unix:/tmp/dist-test-task4a3fyS/test-tmp/rpc-test-cff9b37a5e944733881a53c4748bfb35.sock every 8 connection(s)
W20260926 16:13:46.732800  6777 connection.cc:196] Error closing socket: Network error: TlsSocket::Close: Broken pipe
[       OK ] Parameters/TestRpc.TestHighFDs/SSL_UnixSocket (273 ms)
[ RUN      ] Parameters/TestRpc.TestConnectionAlwaysKeepalive/SSL_UnixSocket
I20260926 16:13:46.763129  6803 acceptor_pool.cc:254] collecting diagnostics on the listening RPC socket unix:/tmp/dist-test-task4a3fyS/test-tmp/rpc-test-77fc181914ed412789e183b7938bdc1a.sock every 8 connection(s)
I20260926 16:13:46.763835  6804 acceptor_pool.cc:254] collecting diagnostics on the listening RPC socket unix:/tmp/dist-test-task4a3fyS/test-tmp/rpc-test-77fc181914ed412789e183b7938bdc1a.sock every 8 connection(s)
I20260926 16:13:46.766906  6610 rpc-test.cc:532] Connecting to unix:/tmp/dist-test-task4a3fyS/test-tmp/rpc-test-77fc181914ed412789e183b7938bdc1a.sock
W20260926 16:13:49.804661  6802 connection.cc:196] Error closing socket: Network error: TlsSocket::Close: Broken pipe
[       OK ] Parameters/TestRpc.TestConnectionAlwaysKeepalive/SSL_UnixSocket (3063 ms)
[ RUN      ] Parameters/TestRpc.TestReopenOutboundConnections/SSL_UnixSocket
I20260926 16:13:49.838483  6826 acceptor_pool.cc:254] collecting diagnostics on the listening RPC socket unix:/tmp/dist-test-task4a3fyS/test-tmp/rpc-test-1c61192840bd4903aa34b3c084d6a08e.sock every 8 connection(s)
I20260926 16:13:49.839178  6827 acceptor_pool.cc:254] collecting diagnostics on the listening RPC socket unix:/tmp/dist-test-task4a3fyS/test-tmp/rpc-test-1c61192840bd4903aa34b3c084d6a08e.sock every 8 connection(s)
I20260926 16:13:49.842447  6610 rpc-test.cc:658] Connecting to unix:/tmp/dist-test-task4a3fyS/test-tmp/rpc-test-1c61192840bd4903aa34b3c084d6a08e.sock
W20260926 16:13:49.866103  6825 connection.cc:196] Error closing socket: Network error: TlsSocket::Close: Broken pipe
W20260926 16:13:49.875623  6825 connection.cc:196] Error closing socket: Network error: TlsSocket::Close: Broken pipe
W20260926 16:13:49.884883  6825 connection.cc:196] Error closing socket: Network error: TlsSocket::Close: Broken pipe
W20260926 16:13:49.894240  6825 connection.cc:196] Error closing socket: Network error: TlsSocket::Close: Broken pipe
W20260926 16:13:49.903795  6825 connection.cc:196] Error closing socket: Network error: TlsSocket::Close: Broken pipe
W20260926 16:13:49.914067  6825 connection.cc:196] Error closing socket: Network error: TlsSocket::Close: Broken pipe
W20260926 16:13:49.924508  6825 connection.cc:196] Error closing socket: Network error: TlsSocket::Close: Broken pipe
W20260926 16:13:49.935777  6825 connection.cc:196] Error closing socket: Network error: TlsSocket::Close: Broken pipe
W20260926 16:13:49.946996  6825 connection.cc:196] Error closing socket: Network error: TlsSocket::Close: Broken pipe
W20260926 16:13:49.959686  6825 connection.cc:196] Error closing socket: Network error: TlsSocket::Close: Broken pipe
W20260926 16:13:49.969878  6825 connection.cc:196] Error closing socket: Network error: TlsSocket::Close: Broken pipe
W20260926 16:13:49.980288  6825 connection.cc:196] Error closing socket: Network error: TlsSocket::Close: Broken pipe
W20260926 16:13:49.991146  6825 connection.cc:196] Error closing socket: Network error: TlsSocket::Close: Broken pipe
W20260926 16:13:50.001814  6825 connection.cc:196] Error closing socket: Network error: TlsSocket::Close: Broken pipe
W20260926 16:13:50.002053  6826 acceptor_pool.cc:285] unable to collect diagnostics on RPC socket unix:/tmp/dist-test-task4a3fyS/test-tmp/rpc-test-1c61192840bd4903aa34b3c084d6a08e.sock: Not implemented: netlink diagnostics is currently supported only on IPv4 TCP sockets
W20260926 16:13:50.013110  6825 connection.cc:196] Error closing socket: Network error: TlsSocket::Close: Broken pipe
W20260926 16:13:50.023959  6825 connection.cc:196] Error closing socket: Network error: TlsSocket::Close: Broken pipe
W20260926 16:13:50.035224  6825 connection.cc:196] Error closing socket: Network error: TlsSocket::Close: Broken pipe
W20260926 16:13:50.045715  6825 connection.cc:196] Error closing socket: Network error: TlsSocket::Close: Broken pipe
W20260926 16:13:50.056722  6825 connection.cc:196] Error closing socket: Network error: TlsSocket::Close: Broken pipe
W20260926 16:13:50.068077  6825 connection.cc:196] Error closing socket: Network error: TlsSocket::Close: Broken pipe
W20260926 16:13:50.080008  6825 connection.cc:196] Error closing socket: Network error: TlsSocket::Close: Broken pipe
W20260926 16:13:50.090953  6825 connection.cc:196] Error closing socket: Network error: TlsSocket::Close: Broken pipe
W20260926 16:13:50.101981  6825 connection.cc:196] Error closing socket: Network error: TlsSocket::Close: Broken pipe
W20260926 16:13:50.113131  6825 connection.cc:196] Error closing socket: Network error: TlsSocket::Close: Broken pipe
W20260926 16:13:50.123876  6825 connection.cc:196] Error closing socket: Network error: TlsSocket::Close: Broken pipe
W20260926 16:13:50.133752  6825 connection.cc:196] Error closing socket: Network error: TlsSocket::Close: Broken pipe
W20260926 16:13:50.144135  6825 connection.cc:196] Error closing socket: Network error: TlsSocket::Close: Broken pipe
W20260926 16:13:50.154386  6825 connection.cc:196] Error closing socket: Network error: TlsSocket::Close: Broken pipe
W20260926 16:13:50.164193  6825 connection.cc:196] Error closing socket: Network error: TlsSocket::Close: Broken pipe
W20260926 16:13:50.173719  6825 connection.cc:196] Error closing socket: Network error: TlsSocket::Close: Broken pipe
W20260926 16:13:50.183679  6825 connection.cc:196] Error closing socket: Network error: TlsSocket::Close: Broken pipe
W20260926 16:13:50.194767  6825 connection.cc:196] Error closing socket: Network error: TlsSocket::Close: Broken pipe
[       OK ] Parameters/TestRpc.TestReopenOutboundConnections/SSL_UnixSocket (389 ms)
[ RUN      ] Parameters/TestRpc.TestConnectionNetworkPlane/SSL_UnixSocket
I20260926 16:13:50.229492  6849 acceptor_pool.cc:254] collecting diagnostics on the listening RPC socket unix:/tmp/dist-test-task4a3fyS/test-tmp/rpc-test-17943b5e8dac4276b6fa777f3f64c23b.sock every 8 connection(s)
I20260926 16:13:50.230346  6850 acceptor_pool.cc:254] collecting diagnostics on the listening RPC socket unix:/tmp/dist-test-task4a3fyS/test-tmp/rpc-test-17943b5e8dac4276b6fa777f3f64c23b.sock every 8 connection(s)
I20260926 16:13:50.233690  6610 rpc-test.cc:772] Connecting to unix:/tmp/dist-test-task4a3fyS/test-tmp/rpc-test-17943b5e8dac4276b6fa777f3f64c23b.sock
W20260926 16:13:50.287356  6848 connection.cc:196] Error closing socket: Network error: TlsSocket::Close: Broken pipe
W20260926 16:13:50.288008  6848 connection.cc:196] Error closing socket: Network error: TlsSocket::Close: Broken pipe
[       OK ] Parameters/TestRpc.TestConnectionNetworkPlane/SSL_UnixSocket (93 ms)
[ RUN      ] Parameters/TestRpc.TestTCPKeepalive/SSL_UnixSocket
I20260926 16:13:50.319839  6874 acceptor_pool.cc:254] collecting diagnostics on the listening RPC socket unix:/tmp/dist-test-task4a3fyS/test-tmp/rpc-test-f53c6663ac2e4bc48cbe4f7a6a3dc2e6.sock every 8 connection(s)
I20260926 16:13:50.320562  6875 acceptor_pool.cc:254] collecting diagnostics on the listening RPC socket unix:/tmp/dist-test-task4a3fyS/test-tmp/rpc-test-f53c6663ac2e4bc48cbe4f7a6a3dc2e6.sock every 8 connection(s)
I20260926 16:13:50.348244  6878 rpc-test-base.h:222] got call: sleep_micros: 8000000 deferred: true
I20260926 16:13:58.352424  6878 rpcz_store.cc:275] Call kudu.rpc.GenericCalculatorService.Sleep from unix:<unnamed> (request call id 0) took 8004 ms. Trace:
I20260926 16:13:58.352829  6878 rpcz_store.cc:276] 0926 16:13:50.348063 (+     0us) service_pool.cc:170] Inserting onto call queue
0926 16:13:50.348189 (+   126us) service_pool.cc:227] Handling call
0926 16:13:58.352240 (+8004051us) inbound_call.cc:173] Queueing success response
Metrics: {}
W20260926 16:13:58.358600  6871 connection.cc:196] Error closing socket: Network error: TlsSocket::Close: Broken pipe
[       OK ] Parameters/TestRpc.TestTCPKeepalive/SSL_UnixSocket (8072 ms)
[ RUN      ] Parameters/TestRpc.TestMaxSmallSidecars/SSL_UnixSocket
I20260926 16:13:58.398396  6900 acceptor_pool.cc:254] collecting diagnostics on the listening RPC socket unix:/tmp/dist-test-task4a3fyS/test-tmp/rpc-test-f249a10ffb4f452f9c6da2dd43c7b688.sock every 8 connection(s)
I20260926 16:13:58.399205  6901 acceptor_pool.cc:254] collecting diagnostics on the listening RPC socket unix:/tmp/dist-test-task4a3fyS/test-tmp/rpc-test-f249a10ffb4f452f9c6da2dd43c7b688.sock every 8 connection(s)
W20260926 16:13:58.575176  6897 connection.cc:196] Error closing socket: Network error: TlsSocket::Close: Broken pipe
[       OK ] Parameters/TestRpc.TestMaxSmallSidecars/SSL_UnixSocket (214 ms)
[ RUN      ] Parameters/TestRpc.TestCallTimeout/SSL_UnixSocket
I20260926 16:13:58.606745  6925 acceptor_pool.cc:254] collecting diagnostics on the listening RPC socket unix:/tmp/dist-test-task4a3fyS/test-tmp/rpc-test-e820a70403ff4d02a3a58b815d2c2005.sock every 8 connection(s)
I20260926 16:13:58.607441  6926 acceptor_pool.cc:254] collecting diagnostics on the listening RPC socket unix:/tmp/dist-test-task4a3fyS/test-tmp/rpc-test-e820a70403ff4d02a3a58b815d2c2005.sock every 8 connection(s)
I20260926 16:13:58.634090  6610 rpc-test-base.h:595] status: Timed out: connection negotiation to unix:/tmp/dist-test-task4a3fyS/test-tmp/rpc-test-e820a70403ff4d02a3a58b815d2c2005.sock for RPC Sleep timed out after 0.000s (ON_OUTBOUND_QUEUE), seconds elapsed: 0.00299603
I20260926 16:13:58.641079  6929 rpc-test-base.h:222] got call: sleep_micros: 700000
I20260926 16:13:58.834924  6610 rpc-test-base.h:595] status: Timed out: Sleep RPC to unix:/tmp/dist-test-task4a3fyS/test-tmp/rpc-test-e820a70403ff4d02a3a58b815d2c2005.sock timed out after 0.200s (SENT), seconds elapsed: 0.200507
I20260926 16:13:58.836364  6928 rpc-test-base.h:222] got call: sleep_micros: 2000000
W20260926 16:13:59.341745  6929 rpcz_store.cc:267] Call kudu.rpc.GenericCalculatorService.Sleep from unix:<unnamed> (request call id 1) took 700 ms (client timeout 200 ms). Trace:
W20260926 16:13:59.342063  6929 rpcz_store.cc:269] 0926 16:13:58.640903 (+     0us) service_pool.cc:170] Inserting onto call queue
0926 16:13:58.641030 (+   127us) service_pool.cc:227] Handling call
0926 16:13:59.341689 (+700659us) inbound_call.cc:173] Queueing success response
Metrics: {}
I20260926 16:14:00.337814  6610 rpc-test-base.h:595] status: Timed out: Sleep RPC to unix:/tmp/dist-test-task4a3fyS/test-tmp/rpc-test-e820a70403ff4d02a3a58b815d2c2005.sock timed out after 1.500s (SENT), seconds elapsed: 1.50255
W20260926 16:14:00.836982  6928 rpcz_store.cc:267] Call kudu.rpc.GenericCalculatorService.Sleep from unix:<unnamed> (request call id 2) took 2000 ms (client timeout 1500 ms). Trace:
W20260926 16:14:00.837340  6928 rpcz_store.cc:269] 0926 16:13:58.836157 (+     0us) service_pool.cc:170] Inserting onto call queue
0926 16:13:58.836301 (+   144us) service_pool.cc:227] Handling call
0926 16:14:00.836913 (+2000612us) inbound_call.cc:173] Queueing success response
Metrics: {}
W20260926 16:14:00.837888  6922 connection.cc:441] server connection from unix:<unnamed> torn down before Call kudu.rpc.GenericCalculatorService.Sleep from unix:<unnamed> (request call id 2) could send its response
[       OK ] Parameters/TestRpc.TestCallTimeout/SSL_UnixSocket (2263 ms)
[ RUN      ] Parameters/TestRpc.TestServerShutsDown/SSL_UnixSocket
I20260926 16:14:00.846707  6610 rpc-test.cc:1125] Connecting to 0.0.0.0:36141
W20260926 16:14:00.859187  6942 negotiation.cc:337] Failed RPC negotiation. Trace:
0926 16:14:00.857673 (+     0us) reactor.cc:625] Submitting negotiation task for client connection to 0.0.0.0:36141 (local address 127.0.0.1:50462)
0926 16:14:00.858176 (+   503us) negotiation.cc:107] Waiting for socket to connect
0926 16:14:00.858209 (+    33us) client_negotiation.cc:174] Beginning negotiation
0926 16:14:00.858432 (+   223us) client_negotiation.cc:252] Sending NEGOTIATE NegotiatePB request
0926 16:14:00.858678 (+   246us) negotiation.cc:327] Negotiation complete: Network error: Client connection negotiation failed: client connection to 0.0.0.0:36141: BlockingWrite error: write error: Broken pipe (error 32)
Metrics: {"client-negotiator.queue_time_us":162}
[       OK ] Parameters/TestRpc.TestServerShutsDown/SSL_UnixSocket (17 ms)
[ RUN      ] Parameters/TestRpc.TimedOutOnResponseMetric/SSL_UnixSocket
I20260926 16:14:00.906517  6959 acceptor_pool.cc:254] collecting diagnostics on the listening RPC socket unix:/tmp/dist-test-task4a3fyS/test-tmp/rpc-test-9dbce897ada645459b1c8226300402e5.sock every 8 connection(s)
I20260926 16:14:00.907287  6960 acceptor_pool.cc:254] collecting diagnostics on the listening RPC socket unix:/tmp/dist-test-task4a3fyS/test-tmp/rpc-test-9dbce897ada645459b1c8226300402e5.sock every 8 connection(s)
W20260926 16:14:01.147117  6963 rpcz_store.cc:267] Call kudu.rpc_test.CalculatorService.Sleep from unix:<unnamed> (request call id 3) took 50 ms (client timeout 25 ms). Trace:
W20260926 16:14:01.147442  6963 rpcz_store.cc:269] 0926 16:14:01.096361 (+     0us) service_pool.cc:170] Inserting onto call queue
0926 16:14:01.096496 (+   135us) service_pool.cc:227] Handling call
0926 16:14:01.147031 (+ 50535us) inbound_call.cc:173] Queueing success response
Related trace 'test_child':
Metrics: {"test_sleep_us":50000,"child_traces":[["test_child",{"related_trace_metric":1}]]}
W20260926 16:14:01.207075  6963 rpcz_store.cc:267] Call kudu.rpc_test.CalculatorService.Sleep from unix:<unnamed> (request call id 4) took 50 ms (client timeout 50 ms). Trace:
W20260926 16:14:01.207448  6963 rpcz_store.cc:269] 0926 16:14:01.156459 (+     0us) service_pool.cc:170] Inserting onto call queue
0926 16:14:01.156606 (+   147us) service_pool.cc:227] Handling call
0926 16:14:01.207004 (+ 50398us) inbound_call.cc:173] Queueing success response
Related trace 'test_child':
Metrics: {"test_sleep_us":50000,"child_traces":[["test_child",{"related_trace_metric":1}]]}
[       OK ] Parameters/TestRpc.TimedOutOnResponseMetric/SSL_UnixSocket (353 ms)
[ RUN      ] Parameters/TestRpc.AcceptorDispatchingTimesMetric/SSL_UnixSocket
I20260926 16:14:01.227016  6984 acceptor_pool.cc:254] collecting diagnostics on the listening RPC socket 0.0.0.0:41181 every 8 connection(s)
I20260926 16:14:01.227733  6985 acceptor_pool.cc:254] collecting diagnostics on the listening RPC socket 0.0.0.0:41181 every 8 connection(s)
W20260926 16:14:01.232438  6980 negotiation.cc:337] Failed RPC negotiation. Trace:
0926 16:14:01.231279 (+     0us) reactor.cc:625] Submitting negotiation task for server connection from 127.0.0.1:36932 (local address 127.0.0.1:41181)
0926 16:14:01.231736 (+   457us) server_negotiation.cc:206] Beginning negotiation
0926 16:14:01.231751 (+    15us) server_negotiation.cc:399] Waiting for connection header
0926 16:14:01.231972 (+   221us) negotiation.cc:327] Negotiation complete: Network error: Server connection negotiation failed: server connection from 127.0.0.1:36932: BlockingRecv error: recv got EOF from 127.0.0.1:36932 (error 108)
Metrics: {"server-negotiator.queue_time_us":100}
[       OK ] Parameters/TestRpc.AcceptorDispatchingTimesMetric/SSL_UnixSocket (21 ms)
[ RUN      ] Parameters/TestRpc.TestRpcCallbackDestroysMessenger/SSL_UnixSocket
[       OK ] Parameters/TestRpc.TestRpcCallbackDestroysMessenger/SSL_UnixSocket (19 ms)
[ RUN      ] Parameters/TestRpc.TestApplicationFeatureFlag/SSL_UnixSocket
I20260926 16:14:01.282121  7009 acceptor_pool.cc:254] collecting diagnostics on the listening RPC socket unix:/tmp/dist-test-task4a3fyS/test-tmp/rpc-test-9b7e549ea84a4724a009b049ae2ac42c.sock every 8 connection(s)
I20260926 16:14:01.282799  7010 acceptor_pool.cc:254] collecting diagnostics on the listening RPC socket unix:/tmp/dist-test-task4a3fyS/test-tmp/rpc-test-9b7e549ea84a4724a009b049ae2ac42c.sock every 8 connection(s)
W20260926 16:14:01.318679  7006 messenger.cc:357] Unable to handle RPC call: Not implemented: call requires unsupported application feature flags: 99
W20260926 16:14:01.321540  7006 connection.cc:196] Error closing socket: Network error: TlsSocket::Close: Broken pipe
[       OK ] Parameters/TestRpc.TestApplicationFeatureFlag/SSL_UnixSocket (69 ms)
[ RUN      ] Parameters/TestRpc.TestCancellation/SSL_UnixSocket
I20260926 16:14:01.341579  7034 acceptor_pool.cc:254] collecting diagnostics on the listening RPC socket unix:/tmp/dist-test-task4a3fyS/test-tmp/rpc-test-8d8df5c913f540c4baae5b7420e1567a.sock every 8 connection(s)
I20260926 16:14:01.342286  7035 acceptor_pool.cc:254] collecting diagnostics on the listening RPC socket unix:/tmp/dist-test-task4a3fyS/test-tmp/rpc-test-8d8df5c913f540c4baae5b7420e1567a.sock every 8 connection(s)
I20260926 16:14:01.345605  6610 rpc-test.cc:1648] Connecting to unix:/tmp/dist-test-task4a3fyS/test-tmp/rpc-test-8d8df5c913f540c4baae5b7420e1567a.sock
I20260926 16:14:01.443372  6610 rpc-test-base.h:595] status: Aborted: Sleep RPC to unix:/tmp/dist-test-task4a3fyS/test-tmp/rpc-test-8d8df5c913f540c4baae5b7420e1567a.sock is cancelled in state READY, seconds elapsed: 0.000472773
I20260926 16:14:01.618413  6610 rpc-test-base.h:595] status: Aborted: Sleep RPC to unix:/tmp/dist-test-task4a3fyS/test-tmp/rpc-test-8d8df5c913f540c4baae5b7420e1567a.sock is cancelled in state SENT, seconds elapsed: 0.000722188
I20260926 16:14:01.618796  7037 rpc-test-base.h:222] got call: sleep_micros: 510000
I20260926 16:14:01.803642  6610 rpc-test-base.h:595] status: Aborted: Sleep RPC to unix:/tmp/dist-test-task4a3fyS/test-tmp/rpc-test-8d8df5c913f540c4baae5b7420e1567a.sock is cancelled in state SENT, seconds elapsed: 0.000939042
I20260926 16:14:01.803866  7036 rpc-test-base.h:222] got call: sleep_micros: 510000
I20260926 16:14:02.000507  6610 rpc-test-base.h:595] status: Aborted: Sleep RPC to unix:/tmp/dist-test-task4a3fyS/test-tmp/rpc-test-8d8df5c913f540c4baae5b7420e1567a.sock is cancelled in state SENT, seconds elapsed: 0.000706251
W20260926 16:14:02.012833  7038 rpcz_store.cc:267] Call kudu.rpc.GenericCalculatorService.Sleep from unix:<unnamed> (request call id 11) took 12 ms (client timeout 10 ms). Trace:
W20260926 16:14:02.013134  7038 rpcz_store.cc:269] 0926 16:14:02.000674 (+     0us) service_pool.cc:170] Inserting onto call queue
0926 16:14:02.012541 (+ 11867us) service_pool.cc:214] Skipping call since client already timed out
0926 16:14:02.012652 (+   111us) inbound_call.cc:173] Queueing failure response
Metrics: {}
I20260926 16:14:02.013638  7038 rpc-test-base.h:222] got call: sleep_micros: 1500000
W20260926 16:14:02.129371  7037 rpcz_store.cc:267] Call kudu.rpc.GenericCalculatorService.Sleep from unix:<unnamed> (request call id 3) took 510 ms (client timeout 10 ms). Trace:
W20260926 16:14:02.129724  7037 rpcz_store.cc:269] 0926 16:14:01.618624 (+     0us) service_pool.cc:170] Inserting onto call queue
0926 16:14:01.618739 (+   115us) service_pool.cc:227] Handling call
0926 16:14:02.129316 (+510577us) inbound_call.cc:173] Queueing success response
Metrics: {}
W20260926 16:14:02.314461  7036 rpcz_store.cc:267] Call kudu.rpc.GenericCalculatorService.Sleep from unix:<unnamed> (request call id 7) took 510 ms (client timeout 10 ms). Trace:
W20260926 16:14:02.314808  7036 rpcz_store.cc:269] 0926 16:14:01.803677 (+     0us) service_pool.cc:170] Inserting onto call queue
0926 16:14:01.803807 (+   130us) service_pool.cc:227] Handling call
0926 16:14:02.314405 (+510598us) inbound_call.cc:173] Queueing success response
Metrics: {}
I20260926 16:14:03.003146  6610 rpc-test-base.h:595] status: Timed out: Sleep RPC to unix:/tmp/dist-test-task4a3fyS/test-tmp/rpc-test-8d8df5c913f540c4baae5b7420e1567a.sock timed out after 1.000s (SENT), seconds elapsed: 1.00223
I20260926 16:14:03.005148  7036 rpc-test-base.h:222] got call: sleep_micros: 1500000
W20260926 16:14:03.514297  7038 rpcz_store.cc:267] Call kudu.rpc.GenericCalculatorService.Sleep from unix:<unnamed> (request call id 12) took 1512 ms (client timeout 1000 ms). Trace:
W20260926 16:14:03.514640  7038 rpcz_store.cc:269] 0926 16:14:02.001487 (+     0us) service_pool.cc:170] Inserting onto call queue
0926 16:14:02.013604 (+ 12117us) service_pool.cc:227] Handling call
0926 16:14:03.514153 (+1500549us) inbound_call.cc:173] Queueing success response
Metrics: {}
I20260926 16:14:04.005733  6610 rpc-test-base.h:595] status: Timed out: Sleep RPC to unix:/tmp/dist-test-task4a3fyS/test-tmp/rpc-test-8d8df5c913f540c4baae5b7420e1567a.sock timed out after 1.000s (SENT), seconds elapsed: 1.00207
W20260926 16:14:04.007335  7031 messenger.cc:357] Unable to handle RPC call: Not implemented: call requires unsupported application feature flags: 99, 1
W20260926 16:14:04.008862  7031 messenger.cc:357] Unable to handle RPC call: Not implemented: call requires unsupported application feature flags: 99, 1
W20260926 16:14:04.214968  7031 connection.cc:196] Error closing socket: Network error: TlsSocket::Close: Broken pipe
W20260926 16:14:04.505810  7036 rpcz_store.cc:267] Call kudu.rpc.GenericCalculatorService.Sleep from unix:<unnamed> (request call id 13) took 1501 ms (client timeout 1000 ms). Trace:
W20260926 16:14:04.506129  7036 rpcz_store.cc:269] 0926 16:14:03.004787 (+     0us) service_pool.cc:170] Inserting onto call queue
0926 16:14:03.005026 (+   239us) service_pool.cc:227] Handling call
0926 16:14:04.505758 (+1500732us) inbound_call.cc:173] Queueing success response
Metrics: {}
W20260926 16:14:04.506721  7031 connection.cc:441] server connection from unix:<unnamed> torn down before Call kudu.rpc.GenericCalculatorService.Sleep from unix:<unnamed> (request call id 13) could send its response
[       OK ] Parameters/TestRpc.TestCancellation/SSL_UnixSocket (3188 ms)
[ RUN      ] Parameters/TestRpc.TestCancellationMultiThreads/SSL_UnixSocket
I20260926 16:14:04.542303  7060 acceptor_pool.cc:254] collecting diagnostics on the listening RPC socket unix:/tmp/dist-test-task4a3fyS/test-tmp/rpc-test-1335c5e8bfd749edbfcc5a24e11e7a1a.sock every 8 connection(s)
I20260926 16:14:04.543179  7061 acceptor_pool.cc:254] collecting diagnostics on the listening RPC socket unix:/tmp/dist-test-task4a3fyS/test-tmp/rpc-test-1335c5e8bfd749edbfcc5a24e11e7a1a.sock every 8 connection(s)
I20260926 16:14:04.546324  6610 rpc-test.cc:1808] Connecting to unix:/tmp/dist-test-task4a3fyS/test-tmp/rpc-test-1335c5e8bfd749edbfcc5a24e11e7a1a.sock
I20260926 16:14:04.679605  7074 test_util.cc:268] Using random seed: 522963237
I20260926 16:14:04.680572  7075 test_util.cc:268] Using random seed: 522964323
I20260926 16:14:04.681910  7076 test_util.cc:268] Using random seed: 522965656
I20260926 16:14:04.683485  7077 test_util.cc:268] Using random seed: 522967100
I20260926 16:14:04.685286  7078 test_util.cc:268] Using random seed: 522968900
I20260926 16:14:04.686633  7079 test_util.cc:268] Using random seed: 522970243
I20260926 16:14:04.688321  7080 test_util.cc:268] Using random seed: 522971920
I20260926 16:14:04.689682  7081 test_util.cc:268] Using random seed: 522973307
I20260926 16:14:04.691087  7082 test_util.cc:268] Using random seed: 522974699
I20260926 16:14:04.692412  7083 test_util.cc:268] Using random seed: 522976061
I20260926 16:14:04.693921  7084 test_util.cc:268] Using random seed: 522977530
I20260926 16:14:04.695408  7085 test_util.cc:268] Using random seed: 522979005
I20260926 16:14:04.697028  7086 test_util.cc:268] Using random seed: 522980598
I20260926 16:14:04.698662  7087 test_util.cc:268] Using random seed: 522982272
I20260926 16:14:04.700357  7088 test_util.cc:268] Using random seed: 522983959
I20260926 16:14:04.702335  7089 test_util.cc:268] Using random seed: 522985916
I20260926 16:14:04.703883  7090 test_util.cc:268] Using random seed: 522987471
I20260926 16:14:04.705322  7091 test_util.cc:268] Using random seed: 522988969
I20260926 16:14:04.706656  7092 test_util.cc:268] Using random seed: 522990300
I20260926 16:14:04.708287  7093 test_util.cc:268] Using random seed: 522991931
I20260926 16:14:04.709676  7094 test_util.cc:268] Using random seed: 522993326
I20260926 16:14:04.712051  7095 test_util.cc:268] Using random seed: 522994759
I20260926 16:14:04.712779  7096 test_util.cc:268] Using random seed: 522996345
I20260926 16:14:04.714169  7097 test_util.cc:268] Using random seed: 522997755
I20260926 16:14:04.715548  7098 test_util.cc:268] Using random seed: 522999144
I20260926 16:14:04.716961  7099 test_util.cc:268] Using random seed: 523000580
I20260926 16:14:04.718320  7100 test_util.cc:268] Using random seed: 523001948
I20260926 16:14:04.719807  7101 test_util.cc:268] Using random seed: 523003401
I20260926 16:14:04.721328  7102 test_util.cc:268] Using random seed: 523004916
I20260926 16:14:04.722729  7103 test_util.cc:268] Using random seed: 523006370
W20260926 16:14:23.984223  7057 connection.cc:196] Error closing socket: Network error: TlsSocket::Close: Broken pipe
[       OK ] Parameters/TestRpc.TestCancellationMultiThreads/SSL_UnixSocket (19487 ms)
[ RUN      ] Parameters/TestRpc.TestCallId/SSL_UnixSocket
I20260926 16:14:24.037637  7117 acceptor_pool.cc:254] collecting diagnostics on the listening RPC socket unix:/tmp/dist-test-task4a3fyS/test-tmp/rpc-test-e04aca4ea3b9479c988b49e9fca46735.sock every 8 connection(s)
I20260926 16:14:24.038455  7118 acceptor_pool.cc:254] collecting diagnostics on the listening RPC socket unix:/tmp/dist-test-task4a3fyS/test-tmp/rpc-test-e04aca4ea3b9479c988b49e9fca46735.sock every 8 connection(s)
W20260926 16:14:24.091120  7114 connection.cc:196] Error closing socket: Network error: TlsSocket::Close: Broken pipe
[       OK ] Parameters/TestRpc.TestCallId/SSL_UnixSocket (96 ms)
[----------] 20 tests from Parameters/TestRpc (38045 ms total)

[----------] Global test environment tear-down
[==========] 21 tests from 2 test suites ran. (41299 ms total)
[  PASSED  ] 20 tests.
[  FAILED  ] 1 test, listed below:
[  FAILED  ] Parameters/TestRpc.TestCallWithChainCertAndRootCA/SSL_UnixSocket, where GetParam() = (true, true)

 1 FAILED TEST
I20260926 16:14:24.116321  6610 logging.cc:424] LogThrottler /data0/somelongdirectorytoavoidrpathissues/src/kudu/src/kudu/rpc/acceptor_pool.cc:285: suppressed but not reported on 3 messages since previous log ~34 seconds ago