Diagnosed failure

Parameters/TestRpc.TestCallWithChainCertAndChainCA/SSL_UnixSocket: /data0/somelongdirectorytoavoidrpathissues/src/kudu/src/kudu/rpc/rpc-test.cc:270: Failure
Failed
Bad status: Runtime error: could not verify certificate chain (error with cert: subject=CN = localhost, ST = sadfjas, C = AS, emailAddress = sdflkdsajf, O = lskdfjlsad, OU = sldfkja, issuer=C = AS, ST = ASDfkjdhf, L = lskdjf, O = saldfja, OU = skdjf, CN = localhost, emailAddress = sadjflkadsj): : certificate has expired
Google Test trace:
/data0/somelongdirectorytoavoidrpathissues/src/kudu/src/kudu/rpc/rpc-test.cc:267: Connecting to unix:/tmp/dist-test-task4J2qo9/test-tmp/rpc-test-ab6502e9a6324481aa7940c603266615.sock
I20260929 14:08:44.445061 22157 test_util.cc:175] -----------------------------------------------
I20260929 14:08:44.445112 22157 test_util.cc:176] Had fatal failures, leaving test files at /tmp/dist-test-task4J2qo9/test-tmp/rpc-test.6.Parameters_TestRpc.TestCallWithChainCertAndChainCA_SSL_UnixSocket.1790690924375044-22157-0

Full log

Note: This is test shard 7 of 8.
[==========] Running 21 tests from 2 test suites.
[----------] Global test environment set-up.
[----------] 20 tests from Parameters/TestRpc
[ RUN      ] Parameters/TestRpc.TestMessengerCreateDestroy/SSL_UnixSocket
WARNING: Logging before InitGoogleLogging() is written to STDERR
I20260929 14:08:44.407719 22157 rpc-test.cc:169] started messenger TestCreateDestroy
[       OK ] Parameters/TestRpc.TestMessengerCreateDestroy/SSL_UnixSocket (31 ms)
[ RUN      ] Parameters/TestRpc.TestNegotiationDeadlock/SSL_UnixSocket
I20260929 14:08:44.422188 22177 acceptor_pool.cc:254] collecting diagnostics on the listening RPC socket unix:/tmp/dist-test-task4J2qo9/test-tmp/rpc-test-33a6f557acba428aa3e2f27da450863f.sock every 8 connection(s)
I20260929 14:08:44.422256 22178 acceptor_pool.cc:254] collecting diagnostics on the listening RPC socket unix:/tmp/dist-test-task4J2qo9/test-tmp/rpc-test-33a6f557acba428aa3e2f27da450863f.sock every 8 connection(s)
[       OK ] Parameters/TestRpc.TestNegotiationDeadlock/SSL_UnixSocket (19 ms)
[ RUN      ] Parameters/TestRpc.TestCallWithChainCertAndChainCA/SSL_UnixSocket
I20260929 14:08:44.440973 22193 acceptor_pool.cc:254] collecting diagnostics on the listening RPC socket unix:/tmp/dist-test-task4J2qo9/test-tmp/rpc-test-ab6502e9a6324481aa7940c603266615.sock every 8 connection(s)
I20260929 14:08:44.440984 22194 acceptor_pool.cc:254] collecting diagnostics on the listening RPC socket unix:/tmp/dist-test-task4J2qo9/test-tmp/rpc-test-ab6502e9a6324481aa7940c603266615.sock every 8 connection(s)
/data0/somelongdirectorytoavoidrpathissues/src/kudu/src/kudu/rpc/rpc-test.cc:270: Failure
Failed
Bad status: Runtime error: could not verify certificate chain (error with cert: subject=CN = localhost, ST = sadfjas, C = AS, emailAddress = sdflkdsajf, O = lskdfjlsad, OU = sldfkja, issuer=C = AS, ST = ASDfkjdhf, L = lskdjf, O = saldfja, OU = skdjf, CN = localhost, emailAddress = sadjflkadsj): : certificate has expired
Google Test trace:
/data0/somelongdirectorytoavoidrpathissues/src/kudu/src/kudu/rpc/rpc-test.cc:267: Connecting to unix:/tmp/dist-test-task4J2qo9/test-tmp/rpc-test-ab6502e9a6324481aa7940c603266615.sock
I20260929 14:08:44.445061 22157 test_util.cc:175] -----------------------------------------------
I20260929 14:08:44.445112 22157 test_util.cc:176] Had fatal failures, leaving test files at /tmp/dist-test-task4J2qo9/test-tmp/rpc-test.6.Parameters_TestRpc.TestCallWithChainCertAndChainCA_SSL_UnixSocket.1790690924375044-22157-0
[  FAILED  ] Parameters/TestRpc.TestCallWithChainCertAndChainCA/SSL_UnixSocket, where GetParam() = (true, true) (16 ms)
[ RUN      ] Parameters/TestRpc.TestCallWithPasswordProtectedKey/SSL_UnixSocket
I20260929 14:08:44.451526 22218 acceptor_pool.cc:254] collecting diagnostics on the listening RPC socket unix:/tmp/dist-test-task4J2qo9/test-tmp/rpc-test-00500a77bea5453e80bb9f47976c1374.sock every 8 connection(s)
I20260929 14:08:44.451571 22219 acceptor_pool.cc:254] collecting diagnostics on the listening RPC socket unix:/tmp/dist-test-task4J2qo9/test-tmp/rpc-test-00500a77bea5453e80bb9f47976c1374.sock every 8 connection(s)
W20260929 14:08:44.462477 22215 connection.cc:196] Error closing socket: Network error: TlsSocket::Close: Broken pipe
[       OK ] Parameters/TestRpc.TestCallWithPasswordProtectedKey/SSL_UnixSocket (18 ms)
[ RUN      ] Parameters/TestRpc.TestCallToBadServer/SSL_UnixSocket
I20260929 14:08:44.472114 22157 rpc-test.cc:394] Status: Network error: Client connection negotiation failed: client connection to 0.0.0.0:0: connect: Connection refused (error 111)
I20260929 14:08:44.472321 22157 rpc-test.cc:394] Status: Network error: Client connection negotiation failed: client connection to 0.0.0.0:0: connect: Connection refused (error 111)
I20260929 14:08:44.472472 22157 rpc-test.cc:394] Status: Network error: Client connection negotiation failed: client connection to 0.0.0.0:0: connect: Connection refused (error 111)
I20260929 14:08:44.472620 22157 rpc-test.cc:394] Status: Network error: Client connection negotiation failed: client connection to 0.0.0.0:0: connect: Connection refused (error 111)
I20260929 14:08:44.472759 22157 rpc-test.cc:394] Status: Network error: Client connection negotiation failed: client connection to 0.0.0.0:0: connect: Connection refused (error 111)
[       OK ] Parameters/TestRpc.TestCallToBadServer/SSL_UnixSocket (9 ms)
[ RUN      ] Parameters/TestRpc.TestWrongService/SSL_UnixSocket
I20260929 14:08:44.499902 22254 acceptor_pool.cc:254] collecting diagnostics on the listening RPC socket unix:/tmp/dist-test-task4J2qo9/test-tmp/rpc-test-ed1511971bbf4f27970f8d019593e36b.sock every 8 connection(s)
I20260929 14:08:44.500068 22253 acceptor_pool.cc:254] collecting diagnostics on the listening RPC socket unix:/tmp/dist-test-task4J2qo9/test-tmp/rpc-test-ed1511971bbf4f27970f8d019593e36b.sock every 8 connection(s)
I20260929 14:08:44.527034 22250 messenger.cc:345] service WrongServiceName not registered on TestServer
[       OK ] Parameters/TestRpc.TestWrongService/SSL_UnixSocket (55 ms)
[ RUN      ] Parameters/TestRpc.TestConnectionKeepalive/SSL_UnixSocket
I20260929 14:08:44.534205 22276 acceptor_pool.cc:254] collecting diagnostics on the listening RPC socket unix:/tmp/dist-test-task4J2qo9/test-tmp/rpc-test-68700d00d0ea43699b9467c90e79bdcd.sock every 8 connection(s)
I20260929 14:08:44.534260 22277 acceptor_pool.cc:254] collecting diagnostics on the listening RPC socket unix:/tmp/dist-test-task4J2qo9/test-tmp/rpc-test-68700d00d0ea43699b9467c90e79bdcd.sock every 8 connection(s)
I20260929 14:08:44.534416 22157 rpc-test.cc:488] Connecting to unix:/tmp/dist-test-task4J2qo9/test-tmp/rpc-test-68700d00d0ea43699b9467c90e79bdcd.sock
W20260929 14:08:45.030375 22289 connection.cc:196] Error closing socket: Network error: TlsSocket::Close: Broken pipe
[       OK ] Parameters/TestRpc.TestConnectionKeepalive/SSL_UnixSocket (1029 ms)
[ RUN      ] Parameters/TestRpc.TestClientConnectionMetrics/SSL_UnixSocket
I20260929 14:08:45.580199 22302 acceptor_pool.cc:254] collecting diagnostics on the listening RPC socket unix:/tmp/dist-test-task4J2qo9/test-tmp/rpc-test-816f564ffe994ac498c44722b17ab075.sock every 8 connection(s)
I20260929 14:08:45.580168 22301 acceptor_pool.cc:254] collecting diagnostics on the listening RPC socket unix:/tmp/dist-test-task4J2qo9/test-tmp/rpc-test-816f564ffe994ac498c44722b17ab075.sock every 8 connection(s)
I20260929 14:08:45.580371 22157 rpc-test.cc:569] Connecting to unix:/tmp/dist-test-task4J2qo9/test-tmp/rpc-test-816f564ffe994ac498c44722b17ab075.sock
W20260929 14:08:53.749246 22298 connection.cc:196] Error closing socket: Network error: TlsSocket::Close: Broken pipe
[       OK ] Parameters/TestRpc.TestClientConnectionMetrics/SSL_UnixSocket (8192 ms)
[ RUN      ] Parameters/TestRpc.TestCredentialsPolicy/SSL_UnixSocket
I20260929 14:08:53.763710 22324 acceptor_pool.cc:254] collecting diagnostics on the listening RPC socket unix:/tmp/dist-test-task4J2qo9/test-tmp/rpc-test-db8f3d4eeaca4c4095fb97dcdf4e2b25.sock every 8 connection(s)
I20260929 14:08:53.763783 22325 acceptor_pool.cc:254] collecting diagnostics on the listening RPC socket unix:/tmp/dist-test-task4J2qo9/test-tmp/rpc-test-db8f3d4eeaca4c4095fb97dcdf4e2b25.sock every 8 connection(s)
I20260929 14:08:53.763937 22157 rpc-test.cc:700] Connecting to unix:/tmp/dist-test-task4J2qo9/test-tmp/rpc-test-db8f3d4eeaca4c4095fb97dcdf4e2b25.sock
W20260929 14:08:53.781418 22323 connection.cc:196] Error closing socket: Network error: TlsSocket::Close: Broken pipe
W20260929 14:08:53.784873 22323 connection.cc:196] Error closing socket: Network error: TlsSocket::Close: Broken pipe
[       OK ] Parameters/TestRpc.TestCredentialsPolicy/SSL_UnixSocket (35 ms)
[ RUN      ] Parameters/TestRpc.TestCallLongerThanKeepalive/SSL_UnixSocket
I20260929 14:08:53.797564 22349 acceptor_pool.cc:254] collecting diagnostics on the listening RPC socket unix:/tmp/dist-test-task4J2qo9/test-tmp/rpc-test-fae9339b0a164501bf45bd00146a7cdb.sock every 8 connection(s)
I20260929 14:08:53.797633 22350 acceptor_pool.cc:254] collecting diagnostics on the listening RPC socket unix:/tmp/dist-test-task4J2qo9/test-tmp/rpc-test-fae9339b0a164501bf45bd00146a7cdb.sock every 8 connection(s)
I20260929 14:08:53.832180 22353 rpc-test-base.h:222] got call: sleep_micros: 3000000 deferred: true
I20260929 14:08:56.832933 22353 rpcz_store.cc:275] Call kudu.rpc.GenericCalculatorService.Sleep from unix:<unnamed> (request call id 0) took 3000 ms. Trace:
I20260929 14:08:56.833045 22353 rpcz_store.cc:276] 0929 14:08:53.832117 (+     0us) service_pool.cc:170] Inserting onto call queue
0929 14:08:53.832158 (+    41us) service_pool.cc:227] Handling call
0929 14:08:56.832917 (+3000759us) inbound_call.cc:173] Queueing success response
Metrics: {}
[       OK ] Parameters/TestRpc.TestCallLongerThanKeepalive/SSL_UnixSocket (3049 ms)
[ RUN      ] Parameters/TestRpc.TestRpcSidecar/SSL_UnixSocket
I20260929 14:08:56.841188 22374 acceptor_pool.cc:254] collecting diagnostics on the listening RPC socket unix:/tmp/dist-test-task4J2qo9/test-tmp/rpc-test-0cbe9c3d1a3e4d8c979712c1698c7927.sock every 8 connection(s)
I20260929 14:08:56.841267 22375 acceptor_pool.cc:254] collecting diagnostics on the listening RPC socket unix:/tmp/dist-test-task4J2qo9/test-tmp/rpc-test-0cbe9c3d1a3e4d8c979712c1698c7927.sock every 8 connection(s)
W20260929 14:08:56.885344 22371 connection.cc:196] Error closing socket: Network error: TlsSocket::Close: Broken pipe
[       OK ] Parameters/TestRpc.TestRpcSidecar/SSL_UnixSocket (51 ms)
[ RUN      ] Parameters/TestRpc.TestRpcSidecarLimits/SSL_UnixSocket
I20260929 14:08:58.489111 22399 acceptor_pool.cc:254] collecting diagnostics on the listening RPC socket unix:/tmp/dist-test-task4J2qo9/test-tmp/rpc-test-0e80c042af2e4a91800037d2cbabf457.sock every 8 connection(s)
I20260929 14:08:58.489145 22400 acceptor_pool.cc:254] collecting diagnostics on the listening RPC socket unix:/tmp/dist-test-task4J2qo9/test-tmp/rpc-test-0e80c042af2e4a91800037d2cbabf457.sock every 8 connection(s)
W20260929 14:08:58.500825 22157 serialization.cc:72] Serialized kudu.rpc_test.PushStringsRequestPB (2147483654 bytes) is larger than the maximum configured RPC message size (52428800 bytes). Sending anyway, but peer may reject the data.
W20260929 14:08:58.503742 22396 connection.cc:535] server connection from unix:<unnamed> recv error: Network error: RPC frame had a length of 2147483714, but we only support messages up to 52428800 bytes long.
W20260929 14:08:58.503805 22396 connection.cc:158] shutting down server connection from unix:<unnamed> with pending inbound data: 4/2147483714 bytes received; last active 0 ns ago: status Network error: RPC frame had a length of 2147483714, but we only support messages up to 52428800 bytes long.
W20260929 14:08:58.503942 22412 connection.cc:698] client connection to unix:/tmp/dist-test-task4J2qo9/test-tmp/rpc-test-0e80c042af2e4a91800037d2cbabf457.sock send error: Network error: failed to write to TLS socket: Broken pipe
W20260929 14:08:58.504097 22412 connection.cc:196] Error closing socket: Network error: TlsSocket::Close: Success
I20260929 14:08:58.516494 22425 acceptor_pool.cc:254] collecting diagnostics on the listening RPC socket unix:/tmp/dist-test-task4J2qo9/test-tmp/rpc-test-0e80c042af2e4a91800037d2cbabf457.sock every 8 connection(s)
I20260929 14:08:58.516539 22424 acceptor_pool.cc:254] collecting diagnostics on the listening RPC socket unix:/tmp/dist-test-task4J2qo9/test-tmp/rpc-test-0e80c042af2e4a91800037d2cbabf457.sock every 8 connection(s)
W20260929 14:09:02.703717 22421 connection.cc:577] server connection from unix:<unnamed>: received bad data: 'Corruption: Invalid packet: message had a length of 2147483710, but we only support messages up to 2147483647 bytes
'
W20260929 14:09:02.703995 22437 connection.cc:196] Error closing socket: Network error: TlsSocket::Close: Broken pipe
[       OK ] Parameters/TestRpc.TestRpcSidecarLimits/SSL_UnixSocket (5819 ms)
[ RUN      ] Parameters/TestRpc.TestCallTimeoutDoesntAffectNegotiation/SSL_UnixSocket
I20260929 14:09:02.725791 22449 acceptor_pool.cc:254] collecting diagnostics on the listening RPC socket unix:/tmp/dist-test-task4J2qo9/test-tmp/rpc-test-162ada1682be4741b1d7bed307832a93.sock every 8 connection(s)
I20260929 14:09:02.725837 22450 acceptor_pool.cc:254] collecting diagnostics on the listening RPC socket unix:/tmp/dist-test-task4J2qo9/test-tmp/rpc-test-162ada1682be4741b1d7bed307832a93.sock every 8 connection(s)
W20260929 14:09:02.739818 22445 negotiation.cc:266] Injecting 500ms delay in negotiation
I20260929 14:09:02.790015 22157 rpc-test-base.h:595] status: Timed out: connection negotiation to unix:/tmp/dist-test-task4J2qo9/test-tmp/rpc-test-162ada1682be4741b1d7bed307832a93.sock for RPC Sleep timed out after 0.050s (ON_OUTBOUND_QUEUE), seconds elapsed: 0.0505442
[       OK ] Parameters/TestRpc.TestCallTimeoutDoesntAffectNegotiation/SSL_UnixSocket (538 ms)
[ RUN      ] Parameters/TestRpc.TestRpcHandlerLatencyMetric/SSL_UnixSocket
I20260929 14:09:03.266108 22474 acceptor_pool.cc:254] collecting diagnostics on the listening RPC socket unix:/tmp/dist-test-task4J2qo9/test-tmp/rpc-test-2b7758a38d184c92b802bb8aebdedeea.sock every 8 connection(s)
I20260929 14:09:03.266158 22475 acceptor_pool.cc:254] collecting diagnostics on the listening RPC socket unix:/tmp/dist-test-task4J2qo9/test-tmp/rpc-test-2b7758a38d184c92b802bb8aebdedeea.sock every 8 connection(s)
I20260929 14:09:03.296048 22157 rpc-test.cc:1236] Sleep() min lat: 20264
I20260929 14:09:03.296115 22157 rpc-test.cc:1237] Sleep() mean lat: 20264
I20260929 14:09:03.296142 22157 rpc-test.cc:1238] Sleep() max lat: 20264
I20260929 14:09:03.296155 22157 rpc-test.cc:1239] Sleep() #calls: 1
[       OK ] Parameters/TestRpc.TestRpcHandlerLatencyMetric/SSL_UnixSocket (52 ms)
[ RUN      ] Parameters/TestRpc.TimedOutOnResponseMetricServiceQueue/SSL_UnixSocket
I20260929 14:09:03.307722 22500 acceptor_pool.cc:254] collecting diagnostics on the listening RPC socket unix:/tmp/dist-test-task4J2qo9/test-tmp/rpc-test-e09d4334426f4f77b01cc7af6a12e4bb.sock every 8 connection(s)
I20260929 14:09:03.307771 22501 acceptor_pool.cc:254] collecting diagnostics on the listening RPC socket unix:/tmp/dist-test-task4J2qo9/test-tmp/rpc-test-e09d4334426f4f77b01cc7af6a12e4bb.sock every 8 connection(s)
W20260929 14:09:03.360857 22502 rpcz_store.cc:267] Call kudu.rpc_test.CalculatorService.Sleep from unix:<unnamed> (request call id 2) took 20 ms (client timeout 20 ms). Trace:
W20260929 14:09:03.360988 22502 rpcz_store.cc:269] 0929 14:09:03.340528 (+     0us) service_pool.cc:170] Inserting onto call queue
0929 14:09:03.360825 (+ 20297us) service_pool.cc:214] Skipping call since client already timed out
0929 14:09:03.360837 (+    12us) inbound_call.cc:173] Queueing failure response
Metrics: {}
[       OK ] Parameters/TestRpc.TimedOutOnResponseMetricServiceQueue/SSL_UnixSocket (64 ms)
[ RUN      ] Parameters/TestRpc.RpcPendingConnectionsMetric/SSL_UnixSocket
I20260929 14:09:03.364035 22523 acceptor_pool.cc:254] collecting diagnostics on the listening RPC socket 0.0.0.0:44841 every 8 connection(s)
I20260929 14:09:03.364095 22524 acceptor_pool.cc:254] collecting diagnostics on the listening RPC socket 0.0.0.0:44841 every 8 connection(s)
W20260929 14:09:03.364681 22519 negotiation.cc:337] Failed RPC negotiation. Trace:
0929 14:09:03.364495 (+     0us) reactor.cc:625] Submitting negotiation task for server connection from 127.0.0.1:32914 (local address 127.0.0.1:44841)
0929 14:09:03.364550 (+    55us) server_negotiation.cc:206] Beginning negotiation
0929 14:09:03.364552 (+     2us) server_negotiation.cc:399] Waiting for connection header
0929 14:09:03.364630 (+    78us) negotiation.cc:327] Negotiation complete: Network error: Server connection negotiation failed: server connection from 127.0.0.1:32914: BlockingRecv error: recv got EOF from 127.0.0.1:32914 (error 108)
Metrics: {"server-negotiator.queue_time_us":28}
[       OK ] Parameters/TestRpc.RpcPendingConnectionsMetric/SSL_UnixSocket (13 ms)
[ RUN      ] Parameters/TestRpc.TestRpcContextClientDeadline/SSL_UnixSocket
I20260929 14:09:03.380447 22539 acceptor_pool.cc:254] collecting diagnostics on the listening RPC socket unix:/tmp/dist-test-task4J2qo9/test-tmp/rpc-test-2ae98d94be95491f837e4d928e798691.sock every 8 connection(s)
I20260929 14:09:03.380493 22540 acceptor_pool.cc:254] collecting diagnostics on the listening RPC socket unix:/tmp/dist-test-task4J2qo9/test-tmp/rpc-test-2ae98d94be95491f837e4d928e798691.sock every 8 connection(s)
[       OK ] Parameters/TestRpc.TestRpcContextClientDeadline/SSL_UnixSocket (41 ms)
[ RUN      ] Parameters/TestRpc.TestApplicationFeatureFlagUnsupportedServer/SSL_UnixSocket
I20260929 14:09:03.439366 22564 acceptor_pool.cc:254] collecting diagnostics on the listening RPC socket unix:/tmp/dist-test-task4J2qo9/test-tmp/rpc-test-21bcfa1a20d94a358285913080f0fa2c.sock every 8 connection(s)
I20260929 14:09:03.439415 22565 acceptor_pool.cc:254] collecting diagnostics on the listening RPC socket unix:/tmp/dist-test-task4J2qo9/test-tmp/rpc-test-21bcfa1a20d94a358285913080f0fa2c.sock every 8 connection(s)
[       OK ] Parameters/TestRpc.TestApplicationFeatureFlagUnsupportedServer/SSL_UnixSocket (45 ms)
[ RUN      ] Parameters/TestRpc.TestCancellationAsync/SSL_UnixSocket
I20260929 14:09:03.474237 22589 acceptor_pool.cc:254] collecting diagnostics on the listening RPC socket unix:/tmp/dist-test-task4J2qo9/test-tmp/rpc-test-36058d65183c4672b50252ba5b1c7a16.sock every 8 connection(s)
I20260929 14:09:03.474291 22590 acceptor_pool.cc:254] collecting diagnostics on the listening RPC socket unix:/tmp/dist-test-task4J2qo9/test-tmp/rpc-test-36058d65183c4672b50252ba5b1c7a16.sock every 8 connection(s)
I20260929 14:09:03.474454 22157 rpc-test.cc:1716] Connecting to unix:/tmp/dist-test-task4J2qo9/test-tmp/rpc-test-36058d65183c4672b50252ba5b1c7a16.sock
I20260929 14:09:03.480052 22157 test_util.cc:268] Using random seed: -1181306638
I20260929 14:09:03.496747 22593 rpc-test-base.h:240] got call: sleep_micros: 500 pattern: 4294967295 num_repetitions: 2097152 sidecar_idx: 0
I20260929 14:09:03.511102 22593 rpc-test-base.h:240] got call: sleep_micros: 500 pattern: 4294967295 num_repetitions: 2097152 sidecar_idx: 0
I20260929 14:09:03.523895 22593 rpc-test-base.h:240] got call: sleep_micros: 500 pattern: 4294967295 num_repetitions: 2097152 sidecar_idx: 0
I20260929 14:09:03.535372 22593 rpc-test-base.h:240] got call: sleep_micros: 500 pattern: 4294967295 num_repetitions: 2097152 sidecar_idx: 0
I20260929 14:09:03.546154 22593 rpc-test-base.h:240] got call: sleep_micros: 500 pattern: 4294967295 num_repetitions: 2097152 sidecar_idx: 0
I20260929 14:09:03.556679 22593 rpc-test-base.h:240] got call: sleep_micros: 500 pattern: 4294967295 num_repetitions: 2097152 sidecar_idx: 0
I20260929 14:09:03.567088 22593 rpc-test-base.h:240] got call: sleep_micros: 500 pattern: 4294967295 num_repetitions: 2097152 sidecar_idx: 0
I20260929 14:09:03.577365 22593 rpc-test-base.h:240] got call: sleep_micros: 500 pattern: 4294967295 num_repetitions: 2097152 sidecar_idx: 0
W20260929 14:09:03.578923 22586 connection.cc:196] Error closing socket: Network error: TlsSocket::Close: Broken pipe
W20260929 14:09:03.580617 22586 connection.cc:441] server connection from unix:<unnamed> torn down before Call kudu.rpc.GenericCalculatorService.SleepWithSidecar from unix:<unnamed> (request call id 9) could send its response
[       OK ] Parameters/TestRpc.TestCancellationAsync/SSL_UnixSocket (118 ms)
[ RUN      ] Parameters/TestRpc.TestPerformanceBySocketType/SSL_UnixSocket
I20260929 14:09:03.596704 22614 acceptor_pool.cc:254] collecting diagnostics on the listening RPC socket unix:/tmp/dist-test-task4J2qo9/test-tmp/rpc-test-c720914d32384cfebdfddbf682ebccc2.sock every 8 connection(s)
I20260929 14:09:03.596750 22615 acceptor_pool.cc:254] collecting diagnostics on the listening RPC socket unix:/tmp/dist-test-task4J2qo9/test-tmp/rpc-test-c720914d32384cfebdfddbf682ebccc2.sock every 8 connection(s)
I20260929 14:09:03.596916 22157 rpc-test.cc:1846] Connecting to unix:/tmp/dist-test-task4J2qo9/test-tmp/rpc-test-c720914d32384cfebdfddbf682ebccc2.sock
I20260929 14:09:04.821039 22157 rpc-test.cc:1859] Sending 1024MB via ssl-enabled unix socket: real 1.214s	user 1.224s	sys 0.955s
I20260929 14:09:06.070508 22157 rpc-test.cc:1859] Sending 1024MB via ssl-enabled unix socket: real 1.249s	user 1.275s	sys 0.972s
I20260929 14:09:07.300413 22157 rpc-test.cc:1859] Sending 1024MB via ssl-enabled unix socket: real 1.230s	user 1.291s	sys 0.934s
I20260929 14:09:08.488751 22157 rpc-test.cc:1859] Sending 1024MB via ssl-enabled unix socket: real 1.188s	user 1.297s	sys 0.852s
I20260929 14:09:09.674029 22157 rpc-test.cc:1859] Sending 1024MB via ssl-enabled unix socket: real 1.185s	user 1.288s	sys 0.852s
W20260929 14:09:09.674819 22611 connection.cc:196] Error closing socket: Network error: TlsSocket::Close: Broken pipe
[       OK ] Parameters/TestRpc.TestPerformanceBySocketType/SSL_UnixSocket (6094 ms)
[----------] 20 tests from Parameters/TestRpc (25298 ms total)

[----------] 1 test from Parameters/TestRpcSocketTxRxQueue
[ RUN      ] Parameters/TestRpcSocketTxRxQueue.AcceptorRxQueueSizeMetric/0
I20260929 14:09:09.682753 22639 acceptor_pool.cc:254] collecting diagnostics on the listening RPC socket 0.0.0.0:45749 every 1 connection(s)
I20260929 14:09:09.682816 22640 acceptor_pool.cc:254] collecting diagnostics on the listening RPC socket 0.0.0.0:45749 every 1 connection(s)
W20260929 14:09:09.683339 22635 negotiation.cc:337] Failed RPC negotiation. Trace:
0929 14:09:09.683203 (+     0us) reactor.cc:625] Submitting negotiation task for server connection from 127.0.0.1:41220 (local address 127.0.0.1:45749)
0929 14:09:09.683245 (+    42us) server_negotiation.cc:206] Beginning negotiation
0929 14:09:09.683246 (+     1us) server_negotiation.cc:399] Waiting for connection header
0929 14:09:09.683310 (+    64us) negotiation.cc:327] Negotiation complete: Network error: Server connection negotiation failed: server connection from 127.0.0.1:41220: BlockingRecv error: recv got EOF from 127.0.0.1:41220 (error 108)
Metrics: {"server-negotiator.queue_time_us":16}
[       OK ] Parameters/TestRpcSocketTxRxQueue.AcceptorRxQueueSizeMetric/0 (9 ms)
[----------] 1 test from Parameters/TestRpcSocketTxRxQueue (9 ms total)

[----------] Global test environment tear-down
[==========] 21 tests from 2 test suites ran. (25308 ms total)
[  PASSED  ] 20 tests.
[  FAILED  ] 1 test, listed below:
[  FAILED  ] Parameters/TestRpc.TestCallWithChainCertAndChainCA/SSL_UnixSocket, where GetParam() = (true, true)

 1 FAILED TEST