Diagnosed failure
Parameters/TestRpc.TestCallWithChainCertAndChainCA/SSL_UnixSocket: /data0/somelongdirectorytoavoidrpathissues/src/kudu/src/kudu/rpc/rpc-test.cc:270: Failure
Failed
Bad status: Runtime error: could not verify certificate chain (error with cert: subject=CN = localhost, ST = sadfjas, C = AS, emailAddress = sdflkdsajf, O = lskdfjlsad, OU = sldfkja, issuer=C = AS, ST = ASDfkjdhf, L = lskdjf, O = saldfja, OU = skdjf, CN = localhost, emailAddress = sadjflkadsj): : certificate has expired
Google Test trace:
/data0/somelongdirectorytoavoidrpathissues/src/kudu/src/kudu/rpc/rpc-test.cc:267: Connecting to unix:/tmp/dist-test-task69yj_T/test-tmp/rpc-test-1203b9593eb04cc1b3c7335c6aa00ba0.sock
I20260924 19:00:34.038511 3917 test_util.cc:175] -----------------------------------------------
I20260924 19:00:34.038619 3917 test_util.cc:176] Had fatal failures, leaving test files at /tmp/dist-test-task69yj_T/test-tmp/rpc-test.6.Parameters_TestRpc.TestCallWithChainCertAndChainCA_SSL_UnixSocket.1790276433929237-3917-0
Full log
Note: This is test shard 7 of 8.
[==========] Running 21 tests from 2 test suites.
[----------] Global test environment set-up.
[----------] 20 tests from Parameters/TestRpc
[ RUN ] Parameters/TestRpc.TestMessengerCreateDestroy/SSL_UnixSocket
WARNING: Logging before InitGoogleLogging() is written to STDERR
I20260924 19:00:33.971544 3917 rpc-test.cc:169] started messenger TestCreateDestroy
[ OK ] Parameters/TestRpc.TestMessengerCreateDestroy/SSL_UnixSocket (25 ms)
[ RUN ] Parameters/TestRpc.TestNegotiationDeadlock/SSL_UnixSocket
I20260924 19:00:33.989908 3937 acceptor_pool.cc:254] collecting diagnostics on the listening RPC socket unix:/tmp/dist-test-task69yj_T/test-tmp/rpc-test-948d532d586e4e37bca9446a1f81e45a.sock every 8 connection(s)
I20260924 19:00:33.990088 3938 acceptor_pool.cc:254] collecting diagnostics on the listening RPC socket unix:/tmp/dist-test-task69yj_T/test-tmp/rpc-test-948d532d586e4e37bca9446a1f81e45a.sock every 8 connection(s)
[ OK ] Parameters/TestRpc.TestNegotiationDeadlock/SSL_UnixSocket (36 ms)
[ RUN ] Parameters/TestRpc.TestCallWithChainCertAndChainCA/SSL_UnixSocket
I20260924 19:00:34.026852 3953 acceptor_pool.cc:254] collecting diagnostics on the listening RPC socket unix:/tmp/dist-test-task69yj_T/test-tmp/rpc-test-1203b9593eb04cc1b3c7335c6aa00ba0.sock every 8 connection(s)
I20260924 19:00:34.027133 3954 acceptor_pool.cc:254] collecting diagnostics on the listening RPC socket unix:/tmp/dist-test-task69yj_T/test-tmp/rpc-test-1203b9593eb04cc1b3c7335c6aa00ba0.sock every 8 connection(s)
/data0/somelongdirectorytoavoidrpathissues/src/kudu/src/kudu/rpc/rpc-test.cc:270: Failure
Failed
Bad status: Runtime error: could not verify certificate chain (error with cert: subject=CN = localhost, ST = sadfjas, C = AS, emailAddress = sdflkdsajf, O = lskdfjlsad, OU = sldfkja, issuer=C = AS, ST = ASDfkjdhf, L = lskdjf, O = saldfja, OU = skdjf, CN = localhost, emailAddress = sadjflkadsj): : certificate has expired
Google Test trace:
/data0/somelongdirectorytoavoidrpathissues/src/kudu/src/kudu/rpc/rpc-test.cc:267: Connecting to unix:/tmp/dist-test-task69yj_T/test-tmp/rpc-test-1203b9593eb04cc1b3c7335c6aa00ba0.sock
I20260924 19:00:34.038511 3917 test_util.cc:175] -----------------------------------------------
I20260924 19:00:34.038619 3917 test_util.cc:176] Had fatal failures, leaving test files at /tmp/dist-test-task69yj_T/test-tmp/rpc-test.6.Parameters_TestRpc.TestCallWithChainCertAndChainCA_SSL_UnixSocket.1790276433929237-3917-0
[ FAILED ] Parameters/TestRpc.TestCallWithChainCertAndChainCA/SSL_UnixSocket, where GetParam() = (true, true) (27 ms)
[ RUN ] Parameters/TestRpc.TestCallWithPasswordProtectedKey/SSL_UnixSocket
I20260924 19:00:34.050684 3978 acceptor_pool.cc:254] collecting diagnostics on the listening RPC socket unix:/tmp/dist-test-task69yj_T/test-tmp/rpc-test-feb5f20c19484383af67c816138d7cb4.sock every 8 connection(s)
I20260924 19:00:34.050907 3979 acceptor_pool.cc:254] collecting diagnostics on the listening RPC socket unix:/tmp/dist-test-task69yj_T/test-tmp/rpc-test-feb5f20c19484383af67c816138d7cb4.sock every 8 connection(s)
W20260924 19:00:34.081691 3975 connection.cc:196] Error closing socket: Network error: TlsSocket::Close: Broken pipe
[ OK ] Parameters/TestRpc.TestCallWithPasswordProtectedKey/SSL_UnixSocket (47 ms)
[ RUN ] Parameters/TestRpc.TestCallToBadServer/SSL_UnixSocket
I20260924 19:00:34.116225 3917 rpc-test.cc:394] Status: Network error: Client connection negotiation failed: client connection to 0.0.0.0:0: connect: Connection refused (error 111)
I20260924 19:00:34.117041 3917 rpc-test.cc:394] Status: Network error: Client connection negotiation failed: client connection to 0.0.0.0:0: connect: Connection refused (error 111)
I20260924 19:00:34.117720 3917 rpc-test.cc:394] Status: Network error: Client connection negotiation failed: client connection to 0.0.0.0:0: connect: Connection refused (error 111)
I20260924 19:00:34.118314 3917 rpc-test.cc:394] Status: Network error: Client connection negotiation failed: client connection to 0.0.0.0:0: connect: Connection refused (error 111)
I20260924 19:00:34.118883 3917 rpc-test.cc:394] Status: Network error: Client connection negotiation failed: client connection to 0.0.0.0:0: connect: Connection refused (error 111)
[ OK ] Parameters/TestRpc.TestCallToBadServer/SSL_UnixSocket (35 ms)
[ RUN ] Parameters/TestRpc.TestWrongService/SSL_UnixSocket
I20260924 19:00:34.136272 4013 acceptor_pool.cc:254] collecting diagnostics on the listening RPC socket unix:/tmp/dist-test-task69yj_T/test-tmp/rpc-test-a4662793e98645d8aadd8fd275be7653.sock every 8 connection(s)
I20260924 19:00:34.136502 4014 acceptor_pool.cc:254] collecting diagnostics on the listening RPC socket unix:/tmp/dist-test-task69yj_T/test-tmp/rpc-test-a4662793e98645d8aadd8fd275be7653.sock every 8 connection(s)
I20260924 19:00:34.162031 4010 messenger.cc:345] service WrongServiceName not registered on TestServer
[ OK ] Parameters/TestRpc.TestWrongService/SSL_UnixSocket (46 ms)
[ RUN ] Parameters/TestRpc.TestConnectionKeepalive/SSL_UnixSocket
I20260924 19:00:34.188506 4036 acceptor_pool.cc:254] collecting diagnostics on the listening RPC socket unix:/tmp/dist-test-task69yj_T/test-tmp/rpc-test-e56dd6383ca64d03b81f3313cf6caa5f.sock every 8 connection(s)
I20260924 19:00:34.188776 4037 acceptor_pool.cc:254] collecting diagnostics on the listening RPC socket unix:/tmp/dist-test-task69yj_T/test-tmp/rpc-test-e56dd6383ca64d03b81f3313cf6caa5f.sock every 8 connection(s)
I20260924 19:00:34.189800 3917 rpc-test.cc:488] Connecting to unix:/tmp/dist-test-task69yj_T/test-tmp/rpc-test-e56dd6383ca64d03b81f3313cf6caa5f.sock
W20260924 19:00:34.670313 4049 connection.cc:196] Error closing socket: Network error: TlsSocket::Close: Broken pipe
[ OK ] Parameters/TestRpc.TestConnectionKeepalive/SSL_UnixSocket (1050 ms)
[ RUN ] Parameters/TestRpc.TestClientConnectionMetrics/SSL_UnixSocket
I20260924 19:00:35.243197 4061 acceptor_pool.cc:254] collecting diagnostics on the listening RPC socket unix:/tmp/dist-test-task69yj_T/test-tmp/rpc-test-3809672160d44155911edc19a89a9e2b.sock every 8 connection(s)
I20260924 19:00:35.243494 4062 acceptor_pool.cc:254] collecting diagnostics on the listening RPC socket unix:/tmp/dist-test-task69yj_T/test-tmp/rpc-test-3809672160d44155911edc19a89a9e2b.sock every 8 connection(s)
I20260924 19:00:35.244395 3917 rpc-test.cc:569] Connecting to unix:/tmp/dist-test-task69yj_T/test-tmp/rpc-test-3809672160d44155911edc19a89a9e2b.sock
W20260924 19:00:56.685537 4058 connection.cc:196] Error closing socket: Network error: TlsSocket::Close: Broken pipe
[ OK ] Parameters/TestRpc.TestClientConnectionMetrics/SSL_UnixSocket (21473 ms)
[ RUN ] Parameters/TestRpc.TestCredentialsPolicy/SSL_UnixSocket
I20260924 19:00:56.710515 4084 acceptor_pool.cc:254] collecting diagnostics on the listening RPC socket unix:/tmp/dist-test-task69yj_T/test-tmp/rpc-test-198e5396f3e24e1b9364efa7e9ed36a0.sock every 8 connection(s)
I20260924 19:00:56.710744 4085 acceptor_pool.cc:254] collecting diagnostics on the listening RPC socket unix:/tmp/dist-test-task69yj_T/test-tmp/rpc-test-198e5396f3e24e1b9364efa7e9ed36a0.sock every 8 connection(s)
I20260924 19:00:56.711634 3917 rpc-test.cc:700] Connecting to unix:/tmp/dist-test-task69yj_T/test-tmp/rpc-test-198e5396f3e24e1b9364efa7e9ed36a0.sock
W20260924 19:00:56.754078 4083 connection.cc:196] Error closing socket: Network error: TlsSocket::Close: Broken pipe
[ OK ] Parameters/TestRpc.TestCredentialsPolicy/SSL_UnixSocket (73 ms)
[ RUN ] Parameters/TestRpc.TestCallLongerThanKeepalive/SSL_UnixSocket
I20260924 19:00:56.781740 4109 acceptor_pool.cc:254] collecting diagnostics on the listening RPC socket unix:/tmp/dist-test-task69yj_T/test-tmp/rpc-test-b96e56e66aa34098855e1cdbf87ad833.sock every 8 connection(s)
I20260924 19:00:56.781921 4110 acceptor_pool.cc:254] collecting diagnostics on the listening RPC socket unix:/tmp/dist-test-task69yj_T/test-tmp/rpc-test-b96e56e66aa34098855e1cdbf87ad833.sock every 8 connection(s)
I20260924 19:00:56.795625 4113 rpc-test-base.h:222] got call: sleep_micros: 3000000 deferred: true
I20260924 19:00:59.797364 4113 rpcz_store.cc:275] Call kudu.rpc.GenericCalculatorService.Sleep from unix:<unnamed> (request call id 0) took 3001 ms. Trace:
I20260924 19:00:59.797528 4113 rpcz_store.cc:276] 0924 19:00:56.795456 (+ 0us) service_pool.cc:170] Inserting onto call queue
0924 19:00:56.795576 (+ 120us) service_pool.cc:227] Handling call
0924 19:00:59.797318 (+3001742us) inbound_call.cc:173] Queueing success response
Metrics: {}
W20260924 19:00:59.800326 4106 connection.cc:196] Error closing socket: Network error: TlsSocket::Close: Broken pipe
[ OK ] Parameters/TestRpc.TestCallLongerThanKeepalive/SSL_UnixSocket (3038 ms)
[ RUN ] Parameters/TestRpc.TestRpcSidecar/SSL_UnixSocket
I20260924 19:00:59.816668 4134 acceptor_pool.cc:254] collecting diagnostics on the listening RPC socket unix:/tmp/dist-test-task69yj_T/test-tmp/rpc-test-d8b567f9f647467cbe3826661c6d822e.sock every 8 connection(s)
I20260924 19:00:59.816902 4135 acceptor_pool.cc:254] collecting diagnostics on the listening RPC socket unix:/tmp/dist-test-task69yj_T/test-tmp/rpc-test-d8b567f9f647467cbe3826661c6d822e.sock every 8 connection(s)
W20260924 19:00:59.925383 4131 connection.cc:196] Error closing socket: Network error: TlsSocket::Close: Broken pipe
[ OK ] Parameters/TestRpc.TestRpcSidecar/SSL_UnixSocket (125 ms)
[ RUN ] Parameters/TestRpc.TestRpcSidecarLimits/SSL_UnixSocket
I20260924 19:01:02.050195 4159 acceptor_pool.cc:254] collecting diagnostics on the listening RPC socket unix:/tmp/dist-test-task69yj_T/test-tmp/rpc-test-68b6494d19634933a958677647bd88bf.sock every 8 connection(s)
I20260924 19:01:02.050457 4160 acceptor_pool.cc:254] collecting diagnostics on the listening RPC socket unix:/tmp/dist-test-task69yj_T/test-tmp/rpc-test-68b6494d19634933a958677647bd88bf.sock every 8 connection(s)
W20260924 19:01:02.063513 3917 serialization.cc:72] Serialized kudu.rpc_test.PushStringsRequestPB (2147483654 bytes) is larger than the maximum configured RPC message size (52428800 bytes). Sending anyway, but peer may reject the data.
W20260924 19:01:02.069646 4156 connection.cc:535] server connection from unix:<unnamed> recv error: Network error: RPC frame had a length of 2147483714, but we only support messages up to 52428800 bytes long.
W20260924 19:01:02.069757 4156 connection.cc:158] shutting down server connection from unix:<unnamed> with pending inbound data: 4/2147483714 bytes received; last active 0 ns ago: status Network error: RPC frame had a length of 2147483714, but we only support messages up to 52428800 bytes long.
W20260924 19:01:02.070047 4172 connection.cc:698] client connection to unix:/tmp/dist-test-task69yj_T/test-tmp/rpc-test-68b6494d19634933a958677647bd88bf.sock send error: Network error: failed to write to TLS socket: Broken pipe
W20260924 19:01:02.070349 4172 connection.cc:196] Error closing socket: Network error: TlsSocket::Close: Success
I20260924 19:01:02.102419 4184 acceptor_pool.cc:254] collecting diagnostics on the listening RPC socket unix:/tmp/dist-test-task69yj_T/test-tmp/rpc-test-68b6494d19634933a958677647bd88bf.sock every 8 connection(s)
I20260924 19:01:02.102531 4185 acceptor_pool.cc:254] collecting diagnostics on the listening RPC socket unix:/tmp/dist-test-task69yj_T/test-tmp/rpc-test-68b6494d19634933a958677647bd88bf.sock every 8 connection(s)
W20260924 19:01:07.819562 4181 connection.cc:577] server connection from unix:<unnamed>: received bad data: 'Corruption: Invalid packet: message had a length of 2147483710, but we only support messages up to 2147483647 bytes
'
W20260924 19:01:07.820231 4197 connection.cc:196] Error closing socket: Network error: TlsSocket::Close: Broken pipe
[ OK ] Parameters/TestRpc.TestRpcSidecarLimits/SSL_UnixSocket (8300 ms)
[ RUN ] Parameters/TestRpc.TestCallTimeoutDoesntAffectNegotiation/SSL_UnixSocket
I20260924 19:01:08.250011 4209 acceptor_pool.cc:254] collecting diagnostics on the listening RPC socket unix:/tmp/dist-test-task69yj_T/test-tmp/rpc-test-512eb5cb253a4852ad6ebf9557c1a618.sock every 8 connection(s)
I20260924 19:01:08.250241 4210 acceptor_pool.cc:254] collecting diagnostics on the listening RPC socket unix:/tmp/dist-test-task69yj_T/test-tmp/rpc-test-512eb5cb253a4852ad6ebf9557c1a618.sock every 8 connection(s)
W20260924 19:01:08.265308 4205 negotiation.cc:266] Injecting 500ms delay in negotiation
I20260924 19:01:08.315776 3917 rpc-test-base.h:595] status: Timed out: connection negotiation to unix:/tmp/dist-test-task69yj_T/test-tmp/rpc-test-512eb5cb253a4852ad6ebf9557c1a618.sock for RPC Sleep timed out after 0.050s (ON_OUTBOUND_QUEUE), seconds elapsed: 0.0510923
W20260924 19:01:08.772305 4206 connection.cc:196] Error closing socket: Network error: TlsSocket::Close: Broken pipe
[ OK ] Parameters/TestRpc.TestCallTimeoutDoesntAffectNegotiation/SSL_UnixSocket (546 ms)
[ RUN ] Parameters/TestRpc.TestRpcHandlerLatencyMetric/SSL_UnixSocket
I20260924 19:01:08.788261 4234 acceptor_pool.cc:254] collecting diagnostics on the listening RPC socket unix:/tmp/dist-test-task69yj_T/test-tmp/rpc-test-832ed5682cba4a7597728f62da630d6b.sock every 8 connection(s)
I20260924 19:01:08.788462 4235 acceptor_pool.cc:254] collecting diagnostics on the listening RPC socket unix:/tmp/dist-test-task69yj_T/test-tmp/rpc-test-832ed5682cba4a7597728f62da630d6b.sock every 8 connection(s)
I20260924 19:01:08.827061 3917 rpc-test.cc:1236] Sleep() min lat: 20649
I20260924 19:01:08.827158 3917 rpc-test.cc:1237] Sleep() mean lat: 20649
I20260924 19:01:08.827199 3917 rpc-test.cc:1238] Sleep() max lat: 20649
I20260924 19:01:08.827216 3917 rpc-test.cc:1239] Sleep() #calls: 1
W20260924 19:01:08.828425 4231 connection.cc:196] Error closing socket: Network error: TlsSocket::Close: Broken pipe
[ OK ] Parameters/TestRpc.TestRpcHandlerLatencyMetric/SSL_UnixSocket (56 ms)
[ RUN ] Parameters/TestRpc.TimedOutOnResponseMetricServiceQueue/SSL_UnixSocket
I20260924 19:01:08.853339 4260 acceptor_pool.cc:254] collecting diagnostics on the listening RPC socket unix:/tmp/dist-test-task69yj_T/test-tmp/rpc-test-51f13f0bd26a49939653e485461043f5.sock every 8 connection(s)
I20260924 19:01:08.853535 4261 acceptor_pool.cc:254] collecting diagnostics on the listening RPC socket unix:/tmp/dist-test-task69yj_T/test-tmp/rpc-test-51f13f0bd26a49939653e485461043f5.sock every 8 connection(s)
W20260924 19:01:08.910533 4262 rpcz_store.cc:267] Call kudu.rpc_test.CalculatorService.Sleep from unix:<unnamed> (request call id 2) took 20 ms (client timeout 20 ms). Trace:
W20260924 19:01:08.910768 4262 rpcz_store.cc:269] 0924 19:01:08.890143 (+ 0us) service_pool.cc:170] Inserting onto call queue
0924 19:01:08.910474 (+ 20331us) service_pool.cc:214] Skipping call since client already timed out
0924 19:01:08.910516 (+ 42us) inbound_call.cc:173] Queueing failure response
Metrics: {}
[ OK ] Parameters/TestRpc.TimedOutOnResponseMetricServiceQueue/SSL_UnixSocket (83 ms)
[ RUN ] Parameters/TestRpc.RpcPendingConnectionsMetric/SSL_UnixSocket
I20260924 19:01:08.919608 4283 acceptor_pool.cc:254] collecting diagnostics on the listening RPC socket 0.0.0.0:38549 every 8 connection(s)
I20260924 19:01:08.919762 4284 acceptor_pool.cc:254] collecting diagnostics on the listening RPC socket 0.0.0.0:38549 every 8 connection(s)
W20260924 19:01:08.921717 4279 negotiation.cc:337] Failed RPC negotiation. Trace:
0924 19:01:08.921125 (+ 0us) reactor.cc:625] Submitting negotiation task for server connection from 127.0.0.1:45380 (local address 127.0.0.1:38549)
0924 19:01:08.921269 (+ 144us) server_negotiation.cc:206] Beginning negotiation
0924 19:01:08.921273 (+ 4us) server_negotiation.cc:399] Waiting for connection header
0924 19:01:08.921407 (+ 134us) negotiation.cc:327] Negotiation complete: Network error: Server connection negotiation failed: server connection from 127.0.0.1:45380: BlockingRecv error: recv got EOF from 127.0.0.1:45380 (error 108)
Metrics: {"server-negotiator.queue_time_us":45}
[ OK ] Parameters/TestRpc.RpcPendingConnectionsMetric/SSL_UnixSocket (19 ms)
[ RUN ] Parameters/TestRpc.TestRpcContextClientDeadline/SSL_UnixSocket
I20260924 19:01:08.948763 4299 acceptor_pool.cc:254] collecting diagnostics on the listening RPC socket unix:/tmp/dist-test-task69yj_T/test-tmp/rpc-test-96dd8ac70ba54dafb8b558b7d2187a74.sock every 8 connection(s)
I20260924 19:01:08.948999 4300 acceptor_pool.cc:254] collecting diagnostics on the listening RPC socket unix:/tmp/dist-test-task69yj_T/test-tmp/rpc-test-96dd8ac70ba54dafb8b558b7d2187a74.sock every 8 connection(s)
[ OK ] Parameters/TestRpc.TestRpcContextClientDeadline/SSL_UnixSocket (60 ms)
[ RUN ] Parameters/TestRpc.TestApplicationFeatureFlagUnsupportedServer/SSL_UnixSocket
I20260924 19:01:09.008842 4324 acceptor_pool.cc:254] collecting diagnostics on the listening RPC socket unix:/tmp/dist-test-task69yj_T/test-tmp/rpc-test-806370fa74b846da8724c32873125fdb.sock every 8 connection(s)
I20260924 19:01:09.009038 4325 acceptor_pool.cc:254] collecting diagnostics on the listening RPC socket unix:/tmp/dist-test-task69yj_T/test-tmp/rpc-test-806370fa74b846da8724c32873125fdb.sock every 8 connection(s)
[ OK ] Parameters/TestRpc.TestApplicationFeatureFlagUnsupportedServer/SSL_UnixSocket (40 ms)
[ RUN ] Parameters/TestRpc.TestCancellationAsync/SSL_UnixSocket
I20260924 19:01:09.070585 4349 acceptor_pool.cc:254] collecting diagnostics on the listening RPC socket unix:/tmp/dist-test-task69yj_T/test-tmp/rpc-test-873bc16fd9a448d794a8361b03d440e8.sock every 8 connection(s)
I20260924 19:01:09.070870 4350 acceptor_pool.cc:254] collecting diagnostics on the listening RPC socket unix:/tmp/dist-test-task69yj_T/test-tmp/rpc-test-873bc16fd9a448d794a8361b03d440e8.sock every 8 connection(s)
I20260924 19:01:09.071641 3917 rpc-test.cc:1716] Connecting to unix:/tmp/dist-test-task69yj_T/test-tmp/rpc-test-873bc16fd9a448d794a8361b03d440e8.sock
I20260924 19:01:09.084129 3917 test_util.cc:268] Using random seed: 956125133
I20260924 19:01:09.121821 4353 rpc-test-base.h:240] got call: sleep_micros: 500 pattern: 4294967295 num_repetitions: 2097152 sidecar_idx: 0
I20260924 19:01:09.148717 4352 rpc-test-base.h:240] got call: sleep_micros: 500 pattern: 4294967295 num_repetitions: 2097152 sidecar_idx: 0
I20260924 19:01:09.179699 4353 rpc-test-base.h:240] got call: sleep_micros: 500 pattern: 4294967295 num_repetitions: 2097152 sidecar_idx: 0
I20260924 19:01:09.207468 4352 rpc-test-base.h:240] got call: sleep_micros: 500 pattern: 4294967295 num_repetitions: 2097152 sidecar_idx: 0
I20260924 19:01:09.236557 4353 rpc-test-base.h:240] got call: sleep_micros: 500 pattern: 4294967295 num_repetitions: 2097152 sidecar_idx: 0
I20260924 19:01:09.263989 4352 rpc-test-base.h:240] got call: sleep_micros: 500 pattern: 4294967295 num_repetitions: 2097152 sidecar_idx: 0
I20260924 19:01:09.293601 4353 rpc-test-base.h:240] got call: sleep_micros: 500 pattern: 4294967295 num_repetitions: 2097152 sidecar_idx: 0
W20260924 19:01:09.309857 4346 connection.cc:441] server connection from unix:<unnamed> torn down before Call kudu.rpc.GenericCalculatorService.SleepWithSidecar from unix:<unnamed> (request call id 8) could send its response
W20260924 19:01:09.327126 4346 connection.cc:441] server connection from unix:<unnamed> torn down before Call kudu.rpc.GenericCalculatorService.SleepWithSidecar from unix:<unnamed> (request call id 9) could send its response
[ OK ] Parameters/TestRpc.TestCancellationAsync/SSL_UnixSocket (294 ms)
[ RUN ] Parameters/TestRpc.TestPerformanceBySocketType/SSL_UnixSocket
I20260924 19:01:09.360942 4374 acceptor_pool.cc:254] collecting diagnostics on the listening RPC socket unix:/tmp/dist-test-task69yj_T/test-tmp/rpc-test-c86a9507ef3d44c9b40a07e215deafe0.sock every 8 connection(s)
I20260924 19:01:09.361189 4375 acceptor_pool.cc:254] collecting diagnostics on the listening RPC socket unix:/tmp/dist-test-task69yj_T/test-tmp/rpc-test-c86a9507ef3d44c9b40a07e215deafe0.sock every 8 connection(s)
I20260924 19:01:09.362100 3917 rpc-test.cc:1846] Connecting to unix:/tmp/dist-test-task69yj_T/test-tmp/rpc-test-c86a9507ef3d44c9b40a07e215deafe0.sock
I20260924 19:01:12.523077 3917 rpc-test.cc:1859] Sending 1024MB via ssl-enabled unix socket: real 3.137s user 3.217s sys 2.081s
I20260924 19:01:15.712745 3917 rpc-test.cc:1859] Sending 1024MB via ssl-enabled unix socket: real 3.190s user 3.127s sys 2.262s
I20260924 19:01:18.957490 3917 rpc-test.cc:1859] Sending 1024MB via ssl-enabled unix socket: real 3.245s user 3.176s sys 2.297s
I20260924 19:01:22.131227 3917 rpc-test.cc:1859] Sending 1024MB via ssl-enabled unix socket: real 3.174s user 3.087s sys 2.243s
I20260924 19:01:25.270397 3917 rpc-test.cc:1859] Sending 1024MB via ssl-enabled unix socket: real 3.139s user 3.085s sys 2.213s
W20260924 19:01:25.272970 4371 connection.cc:196] Error closing socket: Network error: TlsSocket::Close: Broken pipe
[ OK ] Parameters/TestRpc.TestPerformanceBySocketType/SSL_UnixSocket (15947 ms)
[----------] 20 tests from Parameters/TestRpc (51329 ms total)
[----------] 1 test from Parameters/TestRpcSocketTxRxQueue
[ RUN ] Parameters/TestRpcSocketTxRxQueue.AcceptorRxQueueSizeMetric/0
I20260924 19:01:25.288982 4399 acceptor_pool.cc:254] collecting diagnostics on the listening RPC socket 0.0.0.0:35895 every 1 connection(s)
I20260924 19:01:25.289275 4400 acceptor_pool.cc:254] collecting diagnostics on the listening RPC socket 0.0.0.0:35895 every 1 connection(s)
W20260924 19:01:25.290910 4395 negotiation.cc:337] Failed RPC negotiation. Trace:
0924 19:01:25.290521 (+ 0us) reactor.cc:625] Submitting negotiation task for server connection from 127.0.0.1:56412 (local address 127.0.0.1:35895)
0924 19:01:25.290670 (+ 149us) server_negotiation.cc:206] Beginning negotiation
0924 19:01:25.290674 (+ 4us) server_negotiation.cc:399] Waiting for connection header
0924 19:01:25.290790 (+ 116us) negotiation.cc:327] Negotiation complete: Network error: Server connection negotiation failed: server connection from 127.0.0.1:56412: BlockingRecv error: recv got EOF from 127.0.0.1:56412 (error 108)
Metrics: {"server-negotiator.queue_time_us":48}
[ OK ] Parameters/TestRpcSocketTxRxQueue.AcceptorRxQueueSizeMetric/0 (16 ms)
[----------] 1 test from Parameters/TestRpcSocketTxRxQueue (16 ms total)
[----------] Global test environment tear-down
[==========] 21 tests from 2 test suites ran. (51346 ms total)
[ PASSED ] 20 tests.
[ FAILED ] 1 test, listed below:
[ FAILED ] Parameters/TestRpc.TestCallWithChainCertAndChainCA/SSL_UnixSocket, where GetParam() = (true, true)
1 FAILED TEST