Diagnosed failure

Parameters/TestRpc.TestCallWithChainCertAndChainCA/SSL_UnixSocket: /data0/somelongdirectorytoavoidrpathissues/src/kudu/src/kudu/rpc/rpc-test.cc:270: Failure
Failed
Bad status: Runtime error: could not verify certificate chain (error with cert: subject=CN = localhost, ST = sadfjas, C = AS, emailAddress = sdflkdsajf, O = lskdfjlsad, OU = sldfkja, issuer=C = AS, ST = ASDfkjdhf, L = lskdjf, O = saldfja, OU = skdjf, CN = localhost, emailAddress = sadjflkadsj): : certificate has expired
Google Test trace:
/data0/somelongdirectorytoavoidrpathissues/src/kudu/src/kudu/rpc/rpc-test.cc:267: Connecting to unix:/tmp/dist-test-taskcQavwL/test-tmp/rpc-test-f06a131fb3474cad91ed408782d2751d.sock
I20260926 22:40:30.866330 15785 test_util.cc:175] -----------------------------------------------
I20260926 22:40:30.866371 15785 test_util.cc:176] Had fatal failures, leaving test files at /tmp/dist-test-taskcQavwL/test-tmp/rpc-test.6.Parameters_TestRpc.TestCallWithChainCertAndChainCA_SSL_UnixSocket.1790462430803965-15785-0

Full log

Note: This is test shard 7 of 8.
[==========] Running 21 tests from 2 test suites.
[----------] Global test environment set-up.
[----------] 20 tests from Parameters/TestRpc
[ RUN      ] Parameters/TestRpc.TestMessengerCreateDestroy/SSL_UnixSocket
WARNING: Logging before InitGoogleLogging() is written to STDERR
I20260926 22:40:30.828485 15785 rpc-test.cc:169] started messenger TestCreateDestroy
[       OK ] Parameters/TestRpc.TestMessengerCreateDestroy/SSL_UnixSocket (23 ms)
[ RUN      ] Parameters/TestRpc.TestNegotiationDeadlock/SSL_UnixSocket
I20260926 22:40:30.839943 15806 acceptor_pool.cc:254] collecting diagnostics on the listening RPC socket unix:/tmp/dist-test-taskcQavwL/test-tmp/rpc-test-a8dfeff777434ee3b39c683e1754bb0f.sock every 8 connection(s)
I20260926 22:40:30.839943 15805 acceptor_pool.cc:254] collecting diagnostics on the listening RPC socket unix:/tmp/dist-test-taskcQavwL/test-tmp/rpc-test-a8dfeff777434ee3b39c683e1754bb0f.sock every 8 connection(s)
[       OK ] Parameters/TestRpc.TestNegotiationDeadlock/SSL_UnixSocket (15 ms)
[ RUN      ] Parameters/TestRpc.TestCallWithChainCertAndChainCA/SSL_UnixSocket
I20260926 22:40:30.862643 15821 acceptor_pool.cc:254] collecting diagnostics on the listening RPC socket unix:/tmp/dist-test-taskcQavwL/test-tmp/rpc-test-f06a131fb3474cad91ed408782d2751d.sock every 8 connection(s)
I20260926 22:40:30.862702 15822 acceptor_pool.cc:254] collecting diagnostics on the listening RPC socket unix:/tmp/dist-test-taskcQavwL/test-tmp/rpc-test-f06a131fb3474cad91ed408782d2751d.sock every 8 connection(s)
/data0/somelongdirectorytoavoidrpathissues/src/kudu/src/kudu/rpc/rpc-test.cc:270: Failure
Failed
Bad status: Runtime error: could not verify certificate chain (error with cert: subject=CN = localhost, ST = sadfjas, C = AS, emailAddress = sdflkdsajf, O = lskdfjlsad, OU = sldfkja, issuer=C = AS, ST = ASDfkjdhf, L = lskdjf, O = saldfja, OU = skdjf, CN = localhost, emailAddress = sadjflkadsj): : certificate has expired
Google Test trace:
/data0/somelongdirectorytoavoidrpathissues/src/kudu/src/kudu/rpc/rpc-test.cc:267: Connecting to unix:/tmp/dist-test-taskcQavwL/test-tmp/rpc-test-f06a131fb3474cad91ed408782d2751d.sock
I20260926 22:40:30.866330 15785 test_util.cc:175] -----------------------------------------------
I20260926 22:40:30.866371 15785 test_util.cc:176] Had fatal failures, leaving test files at /tmp/dist-test-taskcQavwL/test-tmp/rpc-test.6.Parameters_TestRpc.TestCallWithChainCertAndChainCA_SSL_UnixSocket.1790462430803965-15785-0
[  FAILED  ] Parameters/TestRpc.TestCallWithChainCertAndChainCA/SSL_UnixSocket, where GetParam() = (true, true) (20 ms)
[ RUN      ] Parameters/TestRpc.TestCallWithPasswordProtectedKey/SSL_UnixSocket
I20260926 22:40:30.878291 15846 acceptor_pool.cc:254] collecting diagnostics on the listening RPC socket unix:/tmp/dist-test-taskcQavwL/test-tmp/rpc-test-cb3bb64e058945deb6638ac949fa1814.sock every 8 connection(s)
I20260926 22:40:30.878309 15847 acceptor_pool.cc:254] collecting diagnostics on the listening RPC socket unix:/tmp/dist-test-taskcQavwL/test-tmp/rpc-test-cb3bb64e058945deb6638ac949fa1814.sock every 8 connection(s)
W20260926 22:40:30.889451 15843 connection.cc:196] Error closing socket: Network error: TlsSocket::Close: Broken pipe
[       OK ] Parameters/TestRpc.TestCallWithPasswordProtectedKey/SSL_UnixSocket (23 ms)
[ RUN      ] Parameters/TestRpc.TestCallToBadServer/SSL_UnixSocket
I20260926 22:40:30.902622 15785 rpc-test.cc:394] Status: Network error: Client connection negotiation failed: client connection to 0.0.0.0:0: connect: Connection refused (error 111)
I20260926 22:40:30.902829 15785 rpc-test.cc:394] Status: Network error: Client connection negotiation failed: client connection to 0.0.0.0:0: connect: Connection refused (error 111)
I20260926 22:40:30.902973 15785 rpc-test.cc:394] Status: Network error: Client connection negotiation failed: client connection to 0.0.0.0:0: connect: Connection refused (error 111)
I20260926 22:40:30.903154 15785 rpc-test.cc:394] Status: Network error: Client connection negotiation failed: client connection to 0.0.0.0:0: connect: Connection refused (error 111)
I20260926 22:40:30.903299 15785 rpc-test.cc:394] Status: Network error: Client connection negotiation failed: client connection to 0.0.0.0:0: connect: Connection refused (error 111)
[       OK ] Parameters/TestRpc.TestCallToBadServer/SSL_UnixSocket (13 ms)
[ RUN      ] Parameters/TestRpc.TestWrongService/SSL_UnixSocket
I20260926 22:40:30.924089 15881 acceptor_pool.cc:254] collecting diagnostics on the listening RPC socket unix:/tmp/dist-test-taskcQavwL/test-tmp/rpc-test-369aad31b79547669765210261e97555.sock every 8 connection(s)
I20260926 22:40:30.924139 15882 acceptor_pool.cc:254] collecting diagnostics on the listening RPC socket unix:/tmp/dist-test-taskcQavwL/test-tmp/rpc-test-369aad31b79547669765210261e97555.sock every 8 connection(s)
I20260926 22:40:30.940518 15878 messenger.cc:345] service WrongServiceName not registered on TestServer
W20260926 22:40:30.941061 15878 connection.cc:196] Error closing socket: Network error: TlsSocket::Close: Broken pipe
[       OK ] Parameters/TestRpc.TestWrongService/SSL_UnixSocket (38 ms)
[ RUN      ] Parameters/TestRpc.TestConnectionKeepalive/SSL_UnixSocket
I20260926 22:40:30.961902 15904 acceptor_pool.cc:254] collecting diagnostics on the listening RPC socket unix:/tmp/dist-test-taskcQavwL/test-tmp/rpc-test-e474d4557472478f94fab651262962ae.sock every 8 connection(s)
I20260926 22:40:30.961958 15905 acceptor_pool.cc:254] collecting diagnostics on the listening RPC socket unix:/tmp/dist-test-taskcQavwL/test-tmp/rpc-test-e474d4557472478f94fab651262962ae.sock every 8 connection(s)
I20260926 22:40:30.962107 15785 rpc-test.cc:488] Connecting to unix:/tmp/dist-test-taskcQavwL/test-tmp/rpc-test-e474d4557472478f94fab651262962ae.sock
W20260926 22:40:31.443881 15917 connection.cc:196] Error closing socket: Network error: TlsSocket::Close: Broken pipe
[       OK ] Parameters/TestRpc.TestConnectionKeepalive/SSL_UnixSocket (1037 ms)
[ RUN      ] Parameters/TestRpc.TestClientConnectionMetrics/SSL_UnixSocket
I20260926 22:40:31.992652 15929 acceptor_pool.cc:254] collecting diagnostics on the listening RPC socket unix:/tmp/dist-test-taskcQavwL/test-tmp/rpc-test-1b7576321de84e25af31fa3f1e815e32.sock every 8 connection(s)
I20260926 22:40:31.992705 15930 acceptor_pool.cc:254] collecting diagnostics on the listening RPC socket unix:/tmp/dist-test-taskcQavwL/test-tmp/rpc-test-1b7576321de84e25af31fa3f1e815e32.sock every 8 connection(s)
I20260926 22:40:31.992888 15785 rpc-test.cc:569] Connecting to unix:/tmp/dist-test-taskcQavwL/test-tmp/rpc-test-1b7576321de84e25af31fa3f1e815e32.sock
W20260926 22:40:40.034174 15926 connection.cc:196] Error closing socket: Network error: TlsSocket::Close: Broken pipe
[       OK ] Parameters/TestRpc.TestClientConnectionMetrics/SSL_UnixSocket (8055 ms)
[ RUN      ] Parameters/TestRpc.TestCredentialsPolicy/SSL_UnixSocket
I20260926 22:40:40.042868 15952 acceptor_pool.cc:254] collecting diagnostics on the listening RPC socket unix:/tmp/dist-test-taskcQavwL/test-tmp/rpc-test-3cd5cef6eebe4845b59e03124525b687.sock every 8 connection(s)
I20260926 22:40:40.042965 15953 acceptor_pool.cc:254] collecting diagnostics on the listening RPC socket unix:/tmp/dist-test-taskcQavwL/test-tmp/rpc-test-3cd5cef6eebe4845b59e03124525b687.sock every 8 connection(s)
I20260926 22:40:40.043134 15785 rpc-test.cc:700] Connecting to unix:/tmp/dist-test-taskcQavwL/test-tmp/rpc-test-3cd5cef6eebe4845b59e03124525b687.sock
W20260926 22:40:40.062084 15951 connection.cc:196] Error closing socket: Network error: TlsSocket::Close: Broken pipe
W20260926 22:40:40.065495 15951 connection.cc:196] Error closing socket: Network error: TlsSocket::Close: Broken pipe
[       OK ] Parameters/TestRpc.TestCredentialsPolicy/SSL_UnixSocket (30 ms)
[ RUN      ] Parameters/TestRpc.TestCallLongerThanKeepalive/SSL_UnixSocket
I20260926 22:40:40.074409 15978 acceptor_pool.cc:254] collecting diagnostics on the listening RPC socket unix:/tmp/dist-test-taskcQavwL/test-tmp/rpc-test-aaa035e001a7496d9ffbed56d0807b9d.sock every 8 connection(s)
I20260926 22:40:40.074445 15977 acceptor_pool.cc:254] collecting diagnostics on the listening RPC socket unix:/tmp/dist-test-taskcQavwL/test-tmp/rpc-test-aaa035e001a7496d9ffbed56d0807b9d.sock every 8 connection(s)
I20260926 22:40:40.081839 15981 rpc-test-base.h:222] got call: sleep_micros: 3000000 deferred: true
I20260926 22:40:43.082450 15981 rpcz_store.cc:275] Call kudu.rpc.GenericCalculatorService.Sleep from unix:<unnamed> (request call id 0) took 3000 ms. Trace:
I20260926 22:40:43.082571 15981 rpcz_store.cc:276] 0926 22:40:40.081796 (+     0us) service_pool.cc:170] Inserting onto call queue
0926 22:40:40.081831 (+    35us) service_pool.cc:227] Handling call
0926 22:40:43.082434 (+3000603us) inbound_call.cc:173] Queueing success response
Metrics: {}
[       OK ] Parameters/TestRpc.TestCallLongerThanKeepalive/SSL_UnixSocket (3018 ms)
[ RUN      ] Parameters/TestRpc.TestRpcSidecar/SSL_UnixSocket
I20260926 22:40:43.104759 16002 acceptor_pool.cc:254] collecting diagnostics on the listening RPC socket unix:/tmp/dist-test-taskcQavwL/test-tmp/rpc-test-b777123a9de84c7b988594e2b3b7e87e.sock every 8 connection(s)
I20260926 22:40:43.104790 16003 acceptor_pool.cc:254] collecting diagnostics on the listening RPC socket unix:/tmp/dist-test-taskcQavwL/test-tmp/rpc-test-b777123a9de84c7b988594e2b3b7e87e.sock every 8 connection(s)
W20260926 22:40:43.161041 15999 connection.cc:196] Error closing socket: Network error: TlsSocket::Close: Broken pipe
[       OK ] Parameters/TestRpc.TestRpcSidecar/SSL_UnixSocket (77 ms)
[ RUN      ] Parameters/TestRpc.TestRpcSidecarLimits/SSL_UnixSocket
I20260926 22:40:44.824715 16027 acceptor_pool.cc:254] collecting diagnostics on the listening RPC socket unix:/tmp/dist-test-taskcQavwL/test-tmp/rpc-test-3d7bec1fc8414069a542347c768c3a6d.sock every 8 connection(s)
I20260926 22:40:44.824769 16028 acceptor_pool.cc:254] collecting diagnostics on the listening RPC socket unix:/tmp/dist-test-taskcQavwL/test-tmp/rpc-test-3d7bec1fc8414069a542347c768c3a6d.sock every 8 connection(s)
W20260926 22:40:44.843339 15785 serialization.cc:72] Serialized kudu.rpc_test.PushStringsRequestPB (2147483654 bytes) is larger than the maximum configured RPC message size (52428800 bytes). Sending anyway, but peer may reject the data.
W20260926 22:40:44.846019 16024 connection.cc:535] server connection from unix:<unnamed> recv error: Network error: RPC frame had a length of 2147483714, but we only support messages up to 52428800 bytes long.
W20260926 22:40:44.846057 16024 connection.cc:158] shutting down server connection from unix:<unnamed> with pending inbound data: 4/2147483714 bytes received; last active 0 ns ago: status Network error: RPC frame had a length of 2147483714, but we only support messages up to 52428800 bytes long.
W20260926 22:40:44.846138 16040 connection.cc:698] client connection to unix:/tmp/dist-test-taskcQavwL/test-tmp/rpc-test-3d7bec1fc8414069a542347c768c3a6d.sock send error: Network error: failed to write to TLS socket: Broken pipe
W20260926 22:40:44.846268 16040 connection.cc:196] Error closing socket: Network error: TlsSocket::Close: Success
I20260926 22:40:44.853799 16052 acceptor_pool.cc:254] collecting diagnostics on the listening RPC socket unix:/tmp/dist-test-taskcQavwL/test-tmp/rpc-test-3d7bec1fc8414069a542347c768c3a6d.sock every 8 connection(s)
I20260926 22:40:44.853814 16053 acceptor_pool.cc:254] collecting diagnostics on the listening RPC socket unix:/tmp/dist-test-taskcQavwL/test-tmp/rpc-test-3d7bec1fc8414069a542347c768c3a6d.sock every 8 connection(s)
W20260926 22:40:49.450112 16049 connection.cc:577] server connection from unix:<unnamed>: received bad data: 'Corruption: Invalid packet: message had a length of 2147483710, but we only support messages up to 2147483647 bytes
'
W20260926 22:40:49.450361 16065 connection.cc:196] Error closing socket: Network error: TlsSocket::Close: Broken pipe
[       OK ] Parameters/TestRpc.TestRpcSidecarLimits/SSL_UnixSocket (6289 ms)
[ RUN      ] Parameters/TestRpc.TestCallTimeoutDoesntAffectNegotiation/SSL_UnixSocket
I20260926 22:40:49.477631 16077 acceptor_pool.cc:254] collecting diagnostics on the listening RPC socket unix:/tmp/dist-test-taskcQavwL/test-tmp/rpc-test-872a8f9c7d544385ab14d1f1c7d01947.sock every 8 connection(s)
I20260926 22:40:49.477698 16078 acceptor_pool.cc:254] collecting diagnostics on the listening RPC socket unix:/tmp/dist-test-taskcQavwL/test-tmp/rpc-test-872a8f9c7d544385ab14d1f1c7d01947.sock every 8 connection(s)
W20260926 22:40:49.491441 16073 negotiation.cc:266] Injecting 500ms delay in negotiation
I20260926 22:40:49.541731 15785 rpc-test-base.h:595] status: Timed out: connection negotiation to unix:/tmp/dist-test-taskcQavwL/test-tmp/rpc-test-872a8f9c7d544385ab14d1f1c7d01947.sock for RPC Sleep timed out after 0.050s (ON_OUTBOUND_QUEUE), seconds elapsed: 0.0505099
[       OK ] Parameters/TestRpc.TestCallTimeoutDoesntAffectNegotiation/SSL_UnixSocket (544 ms)
[ RUN      ] Parameters/TestRpc.TestRpcHandlerLatencyMetric/SSL_UnixSocket
I20260926 22:40:50.008987 16102 acceptor_pool.cc:254] collecting diagnostics on the listening RPC socket unix:/tmp/dist-test-taskcQavwL/test-tmp/rpc-test-a68a6a94a6ab497cb204c39f814f4f54.sock every 8 connection(s)
I20260926 22:40:50.009028 16103 acceptor_pool.cc:254] collecting diagnostics on the listening RPC socket unix:/tmp/dist-test-taskcQavwL/test-tmp/rpc-test-a68a6a94a6ab497cb204c39f814f4f54.sock every 8 connection(s)
I20260926 22:40:50.042922 15785 rpc-test.cc:1236] Sleep() min lat: 20238
I20260926 22:40:50.042980 15785 rpc-test.cc:1237] Sleep() mean lat: 20238
I20260926 22:40:50.043004 15785 rpc-test.cc:1238] Sleep() max lat: 20238
I20260926 22:40:50.043017 15785 rpc-test.cc:1239] Sleep() #calls: 1
[       OK ] Parameters/TestRpc.TestRpcHandlerLatencyMetric/SSL_UnixSocket (47 ms)
[ RUN      ] Parameters/TestRpc.TimedOutOnResponseMetricServiceQueue/SSL_UnixSocket
I20260926 22:40:50.058336 16129 acceptor_pool.cc:254] collecting diagnostics on the listening RPC socket unix:/tmp/dist-test-taskcQavwL/test-tmp/rpc-test-9c595d352f8e427e85e1e3f7513ab8b5.sock every 8 connection(s)
I20260926 22:40:50.058362 16128 acceptor_pool.cc:254] collecting diagnostics on the listening RPC socket unix:/tmp/dist-test-taskcQavwL/test-tmp/rpc-test-9c595d352f8e427e85e1e3f7513ab8b5.sock every 8 connection(s)
W20260926 22:40:50.115516 16130 rpcz_store.cc:267] Call kudu.rpc_test.CalculatorService.Sleep from unix:<unnamed> (request call id 2) took 20 ms (client timeout 20 ms). Trace:
W20260926 22:40:50.115582 16130 rpcz_store.cc:269] 0926 22:40:50.095339 (+     0us) service_pool.cc:170] Inserting onto call queue
0926 22:40:50.115501 (+ 20162us) service_pool.cc:214] Skipping call since client already timed out
0926 22:40:50.115507 (+     6us) inbound_call.cc:173] Queueing failure response
Metrics: {}
[       OK ] Parameters/TestRpc.TimedOutOnResponseMetricServiceQueue/SSL_UnixSocket (72 ms)
[ RUN      ] Parameters/TestRpc.RpcPendingConnectionsMetric/SSL_UnixSocket
I20260926 22:40:50.118708 16151 acceptor_pool.cc:254] collecting diagnostics on the listening RPC socket 0.0.0.0:40433 every 8 connection(s)
I20260926 22:40:50.118780 16152 acceptor_pool.cc:254] collecting diagnostics on the listening RPC socket 0.0.0.0:40433 every 8 connection(s)
W20260926 22:40:50.119379 16147 negotiation.cc:337] Failed RPC negotiation. Trace:
0926 22:40:50.119210 (+     0us) reactor.cc:625] Submitting negotiation task for server connection from 127.0.0.1:53018 (local address 127.0.0.1:40433)
0926 22:40:50.119248 (+    38us) server_negotiation.cc:206] Beginning negotiation
0926 22:40:50.119250 (+     2us) server_negotiation.cc:399] Waiting for connection header
0926 22:40:50.119332 (+    82us) negotiation.cc:327] Negotiation complete: Network error: Server connection negotiation failed: server connection from 127.0.0.1:53018: BlockingRecv error: recv got EOF from 127.0.0.1:53018 (error 108)
Metrics: {"server-negotiator.queue_time_us":14}
[       OK ] Parameters/TestRpc.RpcPendingConnectionsMetric/SSL_UnixSocket (13 ms)
[ RUN      ] Parameters/TestRpc.TestRpcContextClientDeadline/SSL_UnixSocket
I20260926 22:40:50.139142 16167 acceptor_pool.cc:254] collecting diagnostics on the listening RPC socket unix:/tmp/dist-test-taskcQavwL/test-tmp/rpc-test-078631b362554b5085b9d058ab2e3163.sock every 8 connection(s)
I20260926 22:40:50.139194 16168 acceptor_pool.cc:254] collecting diagnostics on the listening RPC socket unix:/tmp/dist-test-taskcQavwL/test-tmp/rpc-test-078631b362554b5085b9d058ab2e3163.sock every 8 connection(s)
[       OK ] Parameters/TestRpc.TestRpcContextClientDeadline/SSL_UnixSocket (51 ms)
[ RUN      ] Parameters/TestRpc.TestApplicationFeatureFlagUnsupportedServer/SSL_UnixSocket
I20260926 22:40:50.192098 16192 acceptor_pool.cc:254] collecting diagnostics on the listening RPC socket unix:/tmp/dist-test-taskcQavwL/test-tmp/rpc-test-44dbad7655ad4c6faa649635092882c5.sock every 8 connection(s)
I20260926 22:40:50.192143 16193 acceptor_pool.cc:254] collecting diagnostics on the listening RPC socket unix:/tmp/dist-test-taskcQavwL/test-tmp/rpc-test-44dbad7655ad4c6faa649635092882c5.sock every 8 connection(s)
W20260926 22:40:50.224529 16189 connection.cc:196] Error closing socket: Network error: TlsSocket::Close: Broken pipe
[       OK ] Parameters/TestRpc.TestApplicationFeatureFlagUnsupportedServer/SSL_UnixSocket (43 ms)
[ RUN      ] Parameters/TestRpc.TestCancellationAsync/SSL_UnixSocket
I20260926 22:40:50.239679 16217 acceptor_pool.cc:254] collecting diagnostics on the listening RPC socket unix:/tmp/dist-test-taskcQavwL/test-tmp/rpc-test-6f4a0a3490a04807bd797b0add8afc73.sock every 8 connection(s)
I20260926 22:40:50.239755 16218 acceptor_pool.cc:254] collecting diagnostics on the listening RPC socket unix:/tmp/dist-test-taskcQavwL/test-tmp/rpc-test-6f4a0a3490a04807bd797b0add8afc73.sock every 8 connection(s)
I20260926 22:40:50.239915 15785 rpc-test.cc:1716] Connecting to unix:/tmp/dist-test-taskcQavwL/test-tmp/rpc-test-6f4a0a3490a04807bd797b0add8afc73.sock
I20260926 22:40:50.261572 15785 test_util.cc:268] Using random seed: -2041258429
I20260926 22:40:50.277952 16221 rpc-test-base.h:240] got call: sleep_micros: 500 pattern: 4294967295 num_repetitions: 2097152 sidecar_idx: 0
I20260926 22:40:50.288156 16221 rpc-test-base.h:240] got call: sleep_micros: 500 pattern: 4294967295 num_repetitions: 2097152 sidecar_idx: 0
I20260926 22:40:50.297590 16221 rpc-test-base.h:240] got call: sleep_micros: 500 pattern: 4294967295 num_repetitions: 2097152 sidecar_idx: 0
I20260926 22:40:50.307313 16221 rpc-test-base.h:240] got call: sleep_micros: 500 pattern: 4294967295 num_repetitions: 2097152 sidecar_idx: 0
I20260926 22:40:50.316912 16221 rpc-test-base.h:240] got call: sleep_micros: 500 pattern: 4294967295 num_repetitions: 2097152 sidecar_idx: 0
I20260926 22:40:50.326067 16221 rpc-test-base.h:240] got call: sleep_micros: 500 pattern: 4294967295 num_repetitions: 2097152 sidecar_idx: 0
I20260926 22:40:50.335338 16221 rpc-test-base.h:240] got call: sleep_micros: 500 pattern: 4294967295 num_repetitions: 2097152 sidecar_idx: 0
I20260926 22:40:50.344568 16221 rpc-test-base.h:240] got call: sleep_micros: 500 pattern: 4294967295 num_repetitions: 2097152 sidecar_idx: 0
W20260926 22:40:50.345731 16214 connection.cc:196] Error closing socket: Network error: TlsSocket::Close: Broken pipe
W20260926 22:40:50.347550 16214 connection.cc:441] server connection from unix:<unnamed> torn down before Call kudu.rpc.GenericCalculatorService.SleepWithSidecar from unix:<unnamed> (request call id 9) could send its response
[       OK ] Parameters/TestRpc.TestCancellationAsync/SSL_UnixSocket (122 ms)
[ RUN      ] Parameters/TestRpc.TestPerformanceBySocketType/SSL_UnixSocket
I20260926 22:40:50.366173 16242 acceptor_pool.cc:254] collecting diagnostics on the listening RPC socket unix:/tmp/dist-test-taskcQavwL/test-tmp/rpc-test-30b25794d7474dd5babf91c75971ace2.sock every 8 connection(s)
I20260926 22:40:50.366222 16243 acceptor_pool.cc:254] collecting diagnostics on the listening RPC socket unix:/tmp/dist-test-taskcQavwL/test-tmp/rpc-test-30b25794d7474dd5babf91c75971ace2.sock every 8 connection(s)
I20260926 22:40:50.366405 15785 rpc-test.cc:1846] Connecting to unix:/tmp/dist-test-taskcQavwL/test-tmp/rpc-test-30b25794d7474dd5babf91c75971ace2.sock
I20260926 22:40:51.493427 15785 rpc-test.cc:1859] Sending 1024MB via ssl-enabled unix socket: real 1.116s	user 1.134s	sys 0.899s
I20260926 22:40:52.614157 15785 rpc-test.cc:1859] Sending 1024MB via ssl-enabled unix socket: real 1.121s	user 1.276s	sys 0.763s
I20260926 22:40:53.777644 15785 rpc-test.cc:1859] Sending 1024MB via ssl-enabled unix socket: real 1.163s	user 1.180s	sys 0.938s
I20260926 22:40:54.974781 15785 rpc-test.cc:1859] Sending 1024MB via ssl-enabled unix socket: real 1.197s	user 1.211s	sys 0.966s
I20260926 22:40:56.155507 15785 rpc-test.cc:1859] Sending 1024MB via ssl-enabled unix socket: real 1.181s	user 1.331s	sys 0.815s
[       OK ] Parameters/TestRpc.TestPerformanceBySocketType/SSL_UnixSocket (5808 ms)
[----------] 20 tests from Parameters/TestRpc (25350 ms total)

[----------] 1 test from Parameters/TestRpcSocketTxRxQueue
[ RUN      ] Parameters/TestRpcSocketTxRxQueue.AcceptorRxQueueSizeMetric/0
I20260926 22:40:56.163889 16267 acceptor_pool.cc:254] collecting diagnostics on the listening RPC socket 0.0.0.0:36951 every 1 connection(s)
I20260926 22:40:56.163950 16268 acceptor_pool.cc:254] collecting diagnostics on the listening RPC socket 0.0.0.0:36951 every 1 connection(s)
W20260926 22:40:56.164501 16263 negotiation.cc:337] Failed RPC negotiation. Trace:
0926 22:40:56.164373 (+     0us) reactor.cc:625] Submitting negotiation task for server connection from 127.0.0.1:60020 (local address 127.0.0.1:36951)
0926 22:40:56.164420 (+    47us) server_negotiation.cc:206] Beginning negotiation
0926 22:40:56.164422 (+     2us) server_negotiation.cc:399] Waiting for connection header
0926 22:40:56.164476 (+    54us) negotiation.cc:327] Negotiation complete: Network error: Server connection negotiation failed: server connection from 127.0.0.1:60020: BlockingRecv error: recv got EOF from 127.0.0.1:60020 (error 108)
Metrics: {"server-negotiator.queue_time_us":15}
[       OK ] Parameters/TestRpcSocketTxRxQueue.AcceptorRxQueueSizeMetric/0 (9 ms)
[----------] 1 test from Parameters/TestRpcSocketTxRxQueue (9 ms total)

[----------] Global test environment tear-down
[==========] 21 tests from 2 test suites ran. (25360 ms total)
[  PASSED  ] 20 tests.
[  FAILED  ] 1 test, listed below:
[  FAILED  ] Parameters/TestRpc.TestCallWithChainCertAndChainCA/SSL_UnixSocket, where GetParam() = (true, true)

 1 FAILED TEST