Diagnosed failure

Parameters/TestRpc.TestCallWithChainCertAndChainCA/SSL_UnixSocket: /data0/somelongdirectorytoavoidrpathissues/src/kudu/src/kudu/rpc/rpc-test.cc:270: Failure
Failed
Bad status: Runtime error: could not verify certificate chain (error with cert: subject=CN = localhost, ST = sadfjas, C = AS, emailAddress = sdflkdsajf, O = lskdfjlsad, OU = sldfkja, issuer=C = AS, ST = ASDfkjdhf, L = lskdjf, O = saldfja, OU = skdjf, CN = localhost, emailAddress = sadjflkadsj): : certificate has expired
Google Test trace:
/data0/somelongdirectorytoavoidrpathissues/src/kudu/src/kudu/rpc/rpc-test.cc:267: Connecting to unix:/tmp/dist-test-taskmk2VA8/test-tmp/rpc-test-985472a7bb5b4a54806d802ffaf378bc.sock
I20260924 12:48:17.191118 13829 test_util.cc:175] -----------------------------------------------
I20260924 12:48:17.191241 13829 test_util.cc:176] Had fatal failures, leaving test files at /tmp/dist-test-taskmk2VA8/test-tmp/rpc-test.6.Parameters_TestRpc.TestCallWithChainCertAndChainCA_SSL_UnixSocket.1790254097050972-13829-0

Full log

Note: This is test shard 7 of 8.
[==========] Running 21 tests from 2 test suites.
[----------] Global test environment set-up.
[----------] 20 tests from Parameters/TestRpc
[ RUN      ] Parameters/TestRpc.TestMessengerCreateDestroy/SSL_UnixSocket
WARNING: Logging before InitGoogleLogging() is written to STDERR
I20260924 12:48:17.105594 13829 rpc-test.cc:169] started messenger TestCreateDestroy
[       OK ] Parameters/TestRpc.TestMessengerCreateDestroy/SSL_UnixSocket (39 ms)
[ RUN      ] Parameters/TestRpc.TestNegotiationDeadlock/SSL_UnixSocket
I20260924 12:48:17.118917 13849 acceptor_pool.cc:254] collecting diagnostics on the listening RPC socket unix:/tmp/dist-test-taskmk2VA8/test-tmp/rpc-test-1e62cec67533498c9f1ea1eb299ee1b5.sock every 8 connection(s)
I20260924 12:48:17.119280 13850 acceptor_pool.cc:254] collecting diagnostics on the listening RPC socket unix:/tmp/dist-test-taskmk2VA8/test-tmp/rpc-test-1e62cec67533498c9f1ea1eb299ee1b5.sock every 8 connection(s)
[       OK ] Parameters/TestRpc.TestNegotiationDeadlock/SSL_UnixSocket (29 ms)
[ RUN      ] Parameters/TestRpc.TestCallWithChainCertAndChainCA/SSL_UnixSocket
I20260924 12:48:17.178624 13865 acceptor_pool.cc:254] collecting diagnostics on the listening RPC socket unix:/tmp/dist-test-taskmk2VA8/test-tmp/rpc-test-985472a7bb5b4a54806d802ffaf378bc.sock every 8 connection(s)
I20260924 12:48:17.179005 13866 acceptor_pool.cc:254] collecting diagnostics on the listening RPC socket unix:/tmp/dist-test-taskmk2VA8/test-tmp/rpc-test-985472a7bb5b4a54806d802ffaf378bc.sock every 8 connection(s)
/data0/somelongdirectorytoavoidrpathissues/src/kudu/src/kudu/rpc/rpc-test.cc:270: Failure
Failed
Bad status: Runtime error: could not verify certificate chain (error with cert: subject=CN = localhost, ST = sadfjas, C = AS, emailAddress = sdflkdsajf, O = lskdfjlsad, OU = sldfkja, issuer=C = AS, ST = ASDfkjdhf, L = lskdjf, O = saldfja, OU = skdjf, CN = localhost, emailAddress = sadjflkadsj): : certificate has expired
Google Test trace:
/data0/somelongdirectorytoavoidrpathissues/src/kudu/src/kudu/rpc/rpc-test.cc:267: Connecting to unix:/tmp/dist-test-taskmk2VA8/test-tmp/rpc-test-985472a7bb5b4a54806d802ffaf378bc.sock
I20260924 12:48:17.191118 13829 test_util.cc:175] -----------------------------------------------
I20260924 12:48:17.191241 13829 test_util.cc:176] Had fatal failures, leaving test files at /tmp/dist-test-taskmk2VA8/test-tmp/rpc-test.6.Parameters_TestRpc.TestCallWithChainCertAndChainCA_SSL_UnixSocket.1790254097050972-13829-0
[  FAILED  ] Parameters/TestRpc.TestCallWithChainCertAndChainCA/SSL_UnixSocket, where GetParam() = (true, true) (52 ms)
[ RUN      ] Parameters/TestRpc.TestCallWithPasswordProtectedKey/SSL_UnixSocket
I20260924 12:48:17.207191 13890 acceptor_pool.cc:254] collecting diagnostics on the listening RPC socket unix:/tmp/dist-test-taskmk2VA8/test-tmp/rpc-test-fd27f7e1645d41fd93e1cd9a54593aac.sock every 8 connection(s)
I20260924 12:48:17.207489 13891 acceptor_pool.cc:254] collecting diagnostics on the listening RPC socket unix:/tmp/dist-test-taskmk2VA8/test-tmp/rpc-test-fd27f7e1645d41fd93e1cd9a54593aac.sock every 8 connection(s)
W20260924 12:48:17.237871 13887 connection.cc:196] Error closing socket: Network error: TlsSocket::Close: Broken pipe
[       OK ] Parameters/TestRpc.TestCallWithPasswordProtectedKey/SSL_UnixSocket (50 ms)
[ RUN      ] Parameters/TestRpc.TestCallToBadServer/SSL_UnixSocket
I20260924 12:48:17.271401 13829 rpc-test.cc:394] Status: Network error: Client connection negotiation failed: client connection to 0.0.0.0:0: connect: Connection refused (error 111)
I20260924 12:48:17.272033 13829 rpc-test.cc:394] Status: Network error: Client connection negotiation failed: client connection to 0.0.0.0:0: connect: Connection refused (error 111)
I20260924 12:48:17.272531 13829 rpc-test.cc:394] Status: Network error: Client connection negotiation failed: client connection to 0.0.0.0:0: connect: Connection refused (error 111)
I20260924 12:48:17.273053 13829 rpc-test.cc:394] Status: Network error: Client connection negotiation failed: client connection to 0.0.0.0:0: connect: Connection refused (error 111)
I20260924 12:48:17.273581 13829 rpc-test.cc:394] Status: Network error: Client connection negotiation failed: client connection to 0.0.0.0:0: connect: Connection refused (error 111)
[       OK ] Parameters/TestRpc.TestCallToBadServer/SSL_UnixSocket (33 ms)
[ RUN      ] Parameters/TestRpc.TestWrongService/SSL_UnixSocket
I20260924 12:48:17.294744 13925 acceptor_pool.cc:254] collecting diagnostics on the listening RPC socket unix:/tmp/dist-test-taskmk2VA8/test-tmp/rpc-test-97ef7cabaebf424880d709b7f41f00e4.sock every 8 connection(s)
I20260924 12:48:17.295025 13926 acceptor_pool.cc:254] collecting diagnostics on the listening RPC socket unix:/tmp/dist-test-taskmk2VA8/test-tmp/rpc-test-97ef7cabaebf424880d709b7f41f00e4.sock every 8 connection(s)
I20260924 12:48:17.315711 13922 messenger.cc:345] service WrongServiceName not registered on TestServer
W20260924 12:48:17.316987 13922 connection.cc:196] Error closing socket: Network error: TlsSocket::Close: Broken pipe
[       OK ] Parameters/TestRpc.TestWrongService/SSL_UnixSocket (45 ms)
[ RUN      ] Parameters/TestRpc.TestConnectionKeepalive/SSL_UnixSocket
I20260924 12:48:17.337561 13948 acceptor_pool.cc:254] collecting diagnostics on the listening RPC socket unix:/tmp/dist-test-taskmk2VA8/test-tmp/rpc-test-a1fbcc03df624d38b240e9724b8c3b6d.sock every 8 connection(s)
I20260924 12:48:17.337816 13949 acceptor_pool.cc:254] collecting diagnostics on the listening RPC socket unix:/tmp/dist-test-taskmk2VA8/test-tmp/rpc-test-a1fbcc03df624d38b240e9724b8c3b6d.sock every 8 connection(s)
I20260924 12:48:17.338792 13829 rpc-test.cc:488] Connecting to unix:/tmp/dist-test-taskmk2VA8/test-tmp/rpc-test-a1fbcc03df624d38b240e9724b8c3b6d.sock
W20260924 12:48:17.823997 13961 connection.cc:196] Error closing socket: Network error: TlsSocket::Close: Broken pipe
[       OK ] Parameters/TestRpc.TestConnectionKeepalive/SSL_UnixSocket (1060 ms)
[ RUN      ] Parameters/TestRpc.TestClientConnectionMetrics/SSL_UnixSocket
I20260924 12:48:18.416852 13973 acceptor_pool.cc:254] collecting diagnostics on the listening RPC socket unix:/tmp/dist-test-taskmk2VA8/test-tmp/rpc-test-9db20f06fdf84405b5c5dea225a1a82a.sock every 8 connection(s)
I20260924 12:48:18.417092 13974 acceptor_pool.cc:254] collecting diagnostics on the listening RPC socket unix:/tmp/dist-test-taskmk2VA8/test-tmp/rpc-test-9db20f06fdf84405b5c5dea225a1a82a.sock every 8 connection(s)
I20260924 12:48:18.418021 13829 rpc-test.cc:569] Connecting to unix:/tmp/dist-test-taskmk2VA8/test-tmp/rpc-test-9db20f06fdf84405b5c5dea225a1a82a.sock
W20260924 12:48:40.114650 13970 connection.cc:196] Error closing socket: Network error: TlsSocket::Close: Broken pipe
[       OK ] Parameters/TestRpc.TestClientConnectionMetrics/SSL_UnixSocket (21739 ms)
[ RUN      ] Parameters/TestRpc.TestCredentialsPolicy/SSL_UnixSocket
I20260924 12:48:40.166124 13996 acceptor_pool.cc:254] collecting diagnostics on the listening RPC socket unix:/tmp/dist-test-taskmk2VA8/test-tmp/rpc-test-69bacbd1cb2e4ee6b2f87f05bc07c53d.sock every 8 connection(s)
I20260924 12:48:40.166373 13997 acceptor_pool.cc:254] collecting diagnostics on the listening RPC socket unix:/tmp/dist-test-taskmk2VA8/test-tmp/rpc-test-69bacbd1cb2e4ee6b2f87f05bc07c53d.sock every 8 connection(s)
I20260924 12:48:40.167428 13829 rpc-test.cc:700] Connecting to unix:/tmp/dist-test-taskmk2VA8/test-tmp/rpc-test-69bacbd1cb2e4ee6b2f87f05bc07c53d.sock
W20260924 12:48:40.186987 13995 connection.cc:196] Error closing socket: Network error: TlsSocket::Close: Broken pipe
[       OK ] Parameters/TestRpc.TestCredentialsPolicy/SSL_UnixSocket (75 ms)
[ RUN      ] Parameters/TestRpc.TestCallLongerThanKeepalive/SSL_UnixSocket
I20260924 12:48:40.206790 14021 acceptor_pool.cc:254] collecting diagnostics on the listening RPC socket unix:/tmp/dist-test-taskmk2VA8/test-tmp/rpc-test-d74e950df72c48fda41bbd9f49010db7.sock every 8 connection(s)
I20260924 12:48:40.207001 14022 acceptor_pool.cc:254] collecting diagnostics on the listening RPC socket unix:/tmp/dist-test-taskmk2VA8/test-tmp/rpc-test-d74e950df72c48fda41bbd9f49010db7.sock every 8 connection(s)
I20260924 12:48:40.232661 14025 rpc-test-base.h:222] got call: sleep_micros: 3000000 deferred: true
I20260924 12:48:43.234462 14025 rpcz_store.cc:275] Call kudu.rpc.GenericCalculatorService.Sleep from unix:<unnamed> (request call id 0) took 3001 ms. Trace:
I20260924 12:48:43.234613 14025 rpcz_store.cc:276] 0924 12:48:40.232544 (+     0us) service_pool.cc:170] Inserting onto call queue
0924 12:48:40.232606 (+    62us) service_pool.cc:227] Handling call
0924 12:48:43.234375 (+3001769us) inbound_call.cc:173] Queueing success response
Metrics: {}
W20260924 12:48:43.237116 14018 connection.cc:196] Error closing socket: Network error: TlsSocket::Close: Broken pipe
[       OK ] Parameters/TestRpc.TestCallLongerThanKeepalive/SSL_UnixSocket (3043 ms)
[ RUN      ] Parameters/TestRpc.TestRpcSidecar/SSL_UnixSocket
I20260924 12:48:43.260650 14046 acceptor_pool.cc:254] collecting diagnostics on the listening RPC socket unix:/tmp/dist-test-taskmk2VA8/test-tmp/rpc-test-a93288ef5f5b4d798be19e88bdb34e16.sock every 8 connection(s)
I20260924 12:48:43.260882 14047 acceptor_pool.cc:254] collecting diagnostics on the listening RPC socket unix:/tmp/dist-test-taskmk2VA8/test-tmp/rpc-test-a93288ef5f5b4d798be19e88bdb34e16.sock every 8 connection(s)
W20260924 12:48:43.371157 14043 connection.cc:196] Error closing socket: Network error: TlsSocket::Close: Broken pipe
[       OK ] Parameters/TestRpc.TestRpcSidecar/SSL_UnixSocket (133 ms)
[ RUN      ] Parameters/TestRpc.TestRpcSidecarLimits/SSL_UnixSocket
I20260924 12:48:45.470965 14071 acceptor_pool.cc:254] collecting diagnostics on the listening RPC socket unix:/tmp/dist-test-taskmk2VA8/test-tmp/rpc-test-668da513f4ea4524a0fcaa3c596b4219.sock every 8 connection(s)
I20260924 12:48:45.471158 14072 acceptor_pool.cc:254] collecting diagnostics on the listening RPC socket unix:/tmp/dist-test-taskmk2VA8/test-tmp/rpc-test-668da513f4ea4524a0fcaa3c596b4219.sock every 8 connection(s)
W20260924 12:48:45.484640 13829 serialization.cc:72] Serialized kudu.rpc_test.PushStringsRequestPB (2147483654 bytes) is larger than the maximum configured RPC message size (52428800 bytes). Sending anyway, but peer may reject the data.
W20260924 12:48:45.490852 14068 connection.cc:535] server connection from unix:<unnamed> recv error: Network error: RPC frame had a length of 2147483714, but we only support messages up to 52428800 bytes long.
W20260924 12:48:45.490959 14068 connection.cc:158] shutting down server connection from unix:<unnamed> with pending inbound data: 4/2147483714 bytes received; last active 0 ns ago: status Network error: RPC frame had a length of 2147483714, but we only support messages up to 52428800 bytes long.
W20260924 12:48:45.491425 14084 connection.cc:196] Error closing socket: Network error: TlsSocket::Close: Broken pipe
I20260924 12:48:45.518280 14096 acceptor_pool.cc:254] collecting diagnostics on the listening RPC socket unix:/tmp/dist-test-taskmk2VA8/test-tmp/rpc-test-668da513f4ea4524a0fcaa3c596b4219.sock every 8 connection(s)
I20260924 12:48:45.519220 14097 acceptor_pool.cc:254] collecting diagnostics on the listening RPC socket unix:/tmp/dist-test-taskmk2VA8/test-tmp/rpc-test-668da513f4ea4524a0fcaa3c596b4219.sock every 8 connection(s)
W20260924 12:48:51.688063 14093 connection.cc:577] server connection from unix:<unnamed>: received bad data: 'Corruption: Invalid packet: message had a length of 2147483710, but we only support messages up to 2147483647 bytes
'
W20260924 12:48:51.688657 14109 connection.cc:196] Error closing socket: Network error: TlsSocket::Close: Broken pipe
[       OK ] Parameters/TestRpc.TestRpcSidecarLimits/SSL_UnixSocket (8789 ms)
[ RUN      ] Parameters/TestRpc.TestCallTimeoutDoesntAffectNegotiation/SSL_UnixSocket
I20260924 12:48:52.189638 14121 acceptor_pool.cc:254] collecting diagnostics on the listening RPC socket unix:/tmp/dist-test-taskmk2VA8/test-tmp/rpc-test-28678967581749a6ac7b1510394ae7f1.sock every 8 connection(s)
I20260924 12:48:52.189960 14122 acceptor_pool.cc:254] collecting diagnostics on the listening RPC socket unix:/tmp/dist-test-taskmk2VA8/test-tmp/rpc-test-28678967581749a6ac7b1510394ae7f1.sock every 8 connection(s)
W20260924 12:48:52.216781 14117 negotiation.cc:266] Injecting 500ms delay in negotiation
I20260924 12:48:52.267416 13829 rpc-test-base.h:595] status: Timed out: connection negotiation to unix:/tmp/dist-test-taskmk2VA8/test-tmp/rpc-test-28678967581749a6ac7b1510394ae7f1.sock for RPC Sleep timed out after 0.050s (ON_OUTBOUND_QUEUE), seconds elapsed: 0.0514073
[       OK ] Parameters/TestRpc.TestCallTimeoutDoesntAffectNegotiation/SSL_UnixSocket (563 ms)
[ RUN      ] Parameters/TestRpc.TestRpcHandlerLatencyMetric/SSL_UnixSocket
I20260924 12:48:52.748013 14146 acceptor_pool.cc:254] collecting diagnostics on the listening RPC socket unix:/tmp/dist-test-taskmk2VA8/test-tmp/rpc-test-4bc90801851a4c7d98993eb248d0bf14.sock every 8 connection(s)
I20260924 12:48:52.748292 14147 acceptor_pool.cc:254] collecting diagnostics on the listening RPC socket unix:/tmp/dist-test-taskmk2VA8/test-tmp/rpc-test-4bc90801851a4c7d98993eb248d0bf14.sock every 8 connection(s)
I20260924 12:48:52.803743 13829 rpc-test.cc:1236] Sleep() min lat: 20624
I20260924 12:48:52.803895 13829 rpc-test.cc:1237] Sleep() mean lat: 20624
I20260924 12:48:52.803977 13829 rpc-test.cc:1238] Sleep() max lat: 20624
I20260924 12:48:52.804016 13829 rpc-test.cc:1239] Sleep() #calls: 1
W20260924 12:48:52.805090 14143 connection.cc:196] Error closing socket: Network error: TlsSocket::Close: Broken pipe
[       OK ] Parameters/TestRpc.TestRpcHandlerLatencyMetric/SSL_UnixSocket (81 ms)
[ RUN      ] Parameters/TestRpc.TimedOutOnResponseMetricServiceQueue/SSL_UnixSocket
I20260924 12:48:52.818063 14172 acceptor_pool.cc:254] collecting diagnostics on the listening RPC socket unix:/tmp/dist-test-taskmk2VA8/test-tmp/rpc-test-69ea6c483a474ec68ef48b7baf71852a.sock every 8 connection(s)
I20260924 12:48:52.818276 14173 acceptor_pool.cc:254] collecting diagnostics on the listening RPC socket unix:/tmp/dist-test-taskmk2VA8/test-tmp/rpc-test-69ea6c483a474ec68ef48b7baf71852a.sock every 8 connection(s)
W20260924 12:48:52.875815 14174 rpcz_store.cc:267] Call kudu.rpc_test.CalculatorService.Sleep from unix:<unnamed> (request call id 2) took 20 ms (client timeout 20 ms). Trace:
W20260924 12:48:52.876001 14174 rpcz_store.cc:269] 0924 12:48:52.855239 (+     0us) service_pool.cc:170] Inserting onto call queue
0924 12:48:52.875721 (+ 20482us) service_pool.cc:214] Skipping call since client already timed out
0924 12:48:52.875789 (+    68us) inbound_call.cc:173] Queueing failure response
Metrics: {}
[       OK ] Parameters/TestRpc.TimedOutOnResponseMetricServiceQueue/SSL_UnixSocket (71 ms)
[ RUN      ] Parameters/TestRpc.RpcPendingConnectionsMetric/SSL_UnixSocket
I20260924 12:48:52.885818 14195 acceptor_pool.cc:254] collecting diagnostics on the listening RPC socket 0.0.0.0:44793 every 8 connection(s)
I20260924 12:48:52.886049 14196 acceptor_pool.cc:254] collecting diagnostics on the listening RPC socket 0.0.0.0:44793 every 8 connection(s)
W20260924 12:48:52.888264 14191 negotiation.cc:337] Failed RPC negotiation. Trace:
0924 12:48:52.887583 (+     0us) reactor.cc:625] Submitting negotiation task for server connection from 127.0.0.1:43656 (local address 127.0.0.1:44793)
0924 12:48:52.887762 (+   179us) server_negotiation.cc:206] Beginning negotiation
0924 12:48:52.887766 (+     4us) server_negotiation.cc:399] Waiting for connection header
0924 12:48:52.887919 (+   153us) negotiation.cc:327] Negotiation complete: Network error: Server connection negotiation failed: server connection from 127.0.0.1:43656: BlockingRecv error: recv got EOF from 127.0.0.1:43656 (error 108)
Metrics: {"server-negotiator.queue_time_us":62}
[       OK ] Parameters/TestRpc.RpcPendingConnectionsMetric/SSL_UnixSocket (20 ms)
[ RUN      ] Parameters/TestRpc.TestRpcContextClientDeadline/SSL_UnixSocket
I20260924 12:48:52.914100 14211 acceptor_pool.cc:254] collecting diagnostics on the listening RPC socket unix:/tmp/dist-test-taskmk2VA8/test-tmp/rpc-test-28d08d121d694382bbfb49b5bc9c4a3d.sock every 8 connection(s)
I20260924 12:48:52.914345 14212 acceptor_pool.cc:254] collecting diagnostics on the listening RPC socket unix:/tmp/dist-test-taskmk2VA8/test-tmp/rpc-test-28d08d121d694382bbfb49b5bc9c4a3d.sock every 8 connection(s)
[       OK ] Parameters/TestRpc.TestRpcContextClientDeadline/SSL_UnixSocket (63 ms)
[ RUN      ] Parameters/TestRpc.TestApplicationFeatureFlagUnsupportedServer/SSL_UnixSocket
I20260924 12:48:52.978655 14236 acceptor_pool.cc:254] collecting diagnostics on the listening RPC socket unix:/tmp/dist-test-taskmk2VA8/test-tmp/rpc-test-17e0a2c95dda479cb3b68d4458ee30d5.sock every 8 connection(s)
I20260924 12:48:52.978933 14237 acceptor_pool.cc:254] collecting diagnostics on the listening RPC socket unix:/tmp/dist-test-taskmk2VA8/test-tmp/rpc-test-17e0a2c95dda479cb3b68d4458ee30d5.sock every 8 connection(s)
W20260924 12:48:53.002341 14233 connection.cc:196] Error closing socket: Network error: TlsSocket::Close: Broken pipe
[       OK ] Parameters/TestRpc.TestApplicationFeatureFlagUnsupportedServer/SSL_UnixSocket (41 ms)
[ RUN      ] Parameters/TestRpc.TestCancellationAsync/SSL_UnixSocket
I20260924 12:48:53.018851 14261 acceptor_pool.cc:254] collecting diagnostics on the listening RPC socket unix:/tmp/dist-test-taskmk2VA8/test-tmp/rpc-test-52463ef2ceff4e048d7b0f8314cf4871.sock every 8 connection(s)
I20260924 12:48:53.019376 14262 acceptor_pool.cc:254] collecting diagnostics on the listening RPC socket unix:/tmp/dist-test-taskmk2VA8/test-tmp/rpc-test-52463ef2ceff4e048d7b0f8314cf4871.sock every 8 connection(s)
I20260924 12:48:53.020354 13829 rpc-test.cc:1716] Connecting to unix:/tmp/dist-test-taskmk2VA8/test-tmp/rpc-test-52463ef2ceff4e048d7b0f8314cf4871.sock
I20260924 12:48:53.054442 13829 test_util.cc:268] Using random seed: 94931923
I20260924 12:48:53.088450 14265 rpc-test-base.h:240] got call: sleep_micros: 500 pattern: 4294967295 num_repetitions: 2097152 sidecar_idx: 0
I20260924 12:48:53.122686 14265 rpc-test-base.h:240] got call: sleep_micros: 500 pattern: 4294967295 num_repetitions: 2097152 sidecar_idx: 0
I20260924 12:48:53.156253 14265 rpc-test-base.h:240] got call: sleep_micros: 500 pattern: 4294967295 num_repetitions: 2097152 sidecar_idx: 0
I20260924 12:48:53.180181 14264 rpc-test-base.h:240] got call: sleep_micros: 500 pattern: 4294967295 num_repetitions: 2097152 sidecar_idx: 0
I20260924 12:48:53.212041 14265 rpc-test-base.h:240] got call: sleep_micros: 500 pattern: 4294967295 num_repetitions: 2097152 sidecar_idx: 0
I20260924 12:48:53.239499 14263 rpc-test-base.h:240] got call: sleep_micros: 500 pattern: 4294967295 num_repetitions: 2097152 sidecar_idx: 0
I20260924 12:48:53.276715 14265 rpc-test-base.h:240] got call: sleep_micros: 500 pattern: 4294967295 num_repetitions: 2097152 sidecar_idx: 0
W20260924 12:48:53.279100 14258 connection.cc:196] Error closing socket: Network error: TlsSocket::Close: Broken pipe
W20260924 12:48:53.289004 14258 connection.cc:441] server connection from unix:<unnamed> torn down before Call kudu.rpc.GenericCalculatorService.SleepWithSidecar from unix:<unnamed> (request call id 8) could send its response
W20260924 12:48:53.312752 14258 connection.cc:441] server connection from unix:<unnamed> torn down before Call kudu.rpc.GenericCalculatorService.SleepWithSidecar from unix:<unnamed> (request call id 9) could send its response
[       OK ] Parameters/TestRpc.TestCancellationAsync/SSL_UnixSocket (309 ms)
[ RUN      ] Parameters/TestRpc.TestPerformanceBySocketType/SSL_UnixSocket
I20260924 12:48:53.339212 14286 acceptor_pool.cc:254] collecting diagnostics on the listening RPC socket unix:/tmp/dist-test-taskmk2VA8/test-tmp/rpc-test-8651684b6204465cbc97033750694f74.sock every 8 connection(s)
I20260924 12:48:53.339404 14287 acceptor_pool.cc:254] collecting diagnostics on the listening RPC socket unix:/tmp/dist-test-taskmk2VA8/test-tmp/rpc-test-8651684b6204465cbc97033750694f74.sock every 8 connection(s)
I20260924 12:48:53.340346 13829 rpc-test.cc:1846] Connecting to unix:/tmp/dist-test-taskmk2VA8/test-tmp/rpc-test-8651684b6204465cbc97033750694f74.sock
I20260924 12:48:56.542112 13829 rpc-test.cc:1859] Sending 1024MB via ssl-enabled unix socket: real 3.192s	user 3.076s	sys 2.298s
I20260924 12:48:59.743640 13829 rpc-test.cc:1859] Sending 1024MB via ssl-enabled unix socket: real 3.201s	user 3.130s	sys 2.259s
I20260924 12:49:03.014546 13829 rpc-test.cc:1859] Sending 1024MB via ssl-enabled unix socket: real 3.271s	user 3.242s	sys 2.272s
I20260924 12:49:06.399994 13829 rpc-test.cc:1859] Sending 1024MB via ssl-enabled unix socket: real 3.385s	user 3.415s	sys 2.324s
I20260924 12:49:09.731974 13829 rpc-test.cc:1859] Sending 1024MB via ssl-enabled unix socket: real 3.332s	user 3.309s	sys 2.331s
[       OK ] Parameters/TestRpc.TestPerformanceBySocketType/SSL_UnixSocket (16423 ms)
[----------] 20 tests from Parameters/TestRpc (52670 ms total)

[----------] 1 test from Parameters/TestRpcSocketTxRxQueue
[ RUN      ] Parameters/TestRpcSocketTxRxQueue.AcceptorRxQueueSizeMetric/0
I20260924 12:49:09.745034 14311 acceptor_pool.cc:254] collecting diagnostics on the listening RPC socket 0.0.0.0:38323 every 1 connection(s)
I20260924 12:49:09.745263 14312 acceptor_pool.cc:254] collecting diagnostics on the listening RPC socket 0.0.0.0:38323 every 1 connection(s)
W20260924 12:49:09.747056 14307 negotiation.cc:337] Failed RPC negotiation. Trace:
0924 12:49:09.746646 (+     0us) reactor.cc:625] Submitting negotiation task for server connection from 127.0.0.1:55456 (local address 127.0.0.1:38323)
0924 12:49:09.746799 (+   153us) server_negotiation.cc:206] Beginning negotiation
0924 12:49:09.746803 (+     4us) server_negotiation.cc:399] Waiting for connection header
0924 12:49:09.746933 (+   130us) negotiation.cc:327] Negotiation complete: Network error: Server connection negotiation failed: server connection from 127.0.0.1:55456: BlockingRecv error: recv got EOF from 127.0.0.1:55456 (error 108)
Metrics: {"server-negotiator.queue_time_us":48}
[       OK ] Parameters/TestRpcSocketTxRxQueue.AcceptorRxQueueSizeMetric/0 (11 ms)
[----------] 1 test from Parameters/TestRpcSocketTxRxQueue (11 ms total)

[----------] Global test environment tear-down
[==========] 21 tests from 2 test suites ran. (52681 ms total)
[  PASSED  ] 20 tests.
[  FAILED  ] 1 test, listed below:
[  FAILED  ] Parameters/TestRpc.TestCallWithChainCertAndChainCA/SSL_UnixSocket, where GetParam() = (true, true)

 1 FAILED TEST