Diagnosed failure

Parameters/TestRpc.TestCallWithChainCertAndChainCA/SSL_TCP: /data0/somelongdirectorytoavoidrpathissues/src/kudu/src/kudu/rpc/rpc-test.cc:270: Failure
Failed
Bad status: Runtime error: could not verify certificate chain (error with cert: subject=CN = localhost, ST = sadfjas, C = AS, emailAddress = sdflkdsajf, O = lskdfjlsad, OU = sldfkja, issuer=C = AS, ST = ASDfkjdhf, L = lskdjf, O = saldfja, OU = skdjf, CN = localhost, emailAddress = sadjflkadsj): : certificate has expired
Google Test trace:
/data0/somelongdirectorytoavoidrpathissues/src/kudu/src/kudu/rpc/rpc-test.cc:267: Connecting to 0.0.0.0:41973
I20260924 07:12:12.946321  9086 test_util.cc:175] -----------------------------------------------
I20260924 07:12:12.946364  9086 test_util.cc:176] Had fatal failures, leaving test files at /tmp/dist-test-taskr6lJwz/test-tmp/rpc-test.5.Parameters_TestRpc.TestCallWithChainCertAndChainCA_SSL_TCP.1790233932886453-9086-0

Full log

Note: This is test shard 6 of 8.
[==========] Running 21 tests from 2 test suites.
[----------] Global test environment set-up.
[----------] 20 tests from Parameters/TestRpc
[ RUN      ] Parameters/TestRpc.TestMessengerCreateDestroy/SSL_TCP
WARNING: Logging before InitGoogleLogging() is written to STDERR
I20260924 07:12:12.914458  9086 rpc-test.cc:169] started messenger TestCreateDestroy
[       OK ] Parameters/TestRpc.TestMessengerCreateDestroy/SSL_TCP (26 ms)
[ RUN      ] Parameters/TestRpc.TestNegotiationDeadlock/SSL_TCP
I20260924 07:12:12.924008  9107 acceptor_pool.cc:254] collecting diagnostics on the listening RPC socket 0.0.0.0:44501 every 8 connection(s)
I20260924 07:12:12.924008  9106 acceptor_pool.cc:254] collecting diagnostics on the listening RPC socket 0.0.0.0:44501 every 8 connection(s)
[       OK ] Parameters/TestRpc.TestNegotiationDeadlock/SSL_TCP (15 ms)
[ RUN      ] Parameters/TestRpc.TestCallWithChainCertAndChainCA/SSL_TCP
I20260924 07:12:12.942965  9122 acceptor_pool.cc:254] collecting diagnostics on the listening RPC socket 0.0.0.0:41973 every 8 connection(s)
I20260924 07:12:12.942991  9123 acceptor_pool.cc:254] collecting diagnostics on the listening RPC socket 0.0.0.0:41973 every 8 connection(s)
/data0/somelongdirectorytoavoidrpathissues/src/kudu/src/kudu/rpc/rpc-test.cc:270: Failure
Failed
Bad status: Runtime error: could not verify certificate chain (error with cert: subject=CN = localhost, ST = sadfjas, C = AS, emailAddress = sdflkdsajf, O = lskdfjlsad, OU = sldfkja, issuer=C = AS, ST = ASDfkjdhf, L = lskdjf, O = saldfja, OU = skdjf, CN = localhost, emailAddress = sadjflkadsj): : certificate has expired
Google Test trace:
/data0/somelongdirectorytoavoidrpathissues/src/kudu/src/kudu/rpc/rpc-test.cc:267: Connecting to 0.0.0.0:41973
I20260924 07:12:12.946321  9086 test_util.cc:175] -----------------------------------------------
I20260924 07:12:12.946364  9086 test_util.cc:176] Had fatal failures, leaving test files at /tmp/dist-test-taskr6lJwz/test-tmp/rpc-test.5.Parameters_TestRpc.TestCallWithChainCertAndChainCA_SSL_TCP.1790233932886453-9086-0
[  FAILED  ] Parameters/TestRpc.TestCallWithChainCertAndChainCA/SSL_TCP, where GetParam() = (true, false) (15 ms)
[ RUN      ] Parameters/TestRpc.TestCallWithPasswordProtectedKey/SSL_TCP
I20260924 07:12:12.959049  9147 acceptor_pool.cc:254] collecting diagnostics on the listening RPC socket 0.0.0.0:35639 every 8 connection(s)
I20260924 07:12:12.959071  9148 acceptor_pool.cc:254] collecting diagnostics on the listening RPC socket 0.0.0.0:35639 every 8 connection(s)
[       OK ] Parameters/TestRpc.TestCallWithPasswordProtectedKey/SSL_TCP (24 ms)
[ RUN      ] Parameters/TestRpc.TestCallToBadServer/SSL_TCP
I20260924 07:12:12.977254  9086 rpc-test.cc:394] Status: Network error: Client connection negotiation failed: client connection to 0.0.0.0:0: connect: Connection refused (error 111)
I20260924 07:12:12.977488  9086 rpc-test.cc:394] Status: Network error: Client connection negotiation failed: client connection to 0.0.0.0:0: connect: Connection refused (error 111)
I20260924 07:12:12.977660  9086 rpc-test.cc:394] Status: Network error: Client connection negotiation failed: client connection to 0.0.0.0:0: connect: Connection refused (error 111)
I20260924 07:12:12.977844  9086 rpc-test.cc:394] Status: Network error: Client connection negotiation failed: client connection to 0.0.0.0:0: connect: Connection refused (error 111)
I20260924 07:12:12.978072  9086 rpc-test.cc:394] Status: Network error: Client connection negotiation failed: client connection to 0.0.0.0:0: connect: Connection refused (error 111)
[       OK ] Parameters/TestRpc.TestCallToBadServer/SSL_TCP (7 ms)
[ RUN      ] Parameters/TestRpc.TestWrongService/SSL_TCP
I20260924 07:12:13.016570  9182 acceptor_pool.cc:254] collecting diagnostics on the listening RPC socket 0.0.0.0:35447 every 8 connection(s)
I20260924 07:12:13.016572  9183 acceptor_pool.cc:254] collecting diagnostics on the listening RPC socket 0.0.0.0:35447 every 8 connection(s)
I20260924 07:12:13.036898  9179 messenger.cc:345] service WrongServiceName not registered on TestServer
[       OK ] Parameters/TestRpc.TestWrongService/SSL_TCP (59 ms)
[ RUN      ] Parameters/TestRpc.TestConnectionKeepalive/SSL_TCP
I20260924 07:12:13.075974  9205 acceptor_pool.cc:254] collecting diagnostics on the listening RPC socket 0.0.0.0:38455 every 8 connection(s)
I20260924 07:12:13.076023  9206 acceptor_pool.cc:254] collecting diagnostics on the listening RPC socket 0.0.0.0:38455 every 8 connection(s)
I20260924 07:12:13.076122  9086 rpc-test.cc:488] Connecting to 0.0.0.0:38455
[       OK ] Parameters/TestRpc.TestConnectionKeepalive/SSL_TCP (1058 ms)
[ RUN      ] Parameters/TestRpc.TestClientConnectionMetrics/SSL_TCP
I20260924 07:12:14.120098  9230 acceptor_pool.cc:254] collecting diagnostics on the listening RPC socket 0.0.0.0:45793 every 8 connection(s)
I20260924 07:12:14.120136  9231 acceptor_pool.cc:254] collecting diagnostics on the listening RPC socket 0.0.0.0:45793 every 8 connection(s)
I20260924 07:12:14.120236  9086 rpc-test.cc:569] Connecting to 0.0.0.0:45793
[       OK ] Parameters/TestRpc.TestClientConnectionMetrics/SSL_TCP (9704 ms)
[ RUN      ] Parameters/TestRpc.TestCredentialsPolicy/SSL_TCP
I20260924 07:12:23.847368  9253 acceptor_pool.cc:254] collecting diagnostics on the listening RPC socket 0.0.0.0:43001 every 8 connection(s)
I20260924 07:12:23.847422  9254 acceptor_pool.cc:254] collecting diagnostics on the listening RPC socket 0.0.0.0:43001 every 8 connection(s)
I20260924 07:12:23.847530  9086 rpc-test.cc:700] Connecting to 0.0.0.0:43001
[       OK ] Parameters/TestRpc.TestCredentialsPolicy/SSL_TCP (67 ms)
[ RUN      ] Parameters/TestRpc.TestCallLongerThanKeepalive/SSL_TCP
I20260924 07:12:23.890079  9278 acceptor_pool.cc:254] collecting diagnostics on the listening RPC socket 0.0.0.0:38711 every 8 connection(s)
I20260924 07:12:23.890110  9279 acceptor_pool.cc:254] collecting diagnostics on the listening RPC socket 0.0.0.0:38711 every 8 connection(s)
I20260924 07:12:23.902015  9282 rpc-test-base.h:222] got call: sleep_micros: 3000000 deferred: true
I20260924 07:12:26.902621  9282 rpcz_store.cc:275] Call kudu.rpc.GenericCalculatorService.Sleep from 127.0.0.1:37366 (request call id 0) took 3000 ms. Trace:
I20260924 07:12:26.902719  9282 rpcz_store.cc:276] 0924 07:12:23.901971 (+     0us) service_pool.cc:170] Inserting onto call queue
0924 07:12:23.902002 (+    31us) service_pool.cc:227] Handling call
0924 07:12:26.902607 (+3000605us) inbound_call.cc:173] Queueing success response
Metrics: {}
[       OK ] Parameters/TestRpc.TestCallLongerThanKeepalive/SSL_TCP (3034 ms)
[ RUN      ] Parameters/TestRpc.TestRpcSidecar/SSL_TCP
I20260924 07:12:26.920274  9303 acceptor_pool.cc:254] collecting diagnostics on the listening RPC socket 0.0.0.0:46657 every 8 connection(s)
I20260924 07:12:26.920287  9304 acceptor_pool.cc:254] collecting diagnostics on the listening RPC socket 0.0.0.0:46657 every 8 connection(s)
[       OK ] Parameters/TestRpc.TestRpcSidecar/SSL_TCP (59 ms)
[ RUN      ] Parameters/TestRpc.TestRpcSidecarLimits/SSL_TCP
I20260924 07:12:28.574080  9328 acceptor_pool.cc:254] collecting diagnostics on the listening RPC socket 0.0.0.0:44693 every 8 connection(s)
I20260924 07:12:28.574087  9329 acceptor_pool.cc:254] collecting diagnostics on the listening RPC socket 0.0.0.0:44693 every 8 connection(s)
W20260924 07:12:28.591624  9086 serialization.cc:72] Serialized kudu.rpc_test.PushStringsRequestPB (2147483654 bytes) is larger than the maximum configured RPC message size (52428800 bytes). Sending anyway, but peer may reject the data.
W20260924 07:12:28.594635  9327 connection.cc:535] server connection from 127.0.0.1:60818 recv error: Network error: RPC frame had a length of 2147483714, but we only support messages up to 52428800 bytes long.
W20260924 07:12:28.594687  9327 connection.cc:158] shutting down server connection from 127.0.0.1:60818 with pending inbound data: 4/2147483714 bytes received; last active 0 ns ago: status Network error: RPC frame had a length of 2147483714, but we only support messages up to 52428800 bytes long.
W20260924 07:12:28.594900  9341 connection.cc:196] Error closing socket: Network error: TlsSocket::Close: Connection reset by peer
I20260924 07:12:28.602967  9354 acceptor_pool.cc:254] collecting diagnostics on the listening RPC socket 0.0.0.0:45591 every 8 connection(s)
I20260924 07:12:28.603001  9353 acceptor_pool.cc:254] collecting diagnostics on the listening RPC socket 0.0.0.0:45591 every 8 connection(s)
W20260924 07:12:32.178880  9350 connection.cc:577] server connection from 127.0.0.1:37644: received bad data: 'Corruption: Invalid packet: message had a length of 2147483710, but we only support messages up to 2147483647 bytes
'
[       OK ] Parameters/TestRpc.TestRpcSidecarLimits/SSL_TCP (5216 ms)
[ RUN      ] Parameters/TestRpc.TestCallTimeoutDoesntAffectNegotiation/SSL_TCP
I20260924 07:12:32.191220  9378 acceptor_pool.cc:254] collecting diagnostics on the listening RPC socket 0.0.0.0:40249 every 8 connection(s)
I20260924 07:12:32.191255  9379 acceptor_pool.cc:254] collecting diagnostics on the listening RPC socket 0.0.0.0:40249 every 8 connection(s)
W20260924 07:12:32.213378  9374 negotiation.cc:266] Injecting 500ms delay in negotiation
I20260924 07:12:32.263594  9086 rpc-test-base.h:595] status: Timed out: connection negotiation to 0.0.0.0:40249 for RPC Sleep timed out after 0.050s (ON_OUTBOUND_QUEUE), seconds elapsed: 0.0505359
[       OK ] Parameters/TestRpc.TestCallTimeoutDoesntAffectNegotiation/SSL_TCP (537 ms)
[ RUN      ] Parameters/TestRpc.TestRpcHandlerLatencyMetric/SSL_TCP
I20260924 07:12:32.724637  9403 acceptor_pool.cc:254] collecting diagnostics on the listening RPC socket 0.0.0.0:37987 every 8 connection(s)
I20260924 07:12:32.724687  9404 acceptor_pool.cc:254] collecting diagnostics on the listening RPC socket 0.0.0.0:37987 every 8 connection(s)
I20260924 07:12:32.765793  9086 rpc-test.cc:1236] Sleep() min lat: 20249
I20260924 07:12:32.765892  9086 rpc-test.cc:1237] Sleep() mean lat: 20249
I20260924 07:12:32.765918  9086 rpc-test.cc:1238] Sleep() max lat: 20249
I20260924 07:12:32.765929  9086 rpc-test.cc:1239] Sleep() #calls: 1
[       OK ] Parameters/TestRpc.TestRpcHandlerLatencyMetric/SSL_TCP (49 ms)
[ RUN      ] Parameters/TestRpc.TimedOutOnResponseMetricServiceQueue/SSL_TCP
I20260924 07:12:32.778326  9429 acceptor_pool.cc:254] collecting diagnostics on the listening RPC socket 0.0.0.0:40827 every 8 connection(s)
I20260924 07:12:32.778368  9430 acceptor_pool.cc:254] collecting diagnostics on the listening RPC socket 0.0.0.0:40827 every 8 connection(s)
W20260924 07:12:32.843255  9431 rpcz_store.cc:267] Call kudu.rpc_test.CalculatorService.Sleep from 127.0.0.1:42836 (request call id 2) took 20 ms (client timeout 20 ms). Trace:
W20260924 07:12:32.843358  9431 rpcz_store.cc:269] 0924 07:12:32.823035 (+     0us) service_pool.cc:170] Inserting onto call queue
0924 07:12:32.843230 (+ 20195us) service_pool.cc:214] Skipping call since client already timed out
0924 07:12:32.843240 (+    10us) inbound_call.cc:173] Queueing failure response
Metrics: {}
[       OK ] Parameters/TestRpc.TimedOutOnResponseMetricServiceQueue/SSL_TCP (77 ms)
[ RUN      ] Parameters/TestRpc.RpcPendingConnectionsMetric/SSL_TCP
I20260924 07:12:32.846228  9452 acceptor_pool.cc:254] collecting diagnostics on the listening RPC socket 0.0.0.0:32835 every 8 connection(s)
I20260924 07:12:32.846275  9453 acceptor_pool.cc:254] collecting diagnostics on the listening RPC socket 0.0.0.0:32835 every 8 connection(s)
W20260924 07:12:32.846776  9448 negotiation.cc:337] Failed RPC negotiation. Trace:
0924 07:12:32.846611 (+     0us) reactor.cc:625] Submitting negotiation task for server connection from 127.0.0.1:55306 (local address 127.0.0.1:32835)
0924 07:12:32.846662 (+    51us) server_negotiation.cc:206] Beginning negotiation
0924 07:12:32.846664 (+     2us) server_negotiation.cc:399] Waiting for connection header
0924 07:12:32.846728 (+    64us) negotiation.cc:327] Negotiation complete: Network error: Server connection negotiation failed: server connection from 127.0.0.1:55306: BlockingRecv error: recv got EOF from 127.0.0.1:55306 (error 108)
Metrics: {"server-negotiator.queue_time_us":25}
[       OK ] Parameters/TestRpc.RpcPendingConnectionsMetric/SSL_TCP (12 ms)
[ RUN      ] Parameters/TestRpc.TestRpcContextClientDeadline/SSL_TCP
I20260924 07:12:32.905174  9468 acceptor_pool.cc:254] collecting diagnostics on the listening RPC socket 0.0.0.0:42205 every 8 connection(s)
I20260924 07:12:32.905197  9469 acceptor_pool.cc:254] collecting diagnostics on the listening RPC socket 0.0.0.0:42205 every 8 connection(s)
[       OK ] Parameters/TestRpc.TestRpcContextClientDeadline/SSL_TCP (82 ms)
[ RUN      ] Parameters/TestRpc.TestApplicationFeatureFlagUnsupportedServer/SSL_TCP
I20260924 07:12:32.947090  9493 acceptor_pool.cc:254] collecting diagnostics on the listening RPC socket 0.0.0.0:40597 every 8 connection(s)
I20260924 07:12:32.947119  9494 acceptor_pool.cc:254] collecting diagnostics on the listening RPC socket 0.0.0.0:40597 every 8 connection(s)
[       OK ] Parameters/TestRpc.TestApplicationFeatureFlagUnsupportedServer/SSL_TCP (25 ms)
[ RUN      ] Parameters/TestRpc.TestCancellationAsync/SSL_TCP
I20260924 07:12:32.984162  9518 acceptor_pool.cc:254] collecting diagnostics on the listening RPC socket 0.0.0.0:36245 every 8 connection(s)
I20260924 07:12:32.984205  9519 acceptor_pool.cc:254] collecting diagnostics on the listening RPC socket 0.0.0.0:36245 every 8 connection(s)
I20260924 07:12:32.984319  9086 rpc-test.cc:1716] Connecting to 0.0.0.0:36245
I20260924 07:12:32.998936  9086 test_util.cc:268] Using random seed: 1389712918
I20260924 07:12:33.016664  9522 rpc-test-base.h:240] got call: sleep_micros: 500 pattern: 4294967295 num_repetitions: 2097152 sidecar_idx: 0
I20260924 07:12:33.030721  9522 rpc-test-base.h:240] got call: sleep_micros: 500 pattern: 4294967295 num_repetitions: 2097152 sidecar_idx: 0
I20260924 07:12:33.046873  9522 rpc-test-base.h:240] got call: sleep_micros: 500 pattern: 4294967295 num_repetitions: 2097152 sidecar_idx: 0
I20260924 07:12:33.063292  9522 rpc-test-base.h:240] got call: sleep_micros: 500 pattern: 4294967295 num_repetitions: 2097152 sidecar_idx: 0
I20260924 07:12:33.078944  9522 rpc-test-base.h:240] got call: sleep_micros: 500 pattern: 4294967295 num_repetitions: 2097152 sidecar_idx: 0
I20260924 07:12:33.092610  9522 rpc-test-base.h:240] got call: sleep_micros: 500 pattern: 4294967295 num_repetitions: 2097152 sidecar_idx: 0
I20260924 07:12:33.107700  9522 rpc-test-base.h:240] got call: sleep_micros: 500 pattern: 4294967295 num_repetitions: 2097152 sidecar_idx: 0
I20260924 07:12:33.118589  9522 rpc-test-base.h:240] got call: sleep_micros: 500 pattern: 4294967295 num_repetitions: 2097152 sidecar_idx: 0
W20260924 07:12:33.121510  9515 connection.cc:441] server connection from 127.0.0.1:42404 torn down before Call kudu.rpc.GenericCalculatorService.SleepWithSidecar from 127.0.0.1:42404 (request call id 9) could send its response
[       OK ] Parameters/TestRpc.TestCancellationAsync/SSL_TCP (156 ms)
[ RUN      ] Parameters/TestRpc.TestPerformanceBySocketType/SSL_TCP
I20260924 07:12:33.144649  9543 acceptor_pool.cc:254] collecting diagnostics on the listening RPC socket 0.0.0.0:42981 every 8 connection(s)
I20260924 07:12:33.144673  9544 acceptor_pool.cc:254] collecting diagnostics on the listening RPC socket 0.0.0.0:42981 every 8 connection(s)
I20260924 07:12:33.144788  9086 rpc-test.cc:1846] Connecting to 0.0.0.0:42981
I20260924 07:12:34.694608  9086 rpc-test.cc:1859] Sending 1024MB via ssl-enabled tcp socket: real 1.539s	user 1.436s	sys 1.291s
I20260924 07:12:36.193116  9086 rpc-test.cc:1859] Sending 1024MB via ssl-enabled tcp socket: real 1.498s	user 1.371s	sys 1.298s
I20260924 07:12:37.750133  9086 rpc-test.cc:1859] Sending 1024MB via ssl-enabled tcp socket: real 1.557s	user 1.447s	sys 1.328s
I20260924 07:12:39.234366  9086 rpc-test.cc:1859] Sending 1024MB via ssl-enabled tcp socket: real 1.484s	user 1.363s	sys 1.263s
I20260924 07:12:40.716223  9086 rpc-test.cc:1859] Sending 1024MB via ssl-enabled tcp socket: real 1.482s	user 1.399s	sys 1.239s
[       OK ] Parameters/TestRpc.TestPerformanceBySocketType/SSL_TCP (7595 ms)
[----------] 20 tests from Parameters/TestRpc (27829 ms total)

[----------] 1 test from Parameters/TestRpcSocketTxRxQueue
[ RUN      ] Parameters/TestRpcSocketTxRxQueue.OverCapacity/0
W20260924 07:12:40.984021  9569 negotiation.cc:337] Failed RPC negotiation. Trace:
0924 07:12:40.723362 (+     0us) reactor.cc:625] Submitting negotiation task for client connection to 0.0.0.0:43053 (local address 127.0.0.1:60496)
0924 07:12:40.723415 (+    53us) negotiation.cc:107] Waiting for socket to connect
0924 07:12:40.723424 (+     9us) client_negotiation.cc:174] Beginning negotiation
0924 07:12:40.723466 (+    42us) client_negotiation.cc:252] Sending NEGOTIATE NegotiatePB request
0924 07:12:40.983928 (+260462us) negotiation.cc:327] Negotiation complete: Network error: Client connection negotiation failed: client connection to 0.0.0.0:43053: BlockingRecv error: recv error from unknown peer: Transport endpoint is not connected (error 107)
Metrics: {"client-negotiator.queue_time_us":30}
W20260924 07:12:40.984149  9605 negotiation.cc:337] Failed RPC negotiation. Trace:
0924 07:12:40.726451 (+     0us) reactor.cc:625] Submitting negotiation task for client connection to 0.0.0.0:43053 (local address 127.0.0.1:60540)
0924 07:12:40.726505 (+    54us) negotiation.cc:107] Waiting for socket to connect
0924 07:12:40.726514 (+     9us) client_negotiation.cc:174] Beginning negotiation
0924 07:12:40.726552 (+    38us) client_negotiation.cc:252] Sending NEGOTIATE NegotiatePB request
0924 07:12:40.984114 (+257562us) negotiation.cc:327] Negotiation complete: Network error: Client connection negotiation failed: client connection to 0.0.0.0:43053: BlockingRecv error: recv error from unknown peer: Transport endpoint is not connected (error 107)
Metrics: {"client-negotiator.queue_time_us":33}
W20260924 07:12:40.984084  9578 negotiation.cc:337] Failed RPC negotiation. Trace:
0924 07:12:40.724183 (+     0us) reactor.cc:625] Submitting negotiation task for client connection to 0.0.0.0:43053 (local address 127.0.0.1:60502)
0924 07:12:40.724219 (+    36us) negotiation.cc:107] Waiting for socket to connect
0924 07:12:40.724228 (+     9us) client_negotiation.cc:174] Beginning negotiation
0924 07:12:40.724270 (+    42us) client_negotiation.cc:252] Sending NEGOTIATE NegotiatePB request
0924 07:12:40.983910 (+259640us) negotiation.cc:327] Negotiation complete: Network error: Client connection negotiation failed: client connection to 0.0.0.0:43053: BlockingRecv error: recv error from unknown peer: Transport endpoint is not connected (error 107)
Metrics: {"client-negotiator.queue_time_us":16}
W20260924 07:12:40.984032  9559 negotiation.cc:337] Failed RPC negotiation. Trace:
0924 07:12:40.722577 (+     0us) reactor.cc:625] Submitting negotiation task for client connection to 0.0.0.0:43053 (local address 127.0.0.1:60494)
0924 07:12:40.722614 (+    37us) negotiation.cc:107] Waiting for socket to connect
0924 07:12:40.722622 (+     8us) client_negotiation.cc:174] Beginning negotiation
0924 07:12:40.722661 (+    39us) client_negotiation.cc:252] Sending NEGOTIATE NegotiatePB request
0924 07:12:40.983910 (+261249us) negotiation.cc:327] Negotiation complete: Network error: Client connection negotiation failed: client connection to 0.0.0.0:43053: BlockingRecv error: recv error from unknown peer: Transport endpoint is not connected (error 107)
Metrics: {"client-negotiator.queue_time_us":18}
W20260924 07:12:40.984035  9596 negotiation.cc:337] Failed RPC negotiation. Trace:
0924 07:12:40.725686 (+     0us) reactor.cc:625] Submitting negotiation task for client connection to 0.0.0.0:43053 (local address 127.0.0.1:60530)
0924 07:12:40.725741 (+    55us) negotiation.cc:107] Waiting for socket to connect
0924 07:12:40.725750 (+     9us) client_negotiation.cc:174] Beginning negotiation
0924 07:12:40.725787 (+    37us) client_negotiation.cc:252] Sending NEGOTIATE NegotiatePB request
0924 07:12:40.983972 (+258185us) negotiation.cc:327] Negotiation complete: Network error: Client connection negotiation failed: client connection to 0.0.0.0:43053: BlockingRecv error: recv error from unknown peer: Transport endpoint is not connected (error 107)
Metrics: {"client-negotiator.queue_time_us":34}
W20260924 07:12:40.984398  9587 negotiation.cc:337] Failed RPC negotiation. Trace:
0924 07:12:40.724945 (+     0us) reactor.cc:625] Submitting negotiation task for client connection to 0.0.0.0:43053 (local address 127.0.0.1:60514)
0924 07:12:40.725002 (+    57us) negotiation.cc:107] Waiting for socket to connect
0924 07:12:40.725011 (+     9us) client_negotiation.cc:174] Beginning negotiation
0924 07:12:40.725051 (+    40us) client_negotiation.cc:252] Sending NEGOTIATE NegotiatePB request
0924 07:12:40.983908 (+258857us) negotiation.cc:327] Negotiation complete: Network error: Client connection negotiation failed: client connection to 0.0.0.0:43053: BlockingRecv error: recv error from unknown peer: Transport endpoint is not connected (error 107)
Metrics: {"client-negotiator.queue_time_us":35}
[       OK ] Parameters/TestRpcSocketTxRxQueue.OverCapacity/0 (1024 ms)
[----------] 1 test from Parameters/TestRpcSocketTxRxQueue (1024 ms total)

[----------] Global test environment tear-down
[==========] 21 tests from 2 test suites ran. (28854 ms total)
[  PASSED  ] 20 tests.
[  FAILED  ] 1 test, listed below:
[  FAILED  ] Parameters/TestRpc.TestCallWithChainCertAndChainCA/SSL_TCP, where GetParam() = (true, false)

 1 FAILED TEST