Diagnosed failure

Parameters/TestRpc.TestCallWithChainCertAndChainCA/SSL_TCP: /data0/somelongdirectorytoavoidrpathissues/src/kudu/src/kudu/rpc/rpc-test.cc:270: Failure
Failed
Bad status: Runtime error: could not verify certificate chain (error with cert: subject=CN = localhost, ST = sadfjas, C = AS, emailAddress = sdflkdsajf, O = lskdfjlsad, OU = sldfkja, issuer=C = AS, ST = ASDfkjdhf, L = lskdjf, O = saldfja, OU = skdjf, CN = localhost, emailAddress = sadjflkadsj): : certificate has expired
Google Test trace:
/data0/somelongdirectorytoavoidrpathissues/src/kudu/src/kudu/rpc/rpc-test.cc:267: Connecting to 0.0.0.0:34699
I20260925 03:11:13.146934   417 test_util.cc:175] -----------------------------------------------
I20260925 03:11:13.147143   417 test_util.cc:176] Had fatal failures, leaving test files at /tmp/dist-test-taskbTaTPC/test-tmp/rpc-test.5.Parameters_TestRpc.TestCallWithChainCertAndChainCA_SSL_TCP.1790305871746034-417-0

Full log

Note: This is test shard 6 of 8.
[==========] Running 21 tests from 2 test suites.
[----------] Global test environment set-up.
[----------] 20 tests from Parameters/TestRpc
[ RUN      ] Parameters/TestRpc.TestMessengerCreateDestroy/SSL_TCP
WARNING: Logging before InitGoogleLogging() is written to STDERR
I20260925 03:11:11.862919   417 rpc-test.cc:169] started messenger TestCreateDestroy
[       OK ] Parameters/TestRpc.TestMessengerCreateDestroy/SSL_TCP (1187 ms)
[ RUN      ] Parameters/TestRpc.TestNegotiationDeadlock/SSL_TCP
I20260925 03:11:13.018592   439 acceptor_pool.cc:254] collecting diagnostics on the listening RPC socket 0.0.0.0:44129 every 8 connection(s)
I20260925 03:11:13.020630   440 acceptor_pool.cc:254] collecting diagnostics on the listening RPC socket 0.0.0.0:44129 every 8 connection(s)
[       OK ] Parameters/TestRpc.TestNegotiationDeadlock/SSL_TCP (91 ms)
[ RUN      ] Parameters/TestRpc.TestCallWithChainCertAndChainCA/SSL_TCP
I20260925 03:11:13.114634   456 acceptor_pool.cc:254] collecting diagnostics on the listening RPC socket 0.0.0.0:34699 every 8 connection(s)
I20260925 03:11:13.116794   457 acceptor_pool.cc:254] collecting diagnostics on the listening RPC socket 0.0.0.0:34699 every 8 connection(s)
/data0/somelongdirectorytoavoidrpathissues/src/kudu/src/kudu/rpc/rpc-test.cc:270: Failure
Failed
Bad status: Runtime error: could not verify certificate chain (error with cert: subject=CN = localhost, ST = sadfjas, C = AS, emailAddress = sdflkdsajf, O = lskdfjlsad, OU = sldfkja, issuer=C = AS, ST = ASDfkjdhf, L = lskdjf, O = saldfja, OU = skdjf, CN = localhost, emailAddress = sadjflkadsj): : certificate has expired
Google Test trace:
/data0/somelongdirectorytoavoidrpathissues/src/kudu/src/kudu/rpc/rpc-test.cc:267: Connecting to 0.0.0.0:34699
I20260925 03:11:13.146934   417 test_util.cc:175] -----------------------------------------------
I20260925 03:11:13.147143   417 test_util.cc:176] Had fatal failures, leaving test files at /tmp/dist-test-taskbTaTPC/test-tmp/rpc-test.5.Parameters_TestRpc.TestCallWithChainCertAndChainCA_SSL_TCP.1790305871746034-417-0
[  FAILED  ] Parameters/TestRpc.TestCallWithChainCertAndChainCA/SSL_TCP, where GetParam() = (true, false) (66 ms)
[ RUN      ] Parameters/TestRpc.TestCallWithPasswordProtectedKey/SSL_TCP
I20260925 03:11:13.165966   481 acceptor_pool.cc:254] collecting diagnostics on the listening RPC socket 0.0.0.0:44947 every 8 connection(s)
I20260925 03:11:13.166541   482 acceptor_pool.cc:254] collecting diagnostics on the listening RPC socket 0.0.0.0:44947 every 8 connection(s)
[       OK ] Parameters/TestRpc.TestCallWithPasswordProtectedKey/SSL_TCP (72 ms)
[ RUN      ] Parameters/TestRpc.TestCallToBadServer/SSL_TCP
I20260925 03:11:13.253614   417 rpc-test.cc:394] Status: Network error: Client connection negotiation failed: client connection to 0.0.0.0:0: connect: Connection refused (error 111)
I20260925 03:11:13.255298   417 rpc-test.cc:394] Status: Network error: Client connection negotiation failed: client connection to 0.0.0.0:0: connect: Connection refused (error 111)
I20260925 03:11:13.256783   417 rpc-test.cc:394] Status: Network error: Client connection negotiation failed: client connection to 0.0.0.0:0: connect: Connection refused (error 111)
I20260925 03:11:13.258340   417 rpc-test.cc:394] Status: Network error: Client connection negotiation failed: client connection to 0.0.0.0:0: connect: Connection refused (error 111)
I20260925 03:11:13.259912   417 rpc-test.cc:394] Status: Network error: Client connection negotiation failed: client connection to 0.0.0.0:0: connect: Connection refused (error 111)
[       OK ] Parameters/TestRpc.TestCallToBadServer/SSL_TCP (42 ms)
[ RUN      ] Parameters/TestRpc.TestWrongService/SSL_TCP
I20260925 03:11:13.307096   516 acceptor_pool.cc:254] collecting diagnostics on the listening RPC socket 0.0.0.0:37489 every 8 connection(s)
I20260925 03:11:13.307894   517 acceptor_pool.cc:254] collecting diagnostics on the listening RPC socket 0.0.0.0:37489 every 8 connection(s)
I20260925 03:11:13.344720   514 messenger.cc:345] service WrongServiceName not registered on TestServer
[       OK ] Parameters/TestRpc.TestWrongService/SSL_TCP (90 ms)
[ RUN      ] Parameters/TestRpc.TestConnectionKeepalive/SSL_TCP
I20260925 03:11:13.373721   539 acceptor_pool.cc:254] collecting diagnostics on the listening RPC socket 0.0.0.0:46015 every 8 connection(s)
I20260925 03:11:13.374512   540 acceptor_pool.cc:254] collecting diagnostics on the listening RPC socket 0.0.0.0:46015 every 8 connection(s)
I20260925 03:11:13.377816   417 rpc-test.cc:488] Connecting to 0.0.0.0:46015
[       OK ] Parameters/TestRpc.TestConnectionKeepalive/SSL_TCP (1070 ms)
[ RUN      ] Parameters/TestRpc.TestClientConnectionMetrics/SSL_TCP
I20260925 03:11:14.457270   564 acceptor_pool.cc:254] collecting diagnostics on the listening RPC socket 0.0.0.0:33059 every 8 connection(s)
I20260925 03:11:14.458041   565 acceptor_pool.cc:254] collecting diagnostics on the listening RPC socket 0.0.0.0:33059 every 8 connection(s)
I20260925 03:11:14.461239   417 rpc-test.cc:569] Connecting to 0.0.0.0:33059
[       OK ] Parameters/TestRpc.TestClientConnectionMetrics/SSL_TCP (115645 ms)
[ RUN      ] Parameters/TestRpc.TestCredentialsPolicy/SSL_TCP
I20260925 03:13:10.094211   598 acceptor_pool.cc:254] collecting diagnostics on the listening RPC socket 0.0.0.0:36981 every 8 connection(s)
I20260925 03:13:10.095335   599 acceptor_pool.cc:254] collecting diagnostics on the listening RPC socket 0.0.0.0:36981 every 8 connection(s)
I20260925 03:13:10.098838   417 rpc-test.cc:700] Connecting to 0.0.0.0:36981
[       OK ] Parameters/TestRpc.TestCredentialsPolicy/SSL_TCP (81 ms)
[ RUN      ] Parameters/TestRpc.TestCallLongerThanKeepalive/SSL_TCP
I20260925 03:13:10.168146   623 acceptor_pool.cc:254] collecting diagnostics on the listening RPC socket 0.0.0.0:34407 every 8 connection(s)
I20260925 03:13:10.168900   624 acceptor_pool.cc:254] collecting diagnostics on the listening RPC socket 0.0.0.0:34407 every 8 connection(s)
I20260925 03:13:10.196250   628 rpc-test-base.h:222] got call: sleep_micros: 3000000 deferred: true
I20260925 03:13:13.200969   628 rpcz_store.cc:275] Call kudu.rpc.GenericCalculatorService.Sleep from 127.0.0.1:60892 (request call id 0) took 3004 ms. Trace:
I20260925 03:13:13.201422   628 rpcz_store.cc:276] 0925 03:13:10.195989 (+     0us) service_pool.cc:170] Inserting onto call queue
0925 03:13:10.196108 (+   119us) service_pool.cc:227] Handling call
0925 03:13:13.200793 (+3004685us) inbound_call.cc:173] Queueing success response
Metrics: {}
[       OK ] Parameters/TestRpc.TestCallLongerThanKeepalive/SSL_TCP (3063 ms)
[ RUN      ] Parameters/TestRpc.TestRpcSidecar/SSL_TCP
I20260925 03:13:13.241425   650 acceptor_pool.cc:254] collecting diagnostics on the listening RPC socket 0.0.0.0:38329 every 8 connection(s)
I20260925 03:13:13.242242   651 acceptor_pool.cc:254] collecting diagnostics on the listening RPC socket 0.0.0.0:38329 every 8 connection(s)
[       OK ] Parameters/TestRpc.TestRpcSidecar/SSL_TCP (542 ms)
[ RUN      ] Parameters/TestRpc.TestRpcSidecarLimits/SSL_TCP
I20260925 03:13:34.670178   677 acceptor_pool.cc:254] collecting diagnostics on the listening RPC socket 0.0.0.0:37735 every 8 connection(s)
I20260925 03:13:34.670897   678 acceptor_pool.cc:254] collecting diagnostics on the listening RPC socket 0.0.0.0:37735 every 8 connection(s)
W20260925 03:13:34.697152   417 serialization.cc:72] Serialized kudu.rpc_test.PushStringsRequestPB (2147483654 bytes) is larger than the maximum configured RPC message size (52428800 bytes). Sending anyway, but peer may reject the data.
W20260925 03:13:34.707661   676 connection.cc:535] server connection from 127.0.0.1:42202 recv error: Network error: RPC frame had a length of 2147483714, but we only support messages up to 52428800 bytes long.
W20260925 03:13:34.707973   676 connection.cc:158] shutting down server connection from 127.0.0.1:42202 with pending inbound data: 4/2147483714 bytes received; last active 0 ns ago: status Network error: RPC frame had a length of 2147483714, but we only support messages up to 52428800 bytes long.
W20260925 03:13:34.708740   690 connection.cc:698] client connection to 0.0.0.0:37735 send error: Network error: failed to write to TLS socket: Connection reset by peer
W20260925 03:13:34.709316   690 connection.cc:196] Error closing socket: Network error: TlsSocket::Close: Success
[       OK ] Parameters/TestRpc.TestRpcSidecarLimits/SSL_TCP (21575 ms)
[ RUN      ] Parameters/TestRpc.TestCallTimeoutDoesntAffectNegotiation/SSL_TCP
I20260925 03:13:35.354512   702 acceptor_pool.cc:254] collecting diagnostics on the listening RPC socket 0.0.0.0:46789 every 8 connection(s)
I20260925 03:13:35.355201   703 acceptor_pool.cc:254] collecting diagnostics on the listening RPC socket 0.0.0.0:46789 every 8 connection(s)
W20260925 03:13:35.385839   698 negotiation.cc:266] Injecting 500ms delay in negotiation
I20260925 03:13:35.436187   417 rpc-test-base.h:595] status: Timed out: connection negotiation to 0.0.0.0:46789 for RPC Sleep timed out after 0.050s (ON_OUTBOUND_QUEUE), seconds elapsed: 0.0513904
[       OK ] Parameters/TestRpc.TestCallTimeoutDoesntAffectNegotiation/SSL_TCP (569 ms)
[ RUN      ] Parameters/TestRpc.TestRpcHandlerLatencyMetric/SSL_TCP
I20260925 03:13:35.918848   727 acceptor_pool.cc:254] collecting diagnostics on the listening RPC socket 0.0.0.0:35283 every 8 connection(s)
I20260925 03:13:35.919509   728 acceptor_pool.cc:254] collecting diagnostics on the listening RPC socket 0.0.0.0:35283 every 8 connection(s)
I20260925 03:13:35.976567   417 rpc-test.cc:1236] Sleep() min lat: 21674
I20260925 03:13:35.976781   417 rpc-test.cc:1237] Sleep() mean lat: 21674
I20260925 03:13:35.976951   417 rpc-test.cc:1238] Sleep() max lat: 21674
I20260925 03:13:35.977100   417 rpc-test.cc:1239] Sleep() #calls: 1
[       OK ] Parameters/TestRpc.TestRpcHandlerLatencyMetric/SSL_TCP (80 ms)
[ RUN      ] Parameters/TestRpc.TimedOutOnResponseMetricServiceQueue/SSL_TCP
I20260925 03:13:36.021364   753 acceptor_pool.cc:254] collecting diagnostics on the listening RPC socket 0.0.0.0:45297 every 8 connection(s)
I20260925 03:13:36.022094   754 acceptor_pool.cc:254] collecting diagnostics on the listening RPC socket 0.0.0.0:45297 every 8 connection(s)
W20260925 03:13:36.118372   755 rpcz_store.cc:267] Call kudu.rpc_test.CalculatorService.Sleep from 127.0.0.1:34928 (request call id 2) took 20 ms (client timeout 20 ms). Trace:
W20260925 03:13:36.118726   755 rpcz_store.cc:269] 0925 03:13:36.097729 (+     0us) service_pool.cc:170] Inserting onto call queue
0925 03:13:36.118135 (+ 20406us) service_pool.cc:214] Skipping call since client already timed out
0925 03:13:36.118227 (+    92us) inbound_call.cc:173] Queueing failure response
Metrics: {}
[       OK ] Parameters/TestRpc.TimedOutOnResponseMetricServiceQueue/SSL_TCP (140 ms)
[ RUN      ] Parameters/TestRpc.RpcPendingConnectionsMetric/SSL_TCP
I20260925 03:13:36.135353   776 acceptor_pool.cc:254] collecting diagnostics on the listening RPC socket 0.0.0.0:41189 every 8 connection(s)
I20260925 03:13:36.136041   777 acceptor_pool.cc:254] collecting diagnostics on the listening RPC socket 0.0.0.0:41189 every 8 connection(s)
W20260925 03:13:36.141218   772 negotiation.cc:337] Failed RPC negotiation. Trace:
0925 03:13:36.139951 (+     0us) reactor.cc:625] Submitting negotiation task for server connection from 127.0.0.1:45514 (local address 127.0.0.1:41189)
0925 03:13:36.140382 (+   431us) server_negotiation.cc:206] Beginning negotiation
0925 03:13:36.140400 (+    18us) server_negotiation.cc:399] Waiting for connection header
0925 03:13:36.140648 (+   248us) negotiation.cc:327] Negotiation complete: Network error: Server connection negotiation failed: server connection from 127.0.0.1:45514: BlockingRecv error: recv got EOF from 127.0.0.1:45514 (error 108)
Metrics: {"server-negotiator.queue_time_us":119}
[       OK ] Parameters/TestRpc.RpcPendingConnectionsMetric/SSL_TCP (29 ms)
[ RUN      ] Parameters/TestRpc.TestRpcContextClientDeadline/SSL_TCP
I20260925 03:13:36.180868   792 acceptor_pool.cc:254] collecting diagnostics on the listening RPC socket 0.0.0.0:40833 every 8 connection(s)
I20260925 03:13:36.181591   793 acceptor_pool.cc:254] collecting diagnostics on the listening RPC socket 0.0.0.0:40833 every 8 connection(s)
[       OK ] Parameters/TestRpc.TestRpcContextClientDeadline/SSL_TCP (86 ms)
[ RUN      ] Parameters/TestRpc.TestApplicationFeatureFlagUnsupportedServer/SSL_TCP
I20260925 03:13:36.265898   817 acceptor_pool.cc:254] collecting diagnostics on the listening RPC socket 0.0.0.0:41981 every 8 connection(s)
I20260925 03:13:36.266686   818 acceptor_pool.cc:254] collecting diagnostics on the listening RPC socket 0.0.0.0:41981 every 8 connection(s)
[       OK ] Parameters/TestRpc.TestApplicationFeatureFlagUnsupportedServer/SSL_TCP (63 ms)
[ RUN      ] Parameters/TestRpc.TestCancellationAsync/SSL_TCP
I20260925 03:13:36.325477   842 acceptor_pool.cc:254] collecting diagnostics on the listening RPC socket 0.0.0.0:34483 every 8 connection(s)
I20260925 03:13:36.326237   843 acceptor_pool.cc:254] collecting diagnostics on the listening RPC socket 0.0.0.0:34483 every 8 connection(s)
I20260925 03:13:36.329404   417 rpc-test.cc:1716] Connecting to 0.0.0.0:34483
I20260925 03:13:36.344635   417 test_util.cc:268] Using random seed: 438614565
I20260925 03:13:36.583170   846 rpc-test-base.h:240] got call: sleep_micros: 500 pattern: 4294967295 num_repetitions: 2097152 sidecar_idx: 0
I20260925 03:13:36.743503   845 rpc-test-base.h:240] got call: sleep_micros: 500 pattern: 4294967295 num_repetitions: 2097152 sidecar_idx: 0
I20260925 03:13:36.930598   846 rpc-test-base.h:240] got call: sleep_micros: 500 pattern: 4294967295 num_repetitions: 2097152 sidecar_idx: 0
I20260925 03:13:37.105326   845 rpc-test-base.h:240] got call: sleep_micros: 500 pattern: 4294967295 num_repetitions: 2097152 sidecar_idx: 0
I20260925 03:13:37.293416   846 rpc-test-base.h:240] got call: sleep_micros: 500 pattern: 4294967295 num_repetitions: 2097152 sidecar_idx: 0
I20260925 03:13:37.479877   845 rpc-test-base.h:240] got call: sleep_micros: 500 pattern: 4294967295 num_repetitions: 2097152 sidecar_idx: 0
I20260925 03:13:37.655967   846 rpc-test-base.h:240] got call: sleep_micros: 500 pattern: 4294967295 num_repetitions: 2097152 sidecar_idx: 0
I20260925 03:13:37.836946   845 rpc-test-base.h:240] got call: sleep_micros: 500 pattern: 4294967295 num_repetitions: 2097152 sidecar_idx: 0
W20260925 03:13:37.998886   839 connection.cc:196] Error closing socket: Network error: TlsSocket::Close: Broken pipe
W20260925 03:13:38.033249   839 connection.cc:441] server connection from 127.0.0.1:59146 torn down before Call kudu.rpc.GenericCalculatorService.SleepWithSidecar from 127.0.0.1:59146 (request call id 8) could send its response
[       OK ] Parameters/TestRpc.TestCancellationAsync/SSL_TCP (1737 ms)
[ RUN      ] Parameters/TestRpc.TestPerformanceBySocketType/SSL_TCP
I20260925 03:13:38.140559   867 acceptor_pool.cc:254] collecting diagnostics on the listening RPC socket 0.0.0.0:38505 every 8 connection(s)
I20260925 03:13:38.141255   868 acceptor_pool.cc:254] collecting diagnostics on the listening RPC socket 0.0.0.0:38505 every 8 connection(s)
I20260925 03:13:38.144364   417 rpc-test.cc:1846] Connecting to 0.0.0.0:38505
I20260925 03:13:57.533149   417 rpc-test.cc:1859] Sending 1024MB via ssl-enabled tcp socket: real 19.375s	user 17.189s	sys 10.727s
I20260925 03:14:16.738047   417 rpc-test.cc:1859] Sending 1024MB via ssl-enabled tcp socket: real 19.204s	user 17.000s	sys 10.561s
I20260925 03:14:35.736773   417 rpc-test.cc:1859] Sending 1024MB via ssl-enabled tcp socket: real 18.998s	user 16.417s	sys 10.760s
I20260925 03:14:55.006417   417 rpc-test.cc:1859] Sending 1024MB via ssl-enabled tcp socket: real 19.269s	user 16.912s	sys 10.828s
I20260925 03:15:14.225481   417 rpc-test.cc:1859] Sending 1024MB via ssl-enabled tcp socket: real 19.219s	user 16.742s	sys 10.782s
[       OK ] Parameters/TestRpc.TestPerformanceBySocketType/SSL_TCP (96199 ms)
[----------] 20 tests from Parameters/TestRpc (242441 ms total)

[----------] 1 test from Parameters/TestRpcSocketTxRxQueue
[ RUN      ] Parameters/TestRpcSocketTxRxQueue.OverCapacity/0
W20260925 03:15:14.685752   894 negotiation.cc:337] Failed RPC negotiation. Trace:
0925 03:15:14.253153 (+     0us) reactor.cc:625] Submitting negotiation task for client connection to 0.0.0.0:41451 (local address 127.0.0.1:33602)
0925 03:15:14.253796 (+   643us) negotiation.cc:107] Waiting for socket to connect
0925 03:15:14.253853 (+    57us) client_negotiation.cc:174] Beginning negotiation
0925 03:15:14.254389 (+   536us) client_negotiation.cc:252] Sending NEGOTIATE NegotiatePB request
0925 03:15:14.684498 (+430109us) negotiation.cc:327] Negotiation complete: Network error: Client connection negotiation failed: client connection to 0.0.0.0:41451: BlockingRecv error: recv error from unknown peer: Transport endpoint is not connected (error 107)
Metrics: {"client-negotiator.queue_time_us":124}
W20260925 03:15:14.685948   930 negotiation.cc:337] Failed RPC negotiation. Trace:
0925 03:15:14.292759 (+     0us) reactor.cc:625] Submitting negotiation task for client connection to 0.0.0.0:41451 (local address 127.0.0.1:33656)
0925 03:15:14.293301 (+   542us) negotiation.cc:107] Waiting for socket to connect
0925 03:15:14.293332 (+    31us) client_negotiation.cc:174] Beginning negotiation
0925 03:15:14.293535 (+   203us) client_negotiation.cc:252] Sending NEGOTIATE NegotiatePB request
0925 03:15:14.684851 (+391316us) negotiation.cc:327] Negotiation complete: Network error: Client connection negotiation failed: client connection to 0.0.0.0:41451: BlockingRecv error: recv error from unknown peer: Transport endpoint is not connected (error 107)
Metrics: {"client-negotiator.queue_time_us":148}
W20260925 03:15:14.685806   903 negotiation.cc:337] Failed RPC negotiation. Trace:
0925 03:15:14.260112 (+     0us) reactor.cc:625] Submitting negotiation task for client connection to 0.0.0.0:41451 (local address 127.0.0.1:33618)
0925 03:15:14.260816 (+   704us) negotiation.cc:107] Waiting for socket to connect
0925 03:15:14.260858 (+    42us) client_negotiation.cc:174] Beginning negotiation
0925 03:15:14.261091 (+   233us) client_negotiation.cc:252] Sending NEGOTIATE NegotiatePB request
0925 03:15:14.684504 (+423413us) negotiation.cc:327] Negotiation complete: Network error: Client connection negotiation failed: client connection to 0.0.0.0:41451: BlockingRecv error: recv error from unknown peer: Transport endpoint is not connected (error 107)
Metrics: {"client-negotiator.queue_time_us":181}
W20260925 03:15:14.685806   921 negotiation.cc:337] Failed RPC negotiation. Trace:
0925 03:15:14.280334 (+     0us) reactor.cc:625] Submitting negotiation task for client connection to 0.0.0.0:41451 (local address 127.0.0.1:33650)
0925 03:15:14.280873 (+   539us) negotiation.cc:107] Waiting for socket to connect
0925 03:15:14.280903 (+    30us) client_negotiation.cc:174] Beginning negotiation
0925 03:15:14.281097 (+   194us) client_negotiation.cc:252] Sending NEGOTIATE NegotiatePB request
0925 03:15:14.684660 (+403563us) negotiation.cc:327] Negotiation complete: Network error: Client connection negotiation failed: client connection to 0.0.0.0:41451: BlockingRecv error: recv error from unknown peer: Transport endpoint is not connected (error 107)
Metrics: {"client-negotiator.queue_time_us":137}
W20260925 03:15:14.689119   939 negotiation.cc:337] Failed RPC negotiation. Trace:
0925 03:15:14.305321 (+     0us) reactor.cc:625] Submitting negotiation task for client connection to 0.0.0.0:41451 (local address 127.0.0.1:33662)
0925 03:15:14.305884 (+   563us) negotiation.cc:107] Waiting for socket to connect
0925 03:15:14.305948 (+    64us) client_negotiation.cc:174] Beginning negotiation
0925 03:15:14.306163 (+   215us) client_negotiation.cc:252] Sending NEGOTIATE NegotiatePB request
0925 03:15:14.686317 (+380154us) negotiation.cc:327] Negotiation complete: Network error: Client connection negotiation failed: client connection to 0.0.0.0:41451: BlockingRecv error: recv error from unknown peer: Transport endpoint is not connected (error 107)
Metrics: {"client-negotiator.queue_time_us":154}
W20260925 03:15:14.689467   912 negotiation.cc:337] Failed RPC negotiation. Trace:
0925 03:15:14.267712 (+     0us) reactor.cc:625] Submitting negotiation task for client connection to 0.0.0.0:41451 (local address 127.0.0.1:33634)
0925 03:15:14.268256 (+   544us) negotiation.cc:107] Waiting for socket to connect
0925 03:15:14.268288 (+    32us) client_negotiation.cc:174] Beginning negotiation
0925 03:15:14.268489 (+   201us) client_negotiation.cc:252] Sending NEGOTIATE NegotiatePB request
0925 03:15:14.684504 (+416015us) negotiation.cc:327] Negotiation complete: Network error: Client connection negotiation failed: client connection to 0.0.0.0:41451: BlockingRecv error: recv error from unknown peer: Transport endpoint is not connected (error 107)
Metrics: {"client-negotiator.queue_time_us":125}
[       OK ] Parameters/TestRpcSocketTxRxQueue.OverCapacity/0 (1236 ms)
[----------] 1 test from Parameters/TestRpcSocketTxRxQueue (1236 ms total)

[----------] Global test environment tear-down
[==========] 21 tests from 2 test suites ran. (243679 ms total)
[  PASSED  ] 20 tests.
[  FAILED  ] 1 test, listed below:
[  FAILED  ] Parameters/TestRpc.TestCallWithChainCertAndChainCA/SSL_TCP, where GetParam() = (true, false)

 1 FAILED TEST