Diagnosed failure

Parameters/TestRpc.TestCallWithChainCertAndChainCA/SSL_TCP: /data0/somelongdirectorytoavoidrpathissues/src/kudu/src/kudu/rpc/rpc-test.cc:270: Failure
Failed
Bad status: Runtime error: could not verify certificate chain (error with cert: subject=CN = localhost, ST = sadfjas, C = AS, emailAddress = sdflkdsajf, O = lskdfjlsad, OU = sldfkja, issuer=C = AS, ST = ASDfkjdhf, L = lskdjf, O = saldfja, OU = skdjf, CN = localhost, emailAddress = sadjflkadsj): : certificate has expired
Google Test trace:
/data0/somelongdirectorytoavoidrpathissues/src/kudu/src/kudu/rpc/rpc-test.cc:267: Connecting to 0.0.0.0:38917
I20260924 15:18:56.398110 10375 test_util.cc:175] -----------------------------------------------
I20260924 15:18:56.398166 10375 test_util.cc:176] Had fatal failures, leaving test files at /tmp/dist-test-taskICDJ2b/test-tmp/rpc-test.5.Parameters_TestRpc.TestCallWithChainCertAndChainCA_SSL_TCP.1790263136319598-10375-0

Full log

Note: This is test shard 6 of 8.
[==========] Running 21 tests from 2 test suites.
[----------] Global test environment set-up.
[----------] 20 tests from Parameters/TestRpc
[ RUN      ] Parameters/TestRpc.TestMessengerCreateDestroy/SSL_TCP
WARNING: Logging before InitGoogleLogging() is written to STDERR
I20260924 15:18:56.347985 10375 rpc-test.cc:169] started messenger TestCreateDestroy
[       OK ] Parameters/TestRpc.TestMessengerCreateDestroy/SSL_TCP (26 ms)
[ RUN      ] Parameters/TestRpc.TestNegotiationDeadlock/SSL_TCP
I20260924 15:18:56.377259 10396 acceptor_pool.cc:254] collecting diagnostics on the listening RPC socket 0.0.0.0:42703 every 8 connection(s)
I20260924 15:18:56.377259 10395 acceptor_pool.cc:254] collecting diagnostics on the listening RPC socket 0.0.0.0:42703 every 8 connection(s)
[       OK ] Parameters/TestRpc.TestNegotiationDeadlock/SSL_TCP (35 ms)
[ RUN      ] Parameters/TestRpc.TestCallWithChainCertAndChainCA/SSL_TCP
I20260924 15:18:56.394079 10411 acceptor_pool.cc:254] collecting diagnostics on the listening RPC socket 0.0.0.0:38917 every 8 connection(s)
I20260924 15:18:56.394095 10412 acceptor_pool.cc:254] collecting diagnostics on the listening RPC socket 0.0.0.0:38917 every 8 connection(s)
/data0/somelongdirectorytoavoidrpathissues/src/kudu/src/kudu/rpc/rpc-test.cc:270: Failure
Failed
Bad status: Runtime error: could not verify certificate chain (error with cert: subject=CN = localhost, ST = sadfjas, C = AS, emailAddress = sdflkdsajf, O = lskdfjlsad, OU = sldfkja, issuer=C = AS, ST = ASDfkjdhf, L = lskdjf, O = saldfja, OU = skdjf, CN = localhost, emailAddress = sadjflkadsj): : certificate has expired
Google Test trace:
/data0/somelongdirectorytoavoidrpathissues/src/kudu/src/kudu/rpc/rpc-test.cc:267: Connecting to 0.0.0.0:38917
I20260924 15:18:56.398110 10375 test_util.cc:175] -----------------------------------------------
I20260924 15:18:56.398166 10375 test_util.cc:176] Had fatal failures, leaving test files at /tmp/dist-test-taskICDJ2b/test-tmp/rpc-test.5.Parameters_TestRpc.TestCallWithChainCertAndChainCA_SSL_TCP.1790263136319598-10375-0
[  FAILED  ] Parameters/TestRpc.TestCallWithChainCertAndChainCA/SSL_TCP, where GetParam() = (true, false) (13 ms)
[ RUN      ] Parameters/TestRpc.TestCallWithPasswordProtectedKey/SSL_TCP
I20260924 15:18:56.408105 10436 acceptor_pool.cc:254] collecting diagnostics on the listening RPC socket 0.0.0.0:35831 every 8 connection(s)
I20260924 15:18:56.408134 10437 acceptor_pool.cc:254] collecting diagnostics on the listening RPC socket 0.0.0.0:35831 every 8 connection(s)
[       OK ] Parameters/TestRpc.TestCallWithPasswordProtectedKey/SSL_TCP (22 ms)
[ RUN      ] Parameters/TestRpc.TestCallToBadServer/SSL_TCP
I20260924 15:18:56.431303 10375 rpc-test.cc:394] Status: Network error: Client connection negotiation failed: client connection to 0.0.0.0:0: connect: Connection refused (error 111)
I20260924 15:18:56.431587 10375 rpc-test.cc:394] Status: Network error: Client connection negotiation failed: client connection to 0.0.0.0:0: connect: Connection refused (error 111)
I20260924 15:18:56.431772 10375 rpc-test.cc:394] Status: Network error: Client connection negotiation failed: client connection to 0.0.0.0:0: connect: Connection refused (error 111)
I20260924 15:18:56.431917 10375 rpc-test.cc:394] Status: Network error: Client connection negotiation failed: client connection to 0.0.0.0:0: connect: Connection refused (error 111)
I20260924 15:18:56.432073 10375 rpc-test.cc:394] Status: Network error: Client connection negotiation failed: client connection to 0.0.0.0:0: connect: Connection refused (error 111)
[       OK ] Parameters/TestRpc.TestCallToBadServer/SSL_TCP (12 ms)
[ RUN      ] Parameters/TestRpc.TestWrongService/SSL_TCP
I20260924 15:18:56.438035 10471 acceptor_pool.cc:254] collecting diagnostics on the listening RPC socket 0.0.0.0:33087 every 8 connection(s)
I20260924 15:18:56.438060 10472 acceptor_pool.cc:254] collecting diagnostics on the listening RPC socket 0.0.0.0:33087 every 8 connection(s)
I20260924 15:18:56.451581 10469 messenger.cc:345] service WrongServiceName not registered on TestServer
[       OK ] Parameters/TestRpc.TestWrongService/SSL_TCP (20 ms)
[ RUN      ] Parameters/TestRpc.TestConnectionKeepalive/SSL_TCP
I20260924 15:18:56.474687 10494 acceptor_pool.cc:254] collecting diagnostics on the listening RPC socket 0.0.0.0:45627 every 8 connection(s)
I20260924 15:18:56.474706 10495 acceptor_pool.cc:254] collecting diagnostics on the listening RPC socket 0.0.0.0:45627 every 8 connection(s)
I20260924 15:18:56.474828 10375 rpc-test.cc:488] Connecting to 0.0.0.0:45627
[       OK ] Parameters/TestRpc.TestConnectionKeepalive/SSL_TCP (1042 ms)
[ RUN      ] Parameters/TestRpc.TestClientConnectionMetrics/SSL_TCP
I20260924 15:18:57.521661 10519 acceptor_pool.cc:254] collecting diagnostics on the listening RPC socket 0.0.0.0:38181 every 8 connection(s)
I20260924 15:18:57.521704 10520 acceptor_pool.cc:254] collecting diagnostics on the listening RPC socket 0.0.0.0:38181 every 8 connection(s)
I20260924 15:18:57.521806 10375 rpc-test.cc:569] Connecting to 0.0.0.0:38181
[       OK ] Parameters/TestRpc.TestClientConnectionMetrics/SSL_TCP (8193 ms)
[ RUN      ] Parameters/TestRpc.TestCredentialsPolicy/SSL_TCP
I20260924 15:19:05.695952 10542 acceptor_pool.cc:254] collecting diagnostics on the listening RPC socket 0.0.0.0:46009 every 8 connection(s)
I20260924 15:19:05.695990 10543 acceptor_pool.cc:254] collecting diagnostics on the listening RPC socket 0.0.0.0:46009 every 8 connection(s)
I20260924 15:19:05.696132 10375 rpc-test.cc:700] Connecting to 0.0.0.0:46009
[       OK ] Parameters/TestRpc.TestCredentialsPolicy/SSL_TCP (45 ms)
[ RUN      ] Parameters/TestRpc.TestCallLongerThanKeepalive/SSL_TCP
I20260924 15:19:05.746256 10567 acceptor_pool.cc:254] collecting diagnostics on the listening RPC socket 0.0.0.0:35993 every 8 connection(s)
I20260924 15:19:05.746304 10568 acceptor_pool.cc:254] collecting diagnostics on the listening RPC socket 0.0.0.0:35993 every 8 connection(s)
I20260924 15:19:05.766010 10570 rpc-test-base.h:222] got call: sleep_micros: 3000000 deferred: true
I20260924 15:19:08.766685 10570 rpcz_store.cc:275] Call kudu.rpc.GenericCalculatorService.Sleep from 127.0.0.1:58216 (request call id 0) took 3000 ms. Trace:
I20260924 15:19:08.766806 10570 rpcz_store.cc:276] 0924 15:19:05.765955 (+     0us) service_pool.cc:170] Inserting onto call queue
0924 15:19:05.765985 (+    30us) service_pool.cc:227] Handling call
0924 15:19:08.766667 (+3000682us) inbound_call.cc:173] Queueing success response
Metrics: {}
[       OK ] Parameters/TestRpc.TestCallLongerThanKeepalive/SSL_TCP (3033 ms)
[ RUN      ] Parameters/TestRpc.TestRpcSidecar/SSL_TCP
I20260924 15:19:08.786939 10592 acceptor_pool.cc:254] collecting diagnostics on the listening RPC socket 0.0.0.0:40241 every 8 connection(s)
I20260924 15:19:08.786963 10593 acceptor_pool.cc:254] collecting diagnostics on the listening RPC socket 0.0.0.0:40241 every 8 connection(s)
[       OK ] Parameters/TestRpc.TestRpcSidecar/SSL_TCP (59 ms)
[ RUN      ] Parameters/TestRpc.TestRpcSidecarLimits/SSL_TCP
I20260924 15:19:10.915241 10617 acceptor_pool.cc:254] collecting diagnostics on the listening RPC socket 0.0.0.0:33051 every 8 connection(s)
I20260924 15:19:10.915268 10618 acceptor_pool.cc:254] collecting diagnostics on the listening RPC socket 0.0.0.0:33051 every 8 connection(s)
W20260924 15:19:10.927616 10375 serialization.cc:72] Serialized kudu.rpc_test.PushStringsRequestPB (2147483654 bytes) is larger than the maximum configured RPC message size (52428800 bytes). Sending anyway, but peer may reject the data.
W20260924 15:19:10.930738 10614 connection.cc:535] server connection from 127.0.0.1:47596 recv error: Network error: RPC frame had a length of 2147483714, but we only support messages up to 52428800 bytes long.
W20260924 15:19:10.930794 10614 connection.cc:158] shutting down server connection from 127.0.0.1:47596 with pending inbound data: 4/2147483714 bytes received; last active 0 ns ago: status Network error: RPC frame had a length of 2147483714, but we only support messages up to 52428800 bytes long.
W20260924 15:19:10.930998 10630 connection.cc:196] Error closing socket: Network error: TlsSocket::Close: Connection reset by peer
I20260924 15:19:10.946245 10642 acceptor_pool.cc:254] collecting diagnostics on the listening RPC socket 0.0.0.0:41227 every 8 connection(s)
I20260924 15:19:10.946292 10643 acceptor_pool.cc:254] collecting diagnostics on the listening RPC socket 0.0.0.0:41227 every 8 connection(s)
W20260924 15:19:15.319291 10640 connection.cc:577] server connection from 127.0.0.1:42216: received bad data: 'Corruption: Invalid packet: message had a length of 2147483710, but we only support messages up to 2147483647 bytes
'
[       OK ] Parameters/TestRpc.TestRpcSidecarLimits/SSL_TCP (6493 ms)
[ RUN      ] Parameters/TestRpc.TestCallTimeoutDoesntAffectNegotiation/SSL_TCP
I20260924 15:19:15.342355 10667 acceptor_pool.cc:254] collecting diagnostics on the listening RPC socket 0.0.0.0:46683 every 8 connection(s)
I20260924 15:19:15.342374 10668 acceptor_pool.cc:254] collecting diagnostics on the listening RPC socket 0.0.0.0:46683 every 8 connection(s)
W20260924 15:19:15.351339 10663 negotiation.cc:266] Injecting 500ms delay in negotiation
I20260924 15:19:15.401583 10375 rpc-test-base.h:595] status: Timed out: connection negotiation to 0.0.0.0:46683 for RPC Sleep timed out after 0.050s (ON_OUTBOUND_QUEUE), seconds elapsed: 0.0506228
[       OK ] Parameters/TestRpc.TestCallTimeoutDoesntAffectNegotiation/SSL_TCP (534 ms)
[ RUN      ] Parameters/TestRpc.TestRpcHandlerLatencyMetric/SSL_TCP
I20260924 15:19:15.868934 10692 acceptor_pool.cc:254] collecting diagnostics on the listening RPC socket 0.0.0.0:40123 every 8 connection(s)
I20260924 15:19:15.869017 10693 acceptor_pool.cc:254] collecting diagnostics on the listening RPC socket 0.0.0.0:40123 every 8 connection(s)
I20260924 15:19:15.902575 10375 rpc-test.cc:1236] Sleep() min lat: 20274
I20260924 15:19:15.902645 10375 rpc-test.cc:1237] Sleep() mean lat: 20274
I20260924 15:19:15.902679 10375 rpc-test.cc:1238] Sleep() max lat: 20274
I20260924 15:19:15.902696 10375 rpc-test.cc:1239] Sleep() #calls: 1
[       OK ] Parameters/TestRpc.TestRpcHandlerLatencyMetric/SSL_TCP (47 ms)
[ RUN      ] Parameters/TestRpc.TimedOutOnResponseMetricServiceQueue/SSL_TCP
I20260924 15:19:15.949942 10718 acceptor_pool.cc:254] collecting diagnostics on the listening RPC socket 0.0.0.0:42401 every 8 connection(s)
I20260924 15:19:15.950121 10719 acceptor_pool.cc:254] collecting diagnostics on the listening RPC socket 0.0.0.0:42401 every 8 connection(s)
W20260924 15:19:16.019731 10720 rpcz_store.cc:267] Call kudu.rpc_test.CalculatorService.Sleep from 127.0.0.1:35730 (request call id 2) took 20 ms (client timeout 20 ms). Trace:
W20260924 15:19:16.019835 10720 rpcz_store.cc:269] 0924 15:19:15.999452 (+     0us) service_pool.cc:170] Inserting onto call queue
0924 15:19:16.019697 (+ 20245us) service_pool.cc:214] Skipping call since client already timed out
0924 15:19:16.019712 (+    15us) inbound_call.cc:173] Queueing failure response
Metrics: {}
[       OK ] Parameters/TestRpc.TimedOutOnResponseMetricServiceQueue/SSL_TCP (116 ms)
[ RUN      ] Parameters/TestRpc.RpcPendingConnectionsMetric/SSL_TCP
I20260924 15:19:16.022754 10741 acceptor_pool.cc:254] collecting diagnostics on the listening RPC socket 0.0.0.0:34097 every 8 connection(s)
I20260924 15:19:16.022814 10742 acceptor_pool.cc:254] collecting diagnostics on the listening RPC socket 0.0.0.0:34097 every 8 connection(s)
W20260924 15:19:16.023329 10737 negotiation.cc:337] Failed RPC negotiation. Trace:
0924 15:19:16.023168 (+     0us) reactor.cc:625] Submitting negotiation task for server connection from 127.0.0.1:35710 (local address 127.0.0.1:34097)
0924 15:19:16.023208 (+    40us) server_negotiation.cc:206] Beginning negotiation
0924 15:19:16.023210 (+     2us) server_negotiation.cc:399] Waiting for connection header
0924 15:19:16.023276 (+    66us) negotiation.cc:327] Negotiation complete: Network error: Server connection negotiation failed: server connection from 127.0.0.1:35710: BlockingRecv error: recv got EOF from 127.0.0.1:35710 (error 108)
Metrics: {"server-negotiator.queue_time_us":13}
[       OK ] Parameters/TestRpc.RpcPendingConnectionsMetric/SSL_TCP (13 ms)
[ RUN      ] Parameters/TestRpc.TestRpcContextClientDeadline/SSL_TCP
I20260924 15:19:16.058303 10758 acceptor_pool.cc:254] collecting diagnostics on the listening RPC socket 0.0.0.0:38361 every 8 connection(s)
I20260924 15:19:16.058276 10757 acceptor_pool.cc:254] collecting diagnostics on the listening RPC socket 0.0.0.0:38361 every 8 connection(s)
[       OK ] Parameters/TestRpc.TestRpcContextClientDeadline/SSL_TCP (55 ms)
[ RUN      ] Parameters/TestRpc.TestApplicationFeatureFlagUnsupportedServer/SSL_TCP
I20260924 15:19:16.094774 10782 acceptor_pool.cc:254] collecting diagnostics on the listening RPC socket 0.0.0.0:45973 every 8 connection(s)
I20260924 15:19:16.094815 10783 acceptor_pool.cc:254] collecting diagnostics on the listening RPC socket 0.0.0.0:45973 every 8 connection(s)
[       OK ] Parameters/TestRpc.TestApplicationFeatureFlagUnsupportedServer/SSL_TCP (19 ms)
[ RUN      ] Parameters/TestRpc.TestCancellationAsync/SSL_TCP
I20260924 15:19:16.115968 10808 acceptor_pool.cc:254] collecting diagnostics on the listening RPC socket 0.0.0.0:46447 every 8 connection(s)
I20260924 15:19:16.115942 10807 acceptor_pool.cc:254] collecting diagnostics on the listening RPC socket 0.0.0.0:46447 every 8 connection(s)
I20260924 15:19:16.116101 10375 rpc-test.cc:1716] Connecting to 0.0.0.0:46447
I20260924 15:19:16.128054 10375 test_util.cc:268] Using random seed: 528070963
I20260924 15:19:16.143142 10811 rpc-test-base.h:240] got call: sleep_micros: 500 pattern: 4294967295 num_repetitions: 2097152 sidecar_idx: 0
I20260924 15:19:16.155038 10811 rpc-test-base.h:240] got call: sleep_micros: 500 pattern: 4294967295 num_repetitions: 2097152 sidecar_idx: 0
I20260924 15:19:16.165210 10811 rpc-test-base.h:240] got call: sleep_micros: 500 pattern: 4294967295 num_repetitions: 2097152 sidecar_idx: 0
I20260924 15:19:16.177062 10811 rpc-test-base.h:240] got call: sleep_micros: 500 pattern: 4294967295 num_repetitions: 2097152 sidecar_idx: 0
I20260924 15:19:16.189085 10811 rpc-test-base.h:240] got call: sleep_micros: 500 pattern: 4294967295 num_repetitions: 2097152 sidecar_idx: 0
I20260924 15:19:16.200848 10811 rpc-test-base.h:240] got call: sleep_micros: 500 pattern: 4294967295 num_repetitions: 2097152 sidecar_idx: 0
I20260924 15:19:16.212663 10811 rpc-test-base.h:240] got call: sleep_micros: 500 pattern: 4294967295 num_repetitions: 2097152 sidecar_idx: 0
I20260924 15:19:16.224026 10811 rpc-test-base.h:240] got call: sleep_micros: 500 pattern: 4294967295 num_repetitions: 2097152 sidecar_idx: 0
W20260924 15:19:16.227105 10804 connection.cc:441] server connection from 127.0.0.1:35388 torn down before Call kudu.rpc.GenericCalculatorService.SleepWithSidecar from 127.0.0.1:35388 (request call id 9) could send its response
[       OK ] Parameters/TestRpc.TestCancellationAsync/SSL_TCP (119 ms)
[ RUN      ] Parameters/TestRpc.TestPerformanceBySocketType/SSL_TCP
I20260924 15:19:16.254345 10832 acceptor_pool.cc:254] collecting diagnostics on the listening RPC socket 0.0.0.0:40337 every 8 connection(s)
I20260924 15:19:16.254365 10833 acceptor_pool.cc:254] collecting diagnostics on the listening RPC socket 0.0.0.0:40337 every 8 connection(s)
I20260924 15:19:16.254484 10375 rpc-test.cc:1846] Connecting to 0.0.0.0:40337
I20260924 15:19:17.911545 10375 rpc-test.cc:1859] Sending 1024MB via ssl-enabled tcp socket: real 1.642s	user 1.622s	sys 1.269s
I20260924 15:19:19.537075 10375 rpc-test.cc:1859] Sending 1024MB via ssl-enabled tcp socket: real 1.625s	user 1.579s	sys 1.285s
I20260924 15:19:21.144354 10375 rpc-test.cc:1859] Sending 1024MB via ssl-enabled tcp socket: real 1.607s	user 1.530s	sys 1.297s
I20260924 15:19:22.733103 10375 rpc-test.cc:1859] Sending 1024MB via ssl-enabled tcp socket: real 1.589s	user 1.646s	sys 1.168s
I20260924 15:19:24.371438 10375 rpc-test.cc:1859] Sending 1024MB via ssl-enabled tcp socket: real 1.638s	user 1.521s	sys 1.382s
[       OK ] Parameters/TestRpc.TestPerformanceBySocketType/SSL_TCP (8144 ms)
[----------] 20 tests from Parameters/TestRpc (28050 ms total)

[----------] 1 test from Parameters/TestRpcSocketTxRxQueue
[ RUN      ] Parameters/TestRpcSocketTxRxQueue.OverCapacity/0
W20260924 15:19:24.643247 10876 negotiation.cc:337] Failed RPC negotiation. Trace:
0924 15:19:24.382535 (+     0us) reactor.cc:625] Submitting negotiation task for client connection to 0.0.0.0:33895 (local address 127.0.0.1:35834)
0924 15:19:24.382570 (+    35us) negotiation.cc:107] Waiting for socket to connect
0924 15:19:24.382577 (+     7us) client_negotiation.cc:174] Beginning negotiation
0924 15:19:24.382620 (+    43us) client_negotiation.cc:252] Sending NEGOTIATE NegotiatePB request
0924 15:19:24.643081 (+260461us) negotiation.cc:327] Negotiation complete: Network error: Client connection negotiation failed: client connection to 0.0.0.0:33895: BlockingRecv error: recv error from unknown peer: Transport endpoint is not connected (error 107)
Metrics: {"client-negotiator.queue_time_us":16}
W20260924 15:19:24.643249 10885 negotiation.cc:337] Failed RPC negotiation. Trace:
0924 15:19:24.383414 (+     0us) reactor.cc:625] Submitting negotiation task for client connection to 0.0.0.0:33895 (local address 127.0.0.1:35844)
0924 15:19:24.383467 (+    53us) negotiation.cc:107] Waiting for socket to connect
0924 15:19:24.383476 (+     9us) client_negotiation.cc:174] Beginning negotiation
0924 15:19:24.383515 (+    39us) client_negotiation.cc:252] Sending NEGOTIATE NegotiatePB request
0924 15:19:24.643190 (+259675us) negotiation.cc:327] Negotiation complete: Network error: Client connection negotiation failed: client connection to 0.0.0.0:33895: BlockingRecv error: recv error from unknown peer: Transport endpoint is not connected (error 107)
Metrics: {"client-negotiator.queue_time_us":32}
W20260924 15:19:24.643595 10894 negotiation.cc:337] Failed RPC negotiation. Trace:
0924 15:19:24.384264 (+     0us) reactor.cc:625] Submitting negotiation task for client connection to 0.0.0.0:33895 (local address 127.0.0.1:35856)
0924 15:19:24.384315 (+    51us) negotiation.cc:107] Waiting for socket to connect
0924 15:19:24.384323 (+     8us) client_negotiation.cc:174] Beginning negotiation
0924 15:19:24.384363 (+    40us) client_negotiation.cc:252] Sending NEGOTIATE NegotiatePB request
0924 15:19:24.643541 (+259178us) negotiation.cc:327] Negotiation complete: Network error: Client connection negotiation failed: client connection to 0.0.0.0:33895: BlockingRecv error: recv error from unknown peer: Transport endpoint is not connected (error 107)
Metrics: {"client-negotiator.queue_time_us":30}
W20260924 15:19:24.643714 10858 negotiation.cc:337] Failed RPC negotiation. Trace:
0924 15:19:24.380913 (+     0us) reactor.cc:625] Submitting negotiation task for client connection to 0.0.0.0:33895 (local address 127.0.0.1:35820)
0924 15:19:24.380951 (+    38us) negotiation.cc:107] Waiting for socket to connect
0924 15:19:24.380959 (+     8us) client_negotiation.cc:174] Beginning negotiation
0924 15:19:24.380995 (+    36us) client_negotiation.cc:252] Sending NEGOTIATE NegotiatePB request
0924 15:19:24.643086 (+262091us) negotiation.cc:327] Negotiation complete: Network error: Client connection negotiation failed: client connection to 0.0.0.0:33895: BlockingRecv error: recv error from unknown peer: Transport endpoint is not connected (error 107)
Metrics: {"client-negotiator.queue_time_us":17}
W20260924 15:19:24.643249 10867 negotiation.cc:337] Failed RPC negotiation. Trace:
0924 15:19:24.381765 (+     0us) reactor.cc:625] Submitting negotiation task for client connection to 0.0.0.0:33895 (local address 127.0.0.1:35832)
0924 15:19:24.381817 (+    52us) negotiation.cc:107] Waiting for socket to connect
0924 15:19:24.381825 (+     8us) client_negotiation.cc:174] Beginning negotiation
0924 15:19:24.381861 (+    36us) client_negotiation.cc:252] Sending NEGOTIATE NegotiatePB request
0924 15:19:24.643081 (+261220us) negotiation.cc:327] Negotiation complete: Network error: Client connection negotiation failed: client connection to 0.0.0.0:33895: BlockingRecv error: recv error from unknown peer: Transport endpoint is not connected (error 107)
Metrics: {"client-negotiator.queue_time_us":32}
W20260924 15:19:24.643249 10849 negotiation.cc:337] Failed RPC negotiation. Trace:
0924 15:19:24.380075 (+     0us) reactor.cc:625] Submitting negotiation task for client connection to 0.0.0.0:33895 (local address 127.0.0.1:35814)
0924 15:19:24.380151 (+    76us) negotiation.cc:107] Waiting for socket to connect
0924 15:19:24.380161 (+    10us) client_negotiation.cc:174] Beginning negotiation
0924 15:19:24.380211 (+    50us) client_negotiation.cc:252] Sending NEGOTIATE NegotiatePB request
0924 15:19:24.643087 (+262876us) negotiation.cc:327] Negotiation complete: Network error: Client connection negotiation failed: client connection to 0.0.0.0:33895: BlockingRecv error: recv error from unknown peer: Transport endpoint is not connected (error 107)
Metrics: {"client-negotiator.queue_time_us":49}
[       OK ] Parameters/TestRpcSocketTxRxQueue.OverCapacity/0 (1036 ms)
[----------] 1 test from Parameters/TestRpcSocketTxRxQueue (1036 ms total)

[----------] Global test environment tear-down
[==========] 21 tests from 2 test suites ran. (29087 ms total)
[  PASSED  ] 20 tests.
[  FAILED  ] 1 test, listed below:
[  FAILED  ] Parameters/TestRpc.TestCallWithChainCertAndChainCA/SSL_TCP, where GetParam() = (true, false)

 1 FAILED TEST