Diagnosed failure
Parameters/TestRpc.TestCallWithChainCertAndChainCA/SSL_UnixSocket: /data0/somelongdirectorytoavoidrpathissues/src/kudu/src/kudu/rpc/rpc-test.cc:270: Failure
Failed
Bad status: Runtime error: could not verify certificate chain (error with cert: subject=CN = localhost, ST = sadfjas, C = AS, emailAddress = sdflkdsajf, O = lskdfjlsad, OU = sldfkja, issuer=C = AS, ST = ASDfkjdhf, L = lskdjf, O = saldfja, OU = skdjf, CN = localhost, emailAddress = sadjflkadsj): : certificate has expired
Google Test trace:
/data0/somelongdirectorytoavoidrpathissues/src/kudu/src/kudu/rpc/rpc-test.cc:267: Connecting to unix:/tmp/dist-test-taskPfacY3/test-tmp/rpc-test-c10dd0359b4e429e8c65c36e23d91f71.sock
I20260924 16:01:28.619828 21371 test_util.cc:175] -----------------------------------------------
I20260924 16:01:28.619946 21371 test_util.cc:176] Had fatal failures, leaving test files at /tmp/dist-test-taskPfacY3/test-tmp/rpc-test.6.Parameters_TestRpc.TestCallWithChainCertAndChainCA_SSL_UnixSocket.1790265688518474-21371-0
Full log
Note: This is test shard 7 of 8.
[==========] Running 21 tests from 2 test suites.
[----------] Global test environment set-up.
[----------] 20 tests from Parameters/TestRpc
[ RUN ] Parameters/TestRpc.TestMessengerCreateDestroy/SSL_UnixSocket
WARNING: Logging before InitGoogleLogging() is written to STDERR
I20260924 16:01:28.561487 21371 rpc-test.cc:169] started messenger TestCreateDestroy
[ OK ] Parameters/TestRpc.TestMessengerCreateDestroy/SSL_UnixSocket (27 ms)
[ RUN ] Parameters/TestRpc.TestNegotiationDeadlock/SSL_UnixSocket
I20260924 16:01:28.573402 21392 acceptor_pool.cc:254] collecting diagnostics on the listening RPC socket unix:/tmp/dist-test-taskPfacY3/test-tmp/rpc-test-a8eba7609c134bf9b28d4807911eddaa.sock every 8 connection(s)
I20260924 16:01:28.573717 21393 acceptor_pool.cc:254] collecting diagnostics on the listening RPC socket unix:/tmp/dist-test-taskPfacY3/test-tmp/rpc-test-a8eba7609c134bf9b28d4807911eddaa.sock every 8 connection(s)
[ OK ] Parameters/TestRpc.TestNegotiationDeadlock/SSL_UnixSocket (30 ms)
[ RUN ] Parameters/TestRpc.TestCallWithChainCertAndChainCA/SSL_UnixSocket
I20260924 16:01:28.607676 21408 acceptor_pool.cc:254] collecting diagnostics on the listening RPC socket unix:/tmp/dist-test-taskPfacY3/test-tmp/rpc-test-c10dd0359b4e429e8c65c36e23d91f71.sock every 8 connection(s)
I20260924 16:01:28.608090 21409 acceptor_pool.cc:254] collecting diagnostics on the listening RPC socket unix:/tmp/dist-test-taskPfacY3/test-tmp/rpc-test-c10dd0359b4e429e8c65c36e23d91f71.sock every 8 connection(s)
/data0/somelongdirectorytoavoidrpathissues/src/kudu/src/kudu/rpc/rpc-test.cc:270: Failure
Failed
Bad status: Runtime error: could not verify certificate chain (error with cert: subject=CN = localhost, ST = sadfjas, C = AS, emailAddress = sdflkdsajf, O = lskdfjlsad, OU = sldfkja, issuer=C = AS, ST = ASDfkjdhf, L = lskdjf, O = saldfja, OU = skdjf, CN = localhost, emailAddress = sadjflkadsj): : certificate has expired
Google Test trace:
/data0/somelongdirectorytoavoidrpathissues/src/kudu/src/kudu/rpc/rpc-test.cc:267: Connecting to unix:/tmp/dist-test-taskPfacY3/test-tmp/rpc-test-c10dd0359b4e429e8c65c36e23d91f71.sock
I20260924 16:01:28.619828 21371 test_util.cc:175] -----------------------------------------------
I20260924 16:01:28.619946 21371 test_util.cc:176] Had fatal failures, leaving test files at /tmp/dist-test-taskPfacY3/test-tmp/rpc-test.6.Parameters_TestRpc.TestCallWithChainCertAndChainCA_SSL_UnixSocket.1790265688518474-21371-0
[ FAILED ] Parameters/TestRpc.TestCallWithChainCertAndChainCA/SSL_UnixSocket, where GetParam() = (true, true) (24 ms)
[ RUN ] Parameters/TestRpc.TestCallWithPasswordProtectedKey/SSL_UnixSocket
I20260924 16:01:28.641402 21433 acceptor_pool.cc:254] collecting diagnostics on the listening RPC socket unix:/tmp/dist-test-taskPfacY3/test-tmp/rpc-test-4f6eb539a2024b0089b54bf876ecb650.sock every 8 connection(s)
I20260924 16:01:28.641659 21434 acceptor_pool.cc:254] collecting diagnostics on the listening RPC socket unix:/tmp/dist-test-taskPfacY3/test-tmp/rpc-test-4f6eb539a2024b0089b54bf876ecb650.sock every 8 connection(s)
W20260924 16:01:28.675408 21430 connection.cc:196] Error closing socket: Network error: TlsSocket::Close: Broken pipe
[ OK ] Parameters/TestRpc.TestCallWithPasswordProtectedKey/SSL_UnixSocket (59 ms)
[ RUN ] Parameters/TestRpc.TestCallToBadServer/SSL_UnixSocket
I20260924 16:01:28.690605 21371 rpc-test.cc:394] Status: Network error: Client connection negotiation failed: client connection to 0.0.0.0:0: connect: Connection refused (error 111)
I20260924 16:01:28.691324 21371 rpc-test.cc:394] Status: Network error: Client connection negotiation failed: client connection to 0.0.0.0:0: connect: Connection refused (error 111)
I20260924 16:01:28.691953 21371 rpc-test.cc:394] Status: Network error: Client connection negotiation failed: client connection to 0.0.0.0:0: connect: Connection refused (error 111)
I20260924 16:01:28.692520 21371 rpc-test.cc:394] Status: Network error: Client connection negotiation failed: client connection to 0.0.0.0:0: connect: Connection refused (error 111)
I20260924 16:01:28.693132 21371 rpc-test.cc:394] Status: Network error: Client connection negotiation failed: client connection to 0.0.0.0:0: connect: Connection refused (error 111)
[ OK ] Parameters/TestRpc.TestCallToBadServer/SSL_UnixSocket (15 ms)
[ RUN ] Parameters/TestRpc.TestWrongService/SSL_UnixSocket
I20260924 16:01:28.710923 21468 acceptor_pool.cc:254] collecting diagnostics on the listening RPC socket unix:/tmp/dist-test-taskPfacY3/test-tmp/rpc-test-cf20d9a66c4748daa0f1c743e09f8df0.sock every 8 connection(s)
I20260924 16:01:28.711170 21469 acceptor_pool.cc:254] collecting diagnostics on the listening RPC socket unix:/tmp/dist-test-taskPfacY3/test-tmp/rpc-test-cf20d9a66c4748daa0f1c743e09f8df0.sock every 8 connection(s)
I20260924 16:01:28.749542 21465 messenger.cc:345] service WrongServiceName not registered on TestServer
W20260924 16:01:28.751353 21465 connection.cc:196] Error closing socket: Network error: TlsSocket::Close: Broken pipe
[ OK ] Parameters/TestRpc.TestWrongService/SSL_UnixSocket (60 ms)
[ RUN ] Parameters/TestRpc.TestConnectionKeepalive/SSL_UnixSocket
I20260924 16:01:28.779709 21492 acceptor_pool.cc:254] collecting diagnostics on the listening RPC socket unix:/tmp/dist-test-taskPfacY3/test-tmp/rpc-test-33655403a0d543c59121f078af0fd5b0.sock every 8 connection(s)
I20260924 16:01:28.779985 21493 acceptor_pool.cc:254] collecting diagnostics on the listening RPC socket unix:/tmp/dist-test-taskPfacY3/test-tmp/rpc-test-33655403a0d543c59121f078af0fd5b0.sock every 8 connection(s)
I20260924 16:01:28.780915 21371 rpc-test.cc:488] Connecting to unix:/tmp/dist-test-taskPfacY3/test-tmp/rpc-test-33655403a0d543c59121f078af0fd5b0.sock
W20260924 16:01:29.257782 21505 connection.cc:196] Error closing socket: Network error: TlsSocket::Close: Broken pipe
[ OK ] Parameters/TestRpc.TestConnectionKeepalive/SSL_UnixSocket (1066 ms)
[ RUN ] Parameters/TestRpc.TestClientConnectionMetrics/SSL_UnixSocket
I20260924 16:01:29.843102 21517 acceptor_pool.cc:254] collecting diagnostics on the listening RPC socket unix:/tmp/dist-test-taskPfacY3/test-tmp/rpc-test-611d24c56f9040fc94a37784bbb4c77b.sock every 8 connection(s)
I20260924 16:01:29.843349 21518 acceptor_pool.cc:254] collecting diagnostics on the listening RPC socket unix:/tmp/dist-test-taskPfacY3/test-tmp/rpc-test-611d24c56f9040fc94a37784bbb4c77b.sock every 8 connection(s)
I20260924 16:01:29.844367 21371 rpc-test.cc:569] Connecting to unix:/tmp/dist-test-taskPfacY3/test-tmp/rpc-test-611d24c56f9040fc94a37784bbb4c77b.sock
W20260924 16:01:51.281713 21514 connection.cc:196] Error closing socket: Network error: TlsSocket::Close: Broken pipe
[ OK ] Parameters/TestRpc.TestClientConnectionMetrics/SSL_UnixSocket (21466 ms)
[ RUN ] Parameters/TestRpc.TestCredentialsPolicy/SSL_UnixSocket
I20260924 16:01:51.312951 21540 acceptor_pool.cc:254] collecting diagnostics on the listening RPC socket unix:/tmp/dist-test-taskPfacY3/test-tmp/rpc-test-d66d8f5cdf65405fa6a0966db9fb4d6c.sock every 8 connection(s)
I20260924 16:01:51.313189 21541 acceptor_pool.cc:254] collecting diagnostics on the listening RPC socket unix:/tmp/dist-test-taskPfacY3/test-tmp/rpc-test-d66d8f5cdf65405fa6a0966db9fb4d6c.sock every 8 connection(s)
I20260924 16:01:51.314143 21371 rpc-test.cc:700] Connecting to unix:/tmp/dist-test-taskPfacY3/test-tmp/rpc-test-d66d8f5cdf65405fa6a0966db9fb4d6c.sock
W20260924 16:01:51.335191 21539 connection.cc:196] Error closing socket: Network error: TlsSocket::Close: Broken pipe
W20260924 16:01:51.343204 21539 connection.cc:196] Error closing socket: Network error: TlsSocket::Close: Broken pipe
[ OK ] Parameters/TestRpc.TestCredentialsPolicy/SSL_UnixSocket (58 ms)
[ RUN ] Parameters/TestRpc.TestCallLongerThanKeepalive/SSL_UnixSocket
I20260924 16:01:51.355767 21566 acceptor_pool.cc:254] collecting diagnostics on the listening RPC socket unix:/tmp/dist-test-taskPfacY3/test-tmp/rpc-test-1e48556966374fdaaae2539a3d9a6e26.sock every 8 connection(s)
I20260924 16:01:51.355993 21567 acceptor_pool.cc:254] collecting diagnostics on the listening RPC socket unix:/tmp/dist-test-taskPfacY3/test-tmp/rpc-test-1e48556966374fdaaae2539a3d9a6e26.sock every 8 connection(s)
I20260924 16:01:51.369760 21570 rpc-test-base.h:222] got call: sleep_micros: 3000000 deferred: true
I20260924 16:01:54.371461 21570 rpcz_store.cc:275] Call kudu.rpc.GenericCalculatorService.Sleep from unix:<unnamed> (request call id 0) took 3001 ms. Trace:
I20260924 16:01:54.371620 21570 rpcz_store.cc:276] 0924 16:01:51.369651 (+ 0us) service_pool.cc:170] Inserting onto call queue
0924 16:01:51.369715 (+ 64us) service_pool.cc:227] Handling call
0924 16:01:54.371416 (+3001701us) inbound_call.cc:173] Queueing success response
Metrics: {}
W20260924 16:01:54.374378 21563 connection.cc:196] Error closing socket: Network error: TlsSocket::Close: Broken pipe
[ OK ] Parameters/TestRpc.TestCallLongerThanKeepalive/SSL_UnixSocket (3032 ms)
[ RUN ] Parameters/TestRpc.TestRpcSidecar/SSL_UnixSocket
I20260924 16:01:54.391532 21591 acceptor_pool.cc:254] collecting diagnostics on the listening RPC socket unix:/tmp/dist-test-taskPfacY3/test-tmp/rpc-test-88c7ed295e7a494cb17bd15ba04b4ce4.sock every 8 connection(s)
I20260924 16:01:54.391749 21592 acceptor_pool.cc:254] collecting diagnostics on the listening RPC socket unix:/tmp/dist-test-taskPfacY3/test-tmp/rpc-test-88c7ed295e7a494cb17bd15ba04b4ce4.sock every 8 connection(s)
W20260924 16:01:54.503592 21588 connection.cc:196] Error closing socket: Network error: TlsSocket::Close: Broken pipe
[ OK ] Parameters/TestRpc.TestRpcSidecar/SSL_UnixSocket (127 ms)
[ RUN ] Parameters/TestRpc.TestRpcSidecarLimits/SSL_UnixSocket
I20260924 16:01:56.658432 21616 acceptor_pool.cc:254] collecting diagnostics on the listening RPC socket unix:/tmp/dist-test-taskPfacY3/test-tmp/rpc-test-cf26f9a19d4c48cf8c2042b76603a143.sock every 8 connection(s)
I20260924 16:01:56.658761 21617 acceptor_pool.cc:254] collecting diagnostics on the listening RPC socket unix:/tmp/dist-test-taskPfacY3/test-tmp/rpc-test-cf26f9a19d4c48cf8c2042b76603a143.sock every 8 connection(s)
W20260924 16:01:56.678833 21371 serialization.cc:72] Serialized kudu.rpc_test.PushStringsRequestPB (2147483654 bytes) is larger than the maximum configured RPC message size (52428800 bytes). Sending anyway, but peer may reject the data.
W20260924 16:01:56.684564 21613 connection.cc:535] server connection from unix:<unnamed> recv error: Network error: RPC frame had a length of 2147483714, but we only support messages up to 52428800 bytes long.
W20260924 16:01:56.684674 21613 connection.cc:158] shutting down server connection from unix:<unnamed> with pending inbound data: 4/2147483714 bytes received; last active 0 ns ago: status Network error: RPC frame had a length of 2147483714, but we only support messages up to 52428800 bytes long.
W20260924 16:01:56.685081 21629 connection.cc:196] Error closing socket: Network error: TlsSocket::Close: Broken pipe
I20260924 16:01:56.723397 21641 acceptor_pool.cc:254] collecting diagnostics on the listening RPC socket unix:/tmp/dist-test-taskPfacY3/test-tmp/rpc-test-cf26f9a19d4c48cf8c2042b76603a143.sock every 8 connection(s)
I20260924 16:01:56.723591 21642 acceptor_pool.cc:254] collecting diagnostics on the listening RPC socket unix:/tmp/dist-test-taskPfacY3/test-tmp/rpc-test-cf26f9a19d4c48cf8c2042b76603a143.sock every 8 connection(s)
W20260924 16:02:04.053469 21638 connection.cc:577] server connection from unix:<unnamed>: received bad data: 'Corruption: Invalid packet: message had a length of 2147483710, but we only support messages up to 2147483647 bytes
'
W20260924 16:02:04.054138 21654 connection.cc:196] Error closing socket: Network error: TlsSocket::Close: Broken pipe
[ OK ] Parameters/TestRpc.TestRpcSidecarLimits/SSL_UnixSocket (10040 ms)
[ RUN ] Parameters/TestRpc.TestCallTimeoutDoesntAffectNegotiation/SSL_UnixSocket
I20260924 16:02:04.566444 21666 acceptor_pool.cc:254] collecting diagnostics on the listening RPC socket unix:/tmp/dist-test-taskPfacY3/test-tmp/rpc-test-19a32b49a083439b9baa5f978272eb2a.sock every 8 connection(s)
I20260924 16:02:04.566732 21667 acceptor_pool.cc:254] collecting diagnostics on the listening RPC socket unix:/tmp/dist-test-taskPfacY3/test-tmp/rpc-test-19a32b49a083439b9baa5f978272eb2a.sock every 8 connection(s)
W20260924 16:02:04.590194 21662 negotiation.cc:266] Injecting 500ms delay in negotiation
I20260924 16:02:04.640640 21371 rpc-test-base.h:595] status: Timed out: connection negotiation to unix:/tmp/dist-test-taskPfacY3/test-tmp/rpc-test-19a32b49a083439b9baa5f978272eb2a.sock for RPC Sleep timed out after 0.050s (ON_OUTBOUND_QUEUE), seconds elapsed: 0.051142
[ OK ] Parameters/TestRpc.TestCallTimeoutDoesntAffectNegotiation/SSL_UnixSocket (554 ms)
[ RUN ] Parameters/TestRpc.TestRpcHandlerLatencyMetric/SSL_UnixSocket
I20260924 16:02:05.114348 21691 acceptor_pool.cc:254] collecting diagnostics on the listening RPC socket unix:/tmp/dist-test-taskPfacY3/test-tmp/rpc-test-b58543e1969743eb9e9f838ccdea9d5d.sock every 8 connection(s)
I20260924 16:02:05.114583 21692 acceptor_pool.cc:254] collecting diagnostics on the listening RPC socket unix:/tmp/dist-test-taskPfacY3/test-tmp/rpc-test-b58543e1969743eb9e9f838ccdea9d5d.sock every 8 connection(s)
I20260924 16:02:05.155928 21371 rpc-test.cc:1236] Sleep() min lat: 20628
I20260924 16:02:05.156023 21371 rpc-test.cc:1237] Sleep() mean lat: 20628
I20260924 16:02:05.156067 21371 rpc-test.cc:1238] Sleep() max lat: 20628
I20260924 16:02:05.156085 21371 rpc-test.cc:1239] Sleep() #calls: 1
W20260924 16:02:05.157074 21688 connection.cc:196] Error closing socket: Network error: TlsSocket::Close: Broken pipe
[ OK ] Parameters/TestRpc.TestRpcHandlerLatencyMetric/SSL_UnixSocket (60 ms)
[ RUN ] Parameters/TestRpc.TimedOutOnResponseMetricServiceQueue/SSL_UnixSocket
I20260924 16:02:05.187224 21718 acceptor_pool.cc:254] collecting diagnostics on the listening RPC socket unix:/tmp/dist-test-taskPfacY3/test-tmp/rpc-test-7665dc34e4a847528598a7ed9ad6892c.sock every 8 connection(s)
I20260924 16:02:05.187451 21719 acceptor_pool.cc:254] collecting diagnostics on the listening RPC socket unix:/tmp/dist-test-taskPfacY3/test-tmp/rpc-test-7665dc34e4a847528598a7ed9ad6892c.sock every 8 connection(s)
W20260924 16:02:05.246789 21720 rpcz_store.cc:267] Call kudu.rpc_test.CalculatorService.Sleep from unix:<unnamed> (request call id 2) took 20 ms (client timeout 20 ms). Trace:
W20260924 16:02:05.246966 21720 rpcz_store.cc:269] 0924 16:02:05.226264 (+ 0us) service_pool.cc:170] Inserting onto call queue
0924 16:02:05.246704 (+ 20440us) service_pool.cc:214] Skipping call since client already timed out
0924 16:02:05.246763 (+ 59us) inbound_call.cc:173] Queueing failure response
Metrics: {}
W20260924 16:02:05.248313 21715 connection.cc:196] Error closing socket: Network error: TlsSocket::Close: Broken pipe
[ OK ] Parameters/TestRpc.TimedOutOnResponseMetricServiceQueue/SSL_UnixSocket (90 ms)
[ RUN ] Parameters/TestRpc.RpcPendingConnectionsMetric/SSL_UnixSocket
I20260924 16:02:05.257339 21741 acceptor_pool.cc:254] collecting diagnostics on the listening RPC socket 0.0.0.0:38553 every 8 connection(s)
I20260924 16:02:05.257579 21742 acceptor_pool.cc:254] collecting diagnostics on the listening RPC socket 0.0.0.0:38553 every 8 connection(s)
W20260924 16:02:05.259799 21737 negotiation.cc:337] Failed RPC negotiation. Trace:
0924 16:02:05.259161 (+ 0us) reactor.cc:625] Submitting negotiation task for server connection from 127.0.0.1:45450 (local address 127.0.0.1:38553)
0924 16:02:05.259332 (+ 171us) server_negotiation.cc:206] Beginning negotiation
0924 16:02:05.259337 (+ 5us) server_negotiation.cc:399] Waiting for connection header
0924 16:02:05.259491 (+ 154us) negotiation.cc:327] Negotiation complete: Network error: Server connection negotiation failed: server connection from 127.0.0.1:45450: BlockingRecv error: recv got EOF from 127.0.0.1:45450 (error 108)
Metrics: {"server-negotiator.queue_time_us":56}
[ OK ] Parameters/TestRpc.RpcPendingConnectionsMetric/SSL_UnixSocket (20 ms)
[ RUN ] Parameters/TestRpc.TestRpcContextClientDeadline/SSL_UnixSocket
I20260924 16:02:05.281981 21757 acceptor_pool.cc:254] collecting diagnostics on the listening RPC socket unix:/tmp/dist-test-taskPfacY3/test-tmp/rpc-test-e7669e49ad8e4924853130f090d8861e.sock every 8 connection(s)
I20260924 16:02:05.282227 21758 acceptor_pool.cc:254] collecting diagnostics on the listening RPC socket unix:/tmp/dist-test-taskPfacY3/test-tmp/rpc-test-e7669e49ad8e4924853130f090d8861e.sock every 8 connection(s)
[ OK ] Parameters/TestRpc.TestRpcContextClientDeadline/SSL_UnixSocket (60 ms)
[ RUN ] Parameters/TestRpc.TestApplicationFeatureFlagUnsupportedServer/SSL_UnixSocket
I20260924 16:02:05.361783 21782 acceptor_pool.cc:254] collecting diagnostics on the listening RPC socket unix:/tmp/dist-test-taskPfacY3/test-tmp/rpc-test-7fca68170ef143728d3f383ae1c901c5.sock every 8 connection(s)
I20260924 16:02:05.362128 21783 acceptor_pool.cc:254] collecting diagnostics on the listening RPC socket unix:/tmp/dist-test-taskPfacY3/test-tmp/rpc-test-7fca68170ef143728d3f383ae1c901c5.sock every 8 connection(s)
[ OK ] Parameters/TestRpc.TestApplicationFeatureFlagUnsupportedServer/SSL_UnixSocket (54 ms)
[ RUN ] Parameters/TestRpc.TestCancellationAsync/SSL_UnixSocket
I20260924 16:02:05.400892 21807 acceptor_pool.cc:254] collecting diagnostics on the listening RPC socket unix:/tmp/dist-test-taskPfacY3/test-tmp/rpc-test-f038fd50256042179ec074d034302cbe.sock every 8 connection(s)
I20260924 16:02:05.401149 21808 acceptor_pool.cc:254] collecting diagnostics on the listening RPC socket unix:/tmp/dist-test-taskPfacY3/test-tmp/rpc-test-f038fd50256042179ec074d034302cbe.sock every 8 connection(s)
I20260924 16:02:05.402093 21371 rpc-test.cc:1716] Connecting to unix:/tmp/dist-test-taskPfacY3/test-tmp/rpc-test-f038fd50256042179ec074d034302cbe.sock
I20260924 16:02:05.431494 21371 test_util.cc:268] Using random seed: -1197592918
I20260924 16:02:05.470599 21811 rpc-test-base.h:240] got call: sleep_micros: 500 pattern: 4294967295 num_repetitions: 2097152 sidecar_idx: 0
I20260924 16:02:05.493775 21810 rpc-test-base.h:240] got call: sleep_micros: 500 pattern: 4294967295 num_repetitions: 2097152 sidecar_idx: 0
I20260924 16:02:05.535257 21811 rpc-test-base.h:240] got call: sleep_micros: 500 pattern: 4294967295 num_repetitions: 2097152 sidecar_idx: 0
I20260924 16:02:05.563077 21810 rpc-test-base.h:240] got call: sleep_micros: 500 pattern: 4294967295 num_repetitions: 2097152 sidecar_idx: 0
I20260924 16:02:05.596421 21811 rpc-test-base.h:240] got call: sleep_micros: 500 pattern: 4294967295 num_repetitions: 2097152 sidecar_idx: 0
I20260924 16:02:05.629288 21810 rpc-test-base.h:240] got call: sleep_micros: 500 pattern: 4294967295 num_repetitions: 2097152 sidecar_idx: 0
I20260924 16:02:05.663010 21811 rpc-test-base.h:240] got call: sleep_micros: 500 pattern: 4294967295 num_repetitions: 2097152 sidecar_idx: 0
W20260924 16:02:05.665086 21804 connection.cc:196] Error closing socket: Network error: TlsSocket::Close: Broken pipe
W20260924 16:02:05.688467 21804 connection.cc:441] server connection from unix:<unnamed> torn down before Call kudu.rpc.GenericCalculatorService.SleepWithSidecar from unix:<unnamed> (request call id 8) could send its response
W20260924 16:02:05.707659 21804 connection.cc:441] server connection from unix:<unnamed> torn down before Call kudu.rpc.GenericCalculatorService.SleepWithSidecar from unix:<unnamed> (request call id 9) could send its response
[ OK ] Parameters/TestRpc.TestCancellationAsync/SSL_UnixSocket (322 ms)
[ RUN ] Parameters/TestRpc.TestPerformanceBySocketType/SSL_UnixSocket
I20260924 16:02:05.728626 21832 acceptor_pool.cc:254] collecting diagnostics on the listening RPC socket unix:/tmp/dist-test-taskPfacY3/test-tmp/rpc-test-65abb8874ca34ce4a945bb9fdebebc47.sock every 8 connection(s)
I20260924 16:02:05.728902 21833 acceptor_pool.cc:254] collecting diagnostics on the listening RPC socket unix:/tmp/dist-test-taskPfacY3/test-tmp/rpc-test-65abb8874ca34ce4a945bb9fdebebc47.sock every 8 connection(s)
I20260924 16:02:05.729966 21371 rpc-test.cc:1846] Connecting to unix:/tmp/dist-test-taskPfacY3/test-tmp/rpc-test-65abb8874ca34ce4a945bb9fdebebc47.sock
I20260924 16:02:09.029050 21371 rpc-test.cc:1859] Sending 1024MB via ssl-enabled unix socket: real 3.289s user 3.251s sys 2.261s
I20260924 16:02:12.351687 21371 rpc-test.cc:1859] Sending 1024MB via ssl-enabled unix socket: real 3.322s user 3.266s sys 2.286s
I20260924 16:02:15.497507 21371 rpc-test.cc:1859] Sending 1024MB via ssl-enabled unix socket: real 3.146s user 2.919s sys 2.334s
I20260924 16:02:18.727137 21371 rpc-test.cc:1859] Sending 1024MB via ssl-enabled unix socket: real 3.230s user 2.985s sys 2.441s
I20260924 16:02:22.007632 21371 rpc-test.cc:1859] Sending 1024MB via ssl-enabled unix socket: real 3.280s user 3.113s sys 2.395s
W20260924 16:02:22.008775 21829 connection.cc:196] Error closing socket: Network error: TlsSocket::Close: Broken pipe
[ OK ] Parameters/TestRpc.TestPerformanceBySocketType/SSL_UnixSocket (16307 ms)
[----------] 20 tests from Parameters/TestRpc (53481 ms total)
[----------] 1 test from Parameters/TestRpcSocketTxRxQueue
[ RUN ] Parameters/TestRpcSocketTxRxQueue.AcceptorRxQueueSizeMetric/0
I20260924 16:02:22.028620 21857 acceptor_pool.cc:254] collecting diagnostics on the listening RPC socket 0.0.0.0:39607 every 1 connection(s)
I20260924 16:02:22.028867 21858 acceptor_pool.cc:254] collecting diagnostics on the listening RPC socket 0.0.0.0:39607 every 1 connection(s)
W20260924 16:02:22.030582 21853 negotiation.cc:337] Failed RPC negotiation. Trace:
0924 16:02:22.030167 (+ 0us) reactor.cc:625] Submitting negotiation task for server connection from 127.0.0.1:37726 (local address 127.0.0.1:39607)
0924 16:02:22.030330 (+ 163us) server_negotiation.cc:206] Beginning negotiation
0924 16:02:22.030334 (+ 4us) server_negotiation.cc:399] Waiting for connection header
0924 16:02:22.030447 (+ 113us) negotiation.cc:327] Negotiation complete: Network error: Server connection negotiation failed: server connection from 127.0.0.1:37726: BlockingRecv error: recv got EOF from 127.0.0.1:37726 (error 108)
Metrics: {"server-negotiator.queue_time_us":54}
[ OK ] Parameters/TestRpcSocketTxRxQueue.AcceptorRxQueueSizeMetric/0 (15 ms)
[----------] 1 test from Parameters/TestRpcSocketTxRxQueue (15 ms total)
[----------] Global test environment tear-down
[==========] 21 tests from 2 test suites ran. (53497 ms total)
[ PASSED ] 20 tests.
[ FAILED ] 1 test, listed below:
[ FAILED ] Parameters/TestRpc.TestCallWithChainCertAndChainCA/SSL_UnixSocket, where GetParam() = (true, true)
1 FAILED TEST