Diagnosed failure

Parameters/TestRpc.TestCallWithChainCertAndChainCA/SSL_TCP: /data0/somelongdirectorytoavoidrpathissues/src/kudu/src/kudu/rpc/rpc-test.cc:270: Failure
Failed
Bad status: Runtime error: could not verify certificate chain (error with cert: subject=CN = localhost, ST = sadfjas, C = AS, emailAddress = sdflkdsajf, O = lskdfjlsad, OU = sldfkja, issuer=C = AS, ST = ASDfkjdhf, L = lskdjf, O = saldfja, OU = skdjf, CN = localhost, emailAddress = sadjflkadsj): : certificate has expired
Google Test trace:
/data0/somelongdirectorytoavoidrpathissues/src/kudu/src/kudu/rpc/rpc-test.cc:267: Connecting to 0.0.0.0:43303
I20260923 14:37:00.356680  3067 test_util.cc:175] -----------------------------------------------
I20260923 14:37:00.356755  3067 test_util.cc:176] Had fatal failures, leaving test files at /tmp/dist-test-taskdDnBSJ/test-tmp/rpc-test.5.Parameters_TestRpc.TestCallWithChainCertAndChainCA_SSL_TCP.1790174220298232-3067-0

Full log

Note: This is test shard 6 of 8.
[==========] Running 21 tests from 2 test suites.
[----------] Global test environment set-up.
[----------] 20 tests from Parameters/TestRpc
[ RUN      ] Parameters/TestRpc.TestMessengerCreateDestroy/SSL_TCP
WARNING: Logging before InitGoogleLogging() is written to STDERR
I20260923 14:37:00.319721  3067 rpc-test.cc:169] started messenger TestCreateDestroy
[       OK ] Parameters/TestRpc.TestMessengerCreateDestroy/SSL_TCP (16 ms)
[ RUN      ] Parameters/TestRpc.TestNegotiationDeadlock/SSL_TCP
I20260923 14:37:00.327114  3087 acceptor_pool.cc:254] collecting diagnostics on the listening RPC socket 0.0.0.0:41227 every 8 connection(s)
I20260923 14:37:00.327162  3088 acceptor_pool.cc:254] collecting diagnostics on the listening RPC socket 0.0.0.0:41227 every 8 connection(s)
[       OK ] Parameters/TestRpc.TestNegotiationDeadlock/SSL_TCP (17 ms)
[ RUN      ] Parameters/TestRpc.TestCallWithChainCertAndChainCA/SSL_TCP
I20260923 14:37:00.351325  3103 acceptor_pool.cc:254] collecting diagnostics on the listening RPC socket 0.0.0.0:43303 every 8 connection(s)
I20260923 14:37:00.351377  3104 acceptor_pool.cc:254] collecting diagnostics on the listening RPC socket 0.0.0.0:43303 every 8 connection(s)
/data0/somelongdirectorytoavoidrpathissues/src/kudu/src/kudu/rpc/rpc-test.cc:270: Failure
Failed
Bad status: Runtime error: could not verify certificate chain (error with cert: subject=CN = localhost, ST = sadfjas, C = AS, emailAddress = sdflkdsajf, O = lskdfjlsad, OU = sldfkja, issuer=C = AS, ST = ASDfkjdhf, L = lskdjf, O = saldfja, OU = skdjf, CN = localhost, emailAddress = sadjflkadsj): : certificate has expired
Google Test trace:
/data0/somelongdirectorytoavoidrpathissues/src/kudu/src/kudu/rpc/rpc-test.cc:267: Connecting to 0.0.0.0:43303
I20260923 14:37:00.356680  3067 test_util.cc:175] -----------------------------------------------
I20260923 14:37:00.356755  3067 test_util.cc:176] Had fatal failures, leaving test files at /tmp/dist-test-taskdDnBSJ/test-tmp/rpc-test.5.Parameters_TestRpc.TestCallWithChainCertAndChainCA_SSL_TCP.1790174220298232-3067-0
[  FAILED  ] Parameters/TestRpc.TestCallWithChainCertAndChainCA/SSL_TCP, where GetParam() = (true, false) (17 ms)
[ RUN      ] Parameters/TestRpc.TestCallWithPasswordProtectedKey/SSL_TCP
I20260923 14:37:00.372187  3128 acceptor_pool.cc:254] collecting diagnostics on the listening RPC socket 0.0.0.0:38357 every 8 connection(s)
I20260923 14:37:00.372221  3129 acceptor_pool.cc:254] collecting diagnostics on the listening RPC socket 0.0.0.0:38357 every 8 connection(s)
[       OK ] Parameters/TestRpc.TestCallWithPasswordProtectedKey/SSL_TCP (32 ms)
[ RUN      ] Parameters/TestRpc.TestCallToBadServer/SSL_TCP
I20260923 14:37:00.397619  3067 rpc-test.cc:394] Status: Network error: Client connection negotiation failed: client connection to 0.0.0.0:0: connect: Connection refused (error 111)
I20260923 14:37:00.398195  3067 rpc-test.cc:394] Status: Network error: Client connection negotiation failed: client connection to 0.0.0.0:0: connect: Connection refused (error 111)
I20260923 14:37:00.398703  3067 rpc-test.cc:394] Status: Network error: Client connection negotiation failed: client connection to 0.0.0.0:0: connect: Connection refused (error 111)
I20260923 14:37:00.399160  3067 rpc-test.cc:394] Status: Network error: Client connection negotiation failed: client connection to 0.0.0.0:0: connect: Connection refused (error 111)
I20260923 14:37:00.399693  3067 rpc-test.cc:394] Status: Network error: Client connection negotiation failed: client connection to 0.0.0.0:0: connect: Connection refused (error 111)
[       OK ] Parameters/TestRpc.TestCallToBadServer/SSL_TCP (10 ms)
[ RUN      ] Parameters/TestRpc.TestWrongService/SSL_TCP
I20260923 14:37:00.408582  3163 acceptor_pool.cc:254] collecting diagnostics on the listening RPC socket 0.0.0.0:37349 every 8 connection(s)
I20260923 14:37:00.408619  3164 acceptor_pool.cc:254] collecting diagnostics on the listening RPC socket 0.0.0.0:37349 every 8 connection(s)
I20260923 14:37:00.430195  3161 messenger.cc:345] service WrongServiceName not registered on TestServer
[       OK ] Parameters/TestRpc.TestWrongService/SSL_TCP (32 ms)
[ RUN      ] Parameters/TestRpc.TestConnectionKeepalive/SSL_TCP
I20260923 14:37:00.440752  3186 acceptor_pool.cc:254] collecting diagnostics on the listening RPC socket 0.0.0.0:40255 every 8 connection(s)
I20260923 14:37:00.440809  3187 acceptor_pool.cc:254] collecting diagnostics on the listening RPC socket 0.0.0.0:40255 every 8 connection(s)
I20260923 14:37:00.441136  3067 rpc-test.cc:488] Connecting to 0.0.0.0:40255
[       OK ] Parameters/TestRpc.TestConnectionKeepalive/SSL_TCP (1026 ms)
[ RUN      ] Parameters/TestRpc.TestClientConnectionMetrics/SSL_TCP
I20260923 14:37:01.475658  3211 acceptor_pool.cc:254] collecting diagnostics on the listening RPC socket 0.0.0.0:33553 every 8 connection(s)
I20260923 14:37:01.475754  3212 acceptor_pool.cc:254] collecting diagnostics on the listening RPC socket 0.0.0.0:33553 every 8 connection(s)
I20260923 14:37:01.475996  3067 rpc-test.cc:569] Connecting to 0.0.0.0:33553
[       OK ] Parameters/TestRpc.TestClientConnectionMetrics/SSL_TCP (13280 ms)
[ RUN      ] Parameters/TestRpc.TestCredentialsPolicy/SSL_TCP
I20260923 14:37:14.748579  3234 acceptor_pool.cc:254] collecting diagnostics on the listening RPC socket 0.0.0.0:44069 every 8 connection(s)
I20260923 14:37:14.748682  3235 acceptor_pool.cc:254] collecting diagnostics on the listening RPC socket 0.0.0.0:44069 every 8 connection(s)
I20260923 14:37:14.748980  3067 rpc-test.cc:700] Connecting to 0.0.0.0:44069
[       OK ] Parameters/TestRpc.TestCredentialsPolicy/SSL_TCP (35 ms)
[ RUN      ] Parameters/TestRpc.TestCallLongerThanKeepalive/SSL_TCP
I20260923 14:37:14.783916  3259 acceptor_pool.cc:254] collecting diagnostics on the listening RPC socket 0.0.0.0:36867 every 8 connection(s)
I20260923 14:37:14.783951  3260 acceptor_pool.cc:254] collecting diagnostics on the listening RPC socket 0.0.0.0:36867 every 8 connection(s)
I20260923 14:37:14.801467  3263 rpc-test-base.h:222] got call: sleep_micros: 3000000 deferred: true
I20260923 14:37:17.802512  3263 rpcz_store.cc:275] Call kudu.rpc.GenericCalculatorService.Sleep from 127.0.0.1:33924 (request call id 0) took 3001 ms. Trace:
I20260923 14:37:17.802704  3263 rpcz_store.cc:276] 0923 14:37:14.801367 (+     0us) service_pool.cc:170] Inserting onto call queue
0923 14:37:14.801429 (+    62us) service_pool.cc:227] Handling call
0923 14:37:17.802488 (+3001059us) inbound_call.cc:173] Queueing success response
Metrics: {}
[       OK ] Parameters/TestRpc.TestCallLongerThanKeepalive/SSL_TCP (3030 ms)
[ RUN      ] Parameters/TestRpc.TestRpcSidecar/SSL_TCP
I20260923 14:37:17.825155  3284 acceptor_pool.cc:254] collecting diagnostics on the listening RPC socket 0.0.0.0:33309 every 8 connection(s)
I20260923 14:37:17.825266  3285 acceptor_pool.cc:254] collecting diagnostics on the listening RPC socket 0.0.0.0:33309 every 8 connection(s)
[       OK ] Parameters/TestRpc.TestRpcSidecar/SSL_TCP (101 ms)
[ RUN      ] Parameters/TestRpc.TestRpcSidecarLimits/SSL_TCP
I20260923 14:37:20.182649  3309 acceptor_pool.cc:254] collecting diagnostics on the listening RPC socket 0.0.0.0:46403 every 8 connection(s)
I20260923 14:37:20.182680  3310 acceptor_pool.cc:254] collecting diagnostics on the listening RPC socket 0.0.0.0:46403 every 8 connection(s)
W20260923 14:37:20.188482  3067 serialization.cc:72] Serialized kudu.rpc_test.PushStringsRequestPB (2147483654 bytes) is larger than the maximum configured RPC message size (52428800 bytes). Sending anyway, but peer may reject the data.
W20260923 14:37:20.192855  3308 connection.cc:535] server connection from 127.0.0.1:58518 recv error: Network error: RPC frame had a length of 2147483714, but we only support messages up to 52428800 bytes long.
W20260923 14:37:20.192924  3308 connection.cc:158] shutting down server connection from 127.0.0.1:58518 with pending inbound data: 4/2147483714 bytes received; last active 0 ns ago: status Network error: RPC frame had a length of 2147483714, but we only support messages up to 52428800 bytes long.
W20260923 14:37:20.193112  3322 connection.cc:698] client connection to 0.0.0.0:46403 send error: Network error: failed to write to TLS socket: Connection reset by peer
W20260923 14:37:20.193331  3322 connection.cc:196] Error closing socket: Network error: TlsSocket::Close: Success
I20260923 14:37:20.214746  3335 acceptor_pool.cc:254] collecting diagnostics on the listening RPC socket 0.0.0.0:41493 every 8 connection(s)
I20260923 14:37:20.214717  3334 acceptor_pool.cc:254] collecting diagnostics on the listening RPC socket 0.0.0.0:41493 every 8 connection(s)
W20260923 14:37:25.098345  3333 connection.cc:577] server connection from 127.0.0.1:46794: received bad data: 'Corruption: Invalid packet: message had a length of 2147483710, but we only support messages up to 2147483647 bytes
'
[       OK ] Parameters/TestRpc.TestRpcSidecarLimits/SSL_TCP (7194 ms)
[ RUN      ] Parameters/TestRpc.TestCallTimeoutDoesntAffectNegotiation/SSL_TCP
I20260923 14:37:25.117177  3359 acceptor_pool.cc:254] collecting diagnostics on the listening RPC socket 0.0.0.0:33879 every 8 connection(s)
I20260923 14:37:25.117318  3360 acceptor_pool.cc:254] collecting diagnostics on the listening RPC socket 0.0.0.0:33879 every 8 connection(s)
W20260923 14:37:25.136981  3355 negotiation.cc:266] Injecting 500ms delay in negotiation
I20260923 14:37:25.187250  3067 rpc-test-base.h:595] status: Timed out: connection negotiation to 0.0.0.0:33879 for RPC Sleep timed out after 0.050s (ON_OUTBOUND_QUEUE), seconds elapsed: 0.0509561
[       OK ] Parameters/TestRpc.TestCallTimeoutDoesntAffectNegotiation/SSL_TCP (542 ms)
[ RUN      ] Parameters/TestRpc.TestRpcHandlerLatencyMetric/SSL_TCP
I20260923 14:37:25.658952  3384 acceptor_pool.cc:254] collecting diagnostics on the listening RPC socket 0.0.0.0:37493 every 8 connection(s)
I20260923 14:37:25.659001  3385 acceptor_pool.cc:254] collecting diagnostics on the listening RPC socket 0.0.0.0:37493 every 8 connection(s)
I20260923 14:37:25.692868  3067 rpc-test.cc:1236] Sleep() min lat: 20516
I20260923 14:37:25.692943  3067 rpc-test.cc:1237] Sleep() mean lat: 20516
I20260923 14:37:25.692977  3067 rpc-test.cc:1238] Sleep() max lat: 20516
I20260923 14:37:25.692991  3067 rpc-test.cc:1239] Sleep() #calls: 1
[       OK ] Parameters/TestRpc.TestRpcHandlerLatencyMetric/SSL_TCP (51 ms)
[ RUN      ] Parameters/TestRpc.TimedOutOnResponseMetricServiceQueue/SSL_TCP
I20260923 14:37:25.714329  3410 acceptor_pool.cc:254] collecting diagnostics on the listening RPC socket 0.0.0.0:45439 every 8 connection(s)
I20260923 14:37:25.714346  3411 acceptor_pool.cc:254] collecting diagnostics on the listening RPC socket 0.0.0.0:45439 every 8 connection(s)
W20260923 14:37:25.791926  3412 rpcz_store.cc:267] Call kudu.rpc_test.CalculatorService.Sleep from 127.0.0.1:43126 (request call id 2) took 20 ms (client timeout 20 ms). Trace:
W20260923 14:37:25.792054  3412 rpcz_store.cc:269] 0923 14:37:25.771508 (+     0us) service_pool.cc:170] Inserting onto call queue
0923 14:37:25.791875 (+ 20367us) service_pool.cc:214] Skipping call since client already timed out
0923 14:37:25.791909 (+    34us) inbound_call.cc:173] Queueing failure response
Metrics: {}
[       OK ] Parameters/TestRpc.TimedOutOnResponseMetricServiceQueue/SSL_TCP (97 ms)
[ RUN      ] Parameters/TestRpc.RpcPendingConnectionsMetric/SSL_TCP
I20260923 14:37:25.796646  3433 acceptor_pool.cc:254] collecting diagnostics on the listening RPC socket 0.0.0.0:44139 every 8 connection(s)
I20260923 14:37:25.796708  3434 acceptor_pool.cc:254] collecting diagnostics on the listening RPC socket 0.0.0.0:44139 every 8 connection(s)
W20260923 14:37:25.798334  3429 negotiation.cc:337] Failed RPC negotiation. Trace:
0923 14:37:25.797554 (+     0us) reactor.cc:625] Submitting negotiation task for server connection from 127.0.0.1:39508 (local address 127.0.0.1:44139)
0923 14:37:25.797857 (+   303us) server_negotiation.cc:206] Beginning negotiation
0923 14:37:25.797862 (+     5us) server_negotiation.cc:399] Waiting for connection header
0923 14:37:25.798036 (+   174us) negotiation.cc:327] Negotiation complete: Network error: Server connection negotiation failed: server connection from 127.0.0.1:39508: BlockingRecv error: recv got EOF from 127.0.0.1:39508 (error 108)
Metrics: {"server-negotiator.queue_time_us":155}
[       OK ] Parameters/TestRpc.RpcPendingConnectionsMetric/SSL_TCP (15 ms)
[ RUN      ] Parameters/TestRpc.TestRpcContextClientDeadline/SSL_TCP
I20260923 14:37:25.833729  3450 acceptor_pool.cc:254] collecting diagnostics on the listening RPC socket 0.0.0.0:46449 every 8 connection(s)
I20260923 14:37:25.833843  3449 acceptor_pool.cc:254] collecting diagnostics on the listening RPC socket 0.0.0.0:46449 every 8 connection(s)
[       OK ] Parameters/TestRpc.TestRpcContextClientDeadline/SSL_TCP (67 ms)
[ RUN      ] Parameters/TestRpc.TestApplicationFeatureFlagUnsupportedServer/SSL_TCP
I20260923 14:37:25.893819  3474 acceptor_pool.cc:254] collecting diagnostics on the listening RPC socket 0.0.0.0:46787 every 8 connection(s)
I20260923 14:37:25.893844  3475 acceptor_pool.cc:254] collecting diagnostics on the listening RPC socket 0.0.0.0:46787 every 8 connection(s)
[       OK ] Parameters/TestRpc.TestApplicationFeatureFlagUnsupportedServer/SSL_TCP (38 ms)
[ RUN      ] Parameters/TestRpc.TestCancellationAsync/SSL_TCP
I20260923 14:37:25.930663  3499 acceptor_pool.cc:254] collecting diagnostics on the listening RPC socket 0.0.0.0:45559 every 8 connection(s)
I20260923 14:37:25.930684  3500 acceptor_pool.cc:254] collecting diagnostics on the listening RPC socket 0.0.0.0:45559 every 8 connection(s)
I20260923 14:37:25.930987  3067 rpc-test.cc:1716] Connecting to 0.0.0.0:45559
I20260923 14:37:25.939309  3067 test_util.cc:268] Using random seed: 1812195434
I20260923 14:37:25.961737  3503 rpc-test-base.h:240] got call: sleep_micros: 500 pattern: 4294967295 num_repetitions: 2097152 sidecar_idx: 0
I20260923 14:37:25.980182  3502 rpc-test-base.h:240] got call: sleep_micros: 500 pattern: 4294967295 num_repetitions: 2097152 sidecar_idx: 0
I20260923 14:37:25.997357  3503 rpc-test-base.h:240] got call: sleep_micros: 500 pattern: 4294967295 num_repetitions: 2097152 sidecar_idx: 0
I20260923 14:37:26.017272  3502 rpc-test-base.h:240] got call: sleep_micros: 500 pattern: 4294967295 num_repetitions: 2097152 sidecar_idx: 0
I20260923 14:37:26.036711  3503 rpc-test-base.h:240] got call: sleep_micros: 500 pattern: 4294967295 num_repetitions: 2097152 sidecar_idx: 0
I20260923 14:37:26.055932  3502 rpc-test-base.h:240] got call: sleep_micros: 500 pattern: 4294967295 num_repetitions: 2097152 sidecar_idx: 0
I20260923 14:37:26.080317  3503 rpc-test-base.h:240] got call: sleep_micros: 500 pattern: 4294967295 num_repetitions: 2097152 sidecar_idx: 0
I20260923 14:37:26.110791  3503 rpc-test-base.h:240] got call: sleep_micros: 500 pattern: 4294967295 num_repetitions: 2097152 sidecar_idx: 0
W20260923 14:37:26.129338  3497 connection.cc:441] server connection from 127.0.0.1:36204 torn down before Call kudu.rpc.GenericCalculatorService.SleepWithSidecar from 127.0.0.1:36204 (request call id 9) could send its response
[       OK ] Parameters/TestRpc.TestCancellationAsync/SSL_TCP (214 ms)
[ RUN      ] Parameters/TestRpc.TestPerformanceBySocketType/SSL_TCP
I20260923 14:37:26.165122  3524 acceptor_pool.cc:254] collecting diagnostics on the listening RPC socket 0.0.0.0:37899 every 8 connection(s)
I20260923 14:37:26.165138  3525 acceptor_pool.cc:254] collecting diagnostics on the listening RPC socket 0.0.0.0:37899 every 8 connection(s)
I20260923 14:37:26.165416  3067 rpc-test.cc:1846] Connecting to 0.0.0.0:37899
I20260923 14:37:28.733137  3067 rpc-test.cc:1859] Sending 1024MB via ssl-enabled tcp socket: real 2.534s	user 2.749s	sys 1.713s
I20260923 14:37:31.204239  3067 rpc-test.cc:1859] Sending 1024MB via ssl-enabled tcp socket: real 2.471s	user 2.538s	sys 1.787s
I20260923 14:37:33.478662  3067 rpc-test.cc:1859] Sending 1024MB via ssl-enabled tcp socket: real 2.274s	user 2.410s	sys 1.609s
I20260923 14:37:35.753010  3067 rpc-test.cc:1859] Sending 1024MB via ssl-enabled tcp socket: real 2.274s	user 2.468s	sys 1.560s
I20260923 14:37:37.997139  3067 rpc-test.cc:1859] Sending 1024MB via ssl-enabled tcp socket: real 2.244s	user 2.303s	sys 1.668s
[       OK ] Parameters/TestRpc.TestPerformanceBySocketType/SSL_TCP (11868 ms)
[----------] 20 tests from Parameters/TestRpc (37694 ms total)

[----------] 1 test from Parameters/TestRpcSocketTxRxQueue
[ RUN      ] Parameters/TestRpcSocketTxRxQueue.OverCapacity/0
W20260923 14:37:38.277086  3586 negotiation.cc:337] Failed RPC negotiation. Trace:
0923 14:37:38.014164 (+     0us) reactor.cc:625] Submitting negotiation task for client connection to 0.0.0.0:39805 (local address 127.0.0.1:54874)
0923 14:37:38.014288 (+   124us) negotiation.cc:107] Waiting for socket to connect
0923 14:37:38.014301 (+    13us) client_negotiation.cc:174] Beginning negotiation
0923 14:37:38.014381 (+    80us) client_negotiation.cc:252] Sending NEGOTIATE NegotiatePB request
0923 14:37:38.276991 (+262610us) negotiation.cc:327] Negotiation complete: Network error: Client connection negotiation failed: client connection to 0.0.0.0:39805: BlockingRecv error: recv error from unknown peer: Transport endpoint is not connected (error 107)
Metrics: {"client-negotiator.queue_time_us":45}
W20260923 14:37:38.277210  3550 negotiation.cc:337] Failed RPC negotiation. Trace:
0923 14:37:38.009233 (+     0us) reactor.cc:625] Submitting negotiation task for client connection to 0.0.0.0:39805 (local address 127.0.0.1:54822)
0923 14:37:38.009346 (+   113us) negotiation.cc:107] Waiting for socket to connect
0923 14:37:38.009359 (+    13us) client_negotiation.cc:174] Beginning negotiation
0923 14:37:38.009441 (+    82us) client_negotiation.cc:252] Sending NEGOTIATE NegotiatePB request
0923 14:37:38.276819 (+267378us) negotiation.cc:327] Negotiation complete: Network error: Client connection negotiation failed: client connection to 0.0.0.0:39805: BlockingRecv error: recv error from unknown peer: Transport endpoint is not connected (error 107)
Metrics: {"client-negotiator.queue_time_us":46}
W20260923 14:37:38.277381  3568 negotiation.cc:337] Failed RPC negotiation. Trace:
0923 14:37:38.011604 (+     0us) reactor.cc:625] Submitting negotiation task for client connection to 0.0.0.0:39805 (local address 127.0.0.1:54852)
0923 14:37:38.011708 (+   104us) negotiation.cc:107] Waiting for socket to connect
0923 14:37:38.011720 (+    12us) client_negotiation.cc:174] Beginning negotiation
0923 14:37:38.011793 (+    73us) client_negotiation.cc:252] Sending NEGOTIATE NegotiatePB request
0923 14:37:38.276830 (+265037us) negotiation.cc:327] Negotiation complete: Network error: Client connection negotiation failed: client connection to 0.0.0.0:39805: BlockingRecv error: recv error from unknown peer: Transport endpoint is not connected (error 107)
Metrics: {"client-negotiator.queue_time_us":44}
W20260923 14:37:38.277428  3559 negotiation.cc:337] Failed RPC negotiation. Trace:
0923 14:37:38.010419 (+     0us) reactor.cc:625] Submitting negotiation task for client connection to 0.0.0.0:39805 (local address 127.0.0.1:54838)
0923 14:37:38.010530 (+   111us) negotiation.cc:107] Waiting for socket to connect
0923 14:37:38.010549 (+    19us) client_negotiation.cc:174] Beginning negotiation
0923 14:37:38.010624 (+    75us) client_negotiation.cc:252] Sending NEGOTIATE NegotiatePB request
0923 14:37:38.276830 (+266206us) negotiation.cc:327] Negotiation complete: Network error: Client connection negotiation failed: client connection to 0.0.0.0:39805: BlockingRecv error: recv error from unknown peer: Transport endpoint is not connected (error 107)
Metrics: {"client-negotiator.queue_time_us":46}
W20260923 14:37:38.277026  3540 negotiation.cc:337] Failed RPC negotiation. Trace:
0923 14:37:38.008009 (+     0us) reactor.cc:625] Submitting negotiation task for client connection to 0.0.0.0:39805 (local address 127.0.0.1:54816)
0923 14:37:38.008123 (+   114us) negotiation.cc:107] Waiting for socket to connect
0923 14:37:38.008138 (+    15us) client_negotiation.cc:174] Beginning negotiation
0923 14:37:38.008235 (+    97us) client_negotiation.cc:252] Sending NEGOTIATE NegotiatePB request
0923 14:37:38.276819 (+268584us) negotiation.cc:327] Negotiation complete: Network error: Client connection negotiation failed: client connection to 0.0.0.0:39805: BlockingRecv error: recv error from unknown peer: Transport endpoint is not connected (error 107)
Metrics: {"client-negotiator.queue_time_us":45}
W20260923 14:37:38.277026  3577 negotiation.cc:337] Failed RPC negotiation. Trace:
0923 14:37:38.012900 (+     0us) reactor.cc:625] Submitting negotiation task for client connection to 0.0.0.0:39805 (local address 127.0.0.1:54868)
0923 14:37:38.013007 (+   107us) negotiation.cc:107] Waiting for socket to connect
0923 14:37:38.013023 (+    16us) client_negotiation.cc:174] Beginning negotiation
0923 14:37:38.013111 (+    88us) client_negotiation.cc:252] Sending NEGOTIATE NegotiatePB request
0923 14:37:38.276939 (+263828us) negotiation.cc:327] Negotiation complete: Network error: Client connection negotiation failed: client connection to 0.0.0.0:39805: BlockingRecv error: recv error from unknown peer: Transport endpoint is not connected (error 107)
Metrics: {"client-negotiator.queue_time_us":25}
[       OK ] Parameters/TestRpcSocketTxRxQueue.OverCapacity/0 (1050 ms)
[----------] 1 test from Parameters/TestRpcSocketTxRxQueue (1050 ms total)

[----------] Global test environment tear-down
[==========] 21 tests from 2 test suites ran. (38745 ms total)
[  PASSED  ] 20 tests.
[  FAILED  ] 1 test, listed below:
[  FAILED  ] Parameters/TestRpc.TestCallWithChainCertAndChainCA/SSL_TCP, where GetParam() = (true, false)

 1 FAILED TEST