Diagnosed failure

Parameters/TestRpc.TestCallWithChainCertAndChainCA/SSL_TCP: /data0/somelongdirectorytoavoidrpathissues/src/kudu/src/kudu/rpc/rpc-test.cc:270: Failure
Failed
Bad status: Runtime error: could not verify certificate chain (error with cert: subject=CN = localhost, ST = sadfjas, C = AS, emailAddress = sdflkdsajf, O = lskdfjlsad, OU = sldfkja, issuer=C = AS, ST = ASDfkjdhf, L = lskdjf, O = saldfja, OU = skdjf, CN = localhost, emailAddress = sadjflkadsj): : certificate has expired
Google Test trace:
/data0/somelongdirectorytoavoidrpathissues/src/kudu/src/kudu/rpc/rpc-test.cc:267: Connecting to 0.0.0.0:42219
I20260925 21:58:33.401832  1237 test_util.cc:175] -----------------------------------------------
I20260925 21:58:33.401895  1237 test_util.cc:176] Had fatal failures, leaving test files at /tmp/dist-test-task3bc8WR/test-tmp/rpc-test.5.Parameters_TestRpc.TestCallWithChainCertAndChainCA_SSL_TCP.1790373513325294-1237-0

Full log

Note: This is test shard 6 of 8.
[==========] Running 21 tests from 2 test suites.
[----------] Global test environment set-up.
[----------] 20 tests from Parameters/TestRpc
[ RUN      ] Parameters/TestRpc.TestMessengerCreateDestroy/SSL_TCP
WARNING: Logging before InitGoogleLogging() is written to STDERR
I20260925 21:58:33.344627  1237 rpc-test.cc:169] started messenger TestCreateDestroy
[       OK ] Parameters/TestRpc.TestMessengerCreateDestroy/SSL_TCP (17 ms)
[ RUN      ] Parameters/TestRpc.TestNegotiationDeadlock/SSL_TCP
I20260925 21:58:33.361073  1258 acceptor_pool.cc:254] collecting diagnostics on the listening RPC socket 0.0.0.0:37143 every 8 connection(s)
I20260925 21:58:33.361073  1257 acceptor_pool.cc:254] collecting diagnostics on the listening RPC socket 0.0.0.0:37143 every 8 connection(s)
[       OK ] Parameters/TestRpc.TestNegotiationDeadlock/SSL_TCP (23 ms)
[ RUN      ] Parameters/TestRpc.TestCallWithChainCertAndChainCA/SSL_TCP
I20260925 21:58:33.396903  1274 acceptor_pool.cc:254] collecting diagnostics on the listening RPC socket 0.0.0.0:42219 every 8 connection(s)
I20260925 21:58:33.396973  1273 acceptor_pool.cc:254] collecting diagnostics on the listening RPC socket 0.0.0.0:42219 every 8 connection(s)
/data0/somelongdirectorytoavoidrpathissues/src/kudu/src/kudu/rpc/rpc-test.cc:270: Failure
Failed
Bad status: Runtime error: could not verify certificate chain (error with cert: subject=CN = localhost, ST = sadfjas, C = AS, emailAddress = sdflkdsajf, O = lskdfjlsad, OU = sldfkja, issuer=C = AS, ST = ASDfkjdhf, L = lskdjf, O = saldfja, OU = skdjf, CN = localhost, emailAddress = sadjflkadsj): : certificate has expired
Google Test trace:
/data0/somelongdirectorytoavoidrpathissues/src/kudu/src/kudu/rpc/rpc-test.cc:267: Connecting to 0.0.0.0:42219
I20260925 21:58:33.401832  1237 test_util.cc:175] -----------------------------------------------
I20260925 21:58:33.401895  1237 test_util.cc:176] Had fatal failures, leaving test files at /tmp/dist-test-task3bc8WR/test-tmp/rpc-test.5.Parameters_TestRpc.TestCallWithChainCertAndChainCA_SSL_TCP.1790373513325294-1237-0
[  FAILED  ] Parameters/TestRpc.TestCallWithChainCertAndChainCA/SSL_TCP, where GetParam() = (true, false) (32 ms)
[ RUN      ] Parameters/TestRpc.TestCallWithPasswordProtectedKey/SSL_TCP
I20260925 21:58:33.426795  1298 acceptor_pool.cc:254] collecting diagnostics on the listening RPC socket 0.0.0.0:43273 every 8 connection(s)
I20260925 21:58:33.426851  1299 acceptor_pool.cc:254] collecting diagnostics on the listening RPC socket 0.0.0.0:43273 every 8 connection(s)
[       OK ] Parameters/TestRpc.TestCallWithPasswordProtectedKey/SSL_TCP (39 ms)
[ RUN      ] Parameters/TestRpc.TestCallToBadServer/SSL_TCP
I20260925 21:58:33.456135  1237 rpc-test.cc:394] Status: Network error: Client connection negotiation failed: client connection to 0.0.0.0:0: connect: Connection refused (error 111)
I20260925 21:58:33.456473  1237 rpc-test.cc:394] Status: Network error: Client connection negotiation failed: client connection to 0.0.0.0:0: connect: Connection refused (error 111)
I20260925 21:58:33.456696  1237 rpc-test.cc:394] Status: Network error: Client connection negotiation failed: client connection to 0.0.0.0:0: connect: Connection refused (error 111)
I20260925 21:58:33.456992  1237 rpc-test.cc:394] Status: Network error: Client connection negotiation failed: client connection to 0.0.0.0:0: connect: Connection refused (error 111)
I20260925 21:58:33.457181  1237 rpc-test.cc:394] Status: Network error: Client connection negotiation failed: client connection to 0.0.0.0:0: connect: Connection refused (error 111)
[       OK ] Parameters/TestRpc.TestCallToBadServer/SSL_TCP (16 ms)
[ RUN      ] Parameters/TestRpc.TestWrongService/SSL_TCP
I20260925 21:58:33.476739  1333 acceptor_pool.cc:254] collecting diagnostics on the listening RPC socket 0.0.0.0:39553 every 8 connection(s)
I20260925 21:58:33.476755  1334 acceptor_pool.cc:254] collecting diagnostics on the listening RPC socket 0.0.0.0:39553 every 8 connection(s)
I20260925 21:58:33.500530  1331 messenger.cc:345] service WrongServiceName not registered on TestServer
[       OK ] Parameters/TestRpc.TestWrongService/SSL_TCP (44 ms)
[ RUN      ] Parameters/TestRpc.TestConnectionKeepalive/SSL_TCP
I20260925 21:58:33.506343  1356 acceptor_pool.cc:254] collecting diagnostics on the listening RPC socket 0.0.0.0:35313 every 8 connection(s)
I20260925 21:58:33.506395  1357 acceptor_pool.cc:254] collecting diagnostics on the listening RPC socket 0.0.0.0:35313 every 8 connection(s)
I20260925 21:58:33.506546  1237 rpc-test.cc:488] Connecting to 0.0.0.0:35313
[       OK ] Parameters/TestRpc.TestConnectionKeepalive/SSL_TCP (1027 ms)
[ RUN      ] Parameters/TestRpc.TestClientConnectionMetrics/SSL_TCP
I20260925 21:58:34.548924  1381 acceptor_pool.cc:254] collecting diagnostics on the listening RPC socket 0.0.0.0:34233 every 8 connection(s)
I20260925 21:58:34.548971  1382 acceptor_pool.cc:254] collecting diagnostics on the listening RPC socket 0.0.0.0:34233 every 8 connection(s)
I20260925 21:58:34.549147  1237 rpc-test.cc:569] Connecting to 0.0.0.0:34233
[       OK ] Parameters/TestRpc.TestClientConnectionMetrics/SSL_TCP (10366 ms)
[ RUN      ] Parameters/TestRpc.TestCredentialsPolicy/SSL_TCP
I20260925 21:58:44.922858  1404 acceptor_pool.cc:254] collecting diagnostics on the listening RPC socket 0.0.0.0:41929 every 8 connection(s)
I20260925 21:58:44.922904  1405 acceptor_pool.cc:254] collecting diagnostics on the listening RPC socket 0.0.0.0:41929 every 8 connection(s)
I20260925 21:58:44.923069  1237 rpc-test.cc:700] Connecting to 0.0.0.0:41929
[       OK ] Parameters/TestRpc.TestCredentialsPolicy/SSL_TCP (54 ms)
[ RUN      ] Parameters/TestRpc.TestCallLongerThanKeepalive/SSL_TCP
I20260925 21:58:44.968792  1429 acceptor_pool.cc:254] collecting diagnostics on the listening RPC socket 0.0.0.0:42479 every 8 connection(s)
I20260925 21:58:44.968840  1430 acceptor_pool.cc:254] collecting diagnostics on the listening RPC socket 0.0.0.0:42479 every 8 connection(s)
I20260925 21:58:44.998589  1433 rpc-test-base.h:222] got call: sleep_micros: 3000000 deferred: true
I20260925 21:58:47.999332  1433 rpcz_store.cc:275] Call kudu.rpc.GenericCalculatorService.Sleep from 127.0.0.1:33176 (request call id 0) took 3000 ms. Trace:
I20260925 21:58:47.999545  1433 rpcz_store.cc:276] 0925 21:58:44.998525 (+     0us) service_pool.cc:170] Inserting onto call queue
0925 21:58:44.998564 (+    39us) service_pool.cc:227] Handling call
0925 21:58:47.999316 (+3000752us) inbound_call.cc:173] Queueing success response
Metrics: {}
[       OK ] Parameters/TestRpc.TestCallLongerThanKeepalive/SSL_TCP (3051 ms)
[ RUN      ] Parameters/TestRpc.TestRpcSidecar/SSL_TCP
I20260925 21:58:48.021291  1454 acceptor_pool.cc:254] collecting diagnostics on the listening RPC socket 0.0.0.0:37183 every 8 connection(s)
I20260925 21:58:48.021327  1455 acceptor_pool.cc:254] collecting diagnostics on the listening RPC socket 0.0.0.0:37183 every 8 connection(s)
[       OK ] Parameters/TestRpc.TestRpcSidecar/SSL_TCP (64 ms)
[ RUN      ] Parameters/TestRpc.TestRpcSidecarLimits/SSL_TCP
I20260925 21:58:49.861509  1479 acceptor_pool.cc:254] collecting diagnostics on the listening RPC socket 0.0.0.0:44671 every 8 connection(s)
I20260925 21:58:49.861552  1480 acceptor_pool.cc:254] collecting diagnostics on the listening RPC socket 0.0.0.0:44671 every 8 connection(s)
W20260925 21:58:49.869120  1237 serialization.cc:72] Serialized kudu.rpc_test.PushStringsRequestPB (2147483654 bytes) is larger than the maximum configured RPC message size (52428800 bytes). Sending anyway, but peer may reject the data.
W20260925 21:58:49.872458  1476 connection.cc:535] server connection from 127.0.0.1:54324 recv error: Network error: RPC frame had a length of 2147483714, but we only support messages up to 52428800 bytes long.
W20260925 21:58:49.872517  1476 connection.cc:158] shutting down server connection from 127.0.0.1:54324 with pending inbound data: 4/2147483714 bytes received; last active 0 ns ago: status Network error: RPC frame had a length of 2147483714, but we only support messages up to 52428800 bytes long.
W20260925 21:58:49.872722  1492 connection.cc:196] Error closing socket: Network error: TlsSocket::Close: Connection reset by peer
I20260925 21:58:49.882786  1504 acceptor_pool.cc:254] collecting diagnostics on the listening RPC socket 0.0.0.0:34601 every 8 connection(s)
I20260925 21:58:49.882804  1505 acceptor_pool.cc:254] collecting diagnostics on the listening RPC socket 0.0.0.0:34601 every 8 connection(s)
W20260925 21:58:53.866297  1503 connection.cc:577] server connection from 127.0.0.1:56714: received bad data: 'Corruption: Invalid packet: message had a length of 2147483710, but we only support messages up to 2147483647 bytes
'
[       OK ] Parameters/TestRpc.TestRpcSidecarLimits/SSL_TCP (5802 ms)
[ RUN      ] Parameters/TestRpc.TestCallTimeoutDoesntAffectNegotiation/SSL_TCP
I20260925 21:58:53.896337  1529 acceptor_pool.cc:254] collecting diagnostics on the listening RPC socket 0.0.0.0:35945 every 8 connection(s)
I20260925 21:58:53.896370  1530 acceptor_pool.cc:254] collecting diagnostics on the listening RPC socket 0.0.0.0:35945 every 8 connection(s)
W20260925 21:58:53.914248  1525 negotiation.cc:266] Injecting 500ms delay in negotiation
I20260925 21:58:53.964474  1237 rpc-test-base.h:595] status: Timed out: connection negotiation to 0.0.0.0:35945 for RPC Sleep timed out after 0.050s (ON_OUTBOUND_QUEUE), seconds elapsed: 0.0506738
[       OK ] Parameters/TestRpc.TestCallTimeoutDoesntAffectNegotiation/SSL_TCP (550 ms)
[ RUN      ] Parameters/TestRpc.TestRpcHandlerLatencyMetric/SSL_TCP
I20260925 21:58:54.429193  1554 acceptor_pool.cc:254] collecting diagnostics on the listening RPC socket 0.0.0.0:45963 every 8 connection(s)
I20260925 21:58:54.429306  1555 acceptor_pool.cc:254] collecting diagnostics on the listening RPC socket 0.0.0.0:45963 every 8 connection(s)
I20260925 21:58:54.475181  1237 rpc-test.cc:1236] Sleep() min lat: 20339
I20260925 21:58:54.475251  1237 rpc-test.cc:1237] Sleep() mean lat: 20339
I20260925 21:58:54.475278  1237 rpc-test.cc:1238] Sleep() max lat: 20339
I20260925 21:58:54.475292  1237 rpc-test.cc:1239] Sleep() #calls: 1
[       OK ] Parameters/TestRpc.TestRpcHandlerLatencyMetric/SSL_TCP (57 ms)
[ RUN      ] Parameters/TestRpc.TimedOutOnResponseMetricServiceQueue/SSL_TCP
I20260925 21:58:54.487008  1581 acceptor_pool.cc:254] collecting diagnostics on the listening RPC socket 0.0.0.0:37625 every 8 connection(s)
I20260925 21:58:54.487063  1580 acceptor_pool.cc:254] collecting diagnostics on the listening RPC socket 0.0.0.0:37625 every 8 connection(s)
W20260925 21:58:54.540969  1582 rpcz_store.cc:267] Call kudu.rpc_test.CalculatorService.Sleep from 127.0.0.1:44688 (request call id 2) took 20 ms (client timeout 20 ms). Trace:
W20260925 21:58:54.541069  1582 rpcz_store.cc:269] 0925 21:58:54.520613 (+     0us) service_pool.cc:170] Inserting onto call queue
0925 21:58:54.540913 (+ 20300us) service_pool.cc:214] Skipping call since client already timed out
0925 21:58:54.540926 (+    13us) inbound_call.cc:173] Queueing failure response
Metrics: {}
[       OK ] Parameters/TestRpc.TimedOutOnResponseMetricServiceQueue/SSL_TCP (66 ms)
[ RUN      ] Parameters/TestRpc.RpcPendingConnectionsMetric/SSL_TCP
I20260925 21:58:54.545279  1603 acceptor_pool.cc:254] collecting diagnostics on the listening RPC socket 0.0.0.0:45539 every 8 connection(s)
I20260925 21:58:54.545357  1604 acceptor_pool.cc:254] collecting diagnostics on the listening RPC socket 0.0.0.0:45539 every 8 connection(s)
W20260925 21:58:54.557379  1599 negotiation.cc:337] Failed RPC negotiation. Trace:
0925 21:58:54.557059 (+     0us) reactor.cc:625] Submitting negotiation task for server connection from 127.0.0.1:41856 (local address 127.0.0.1:45539)
0925 21:58:54.557146 (+    87us) server_negotiation.cc:206] Beginning negotiation
0925 21:58:54.557149 (+     3us) server_negotiation.cc:399] Waiting for connection header
0925 21:58:54.557273 (+   124us) negotiation.cc:327] Negotiation complete: Network error: Server connection negotiation failed: server connection from 127.0.0.1:41856: BlockingRecv error: recv got EOF from 127.0.0.1:41856 (error 108)
Metrics: {"server-negotiator.queue_time_us":36}
[       OK ] Parameters/TestRpc.RpcPendingConnectionsMetric/SSL_TCP (24 ms)
[ RUN      ] Parameters/TestRpc.TestRpcContextClientDeadline/SSL_TCP
I20260925 21:58:54.584749  1619 acceptor_pool.cc:254] collecting diagnostics on the listening RPC socket 0.0.0.0:43711 every 8 connection(s)
I20260925 21:58:54.584766  1620 acceptor_pool.cc:254] collecting diagnostics on the listening RPC socket 0.0.0.0:43711 every 8 connection(s)
[       OK ] Parameters/TestRpc.TestRpcContextClientDeadline/SSL_TCP (55 ms)
[ RUN      ] Parameters/TestRpc.TestApplicationFeatureFlagUnsupportedServer/SSL_TCP
I20260925 21:58:54.638316  1644 acceptor_pool.cc:254] collecting diagnostics on the listening RPC socket 0.0.0.0:43341 every 8 connection(s)
I20260925 21:58:54.638345  1645 acceptor_pool.cc:254] collecting diagnostics on the listening RPC socket 0.0.0.0:43341 every 8 connection(s)
[       OK ] Parameters/TestRpc.TestApplicationFeatureFlagUnsupportedServer/SSL_TCP (52 ms)
[ RUN      ] Parameters/TestRpc.TestCancellationAsync/SSL_TCP
I20260925 21:58:54.703029  1669 acceptor_pool.cc:254] collecting diagnostics on the listening RPC socket 0.0.0.0:46713 every 8 connection(s)
I20260925 21:58:54.703063  1670 acceptor_pool.cc:254] collecting diagnostics on the listening RPC socket 0.0.0.0:46713 every 8 connection(s)
I20260925 21:58:54.703222  1237 rpc-test.cc:1716] Connecting to 0.0.0.0:46713
I20260925 21:58:54.708606  1237 test_util.cc:268] Using random seed: -762498180
I20260925 21:58:54.726562  1673 rpc-test-base.h:240] got call: sleep_micros: 500 pattern: 4294967295 num_repetitions: 2097152 sidecar_idx: 0
I20260925 21:58:54.739023  1673 rpc-test-base.h:240] got call: sleep_micros: 500 pattern: 4294967295 num_repetitions: 2097152 sidecar_idx: 0
I20260925 21:58:54.754110  1673 rpc-test-base.h:240] got call: sleep_micros: 500 pattern: 4294967295 num_repetitions: 2097152 sidecar_idx: 0
I20260925 21:58:54.767861  1673 rpc-test-base.h:240] got call: sleep_micros: 500 pattern: 4294967295 num_repetitions: 2097152 sidecar_idx: 0
I20260925 21:58:54.781025  1673 rpc-test-base.h:240] got call: sleep_micros: 500 pattern: 4294967295 num_repetitions: 2097152 sidecar_idx: 0
I20260925 21:58:54.794337  1673 rpc-test-base.h:240] got call: sleep_micros: 500 pattern: 4294967295 num_repetitions: 2097152 sidecar_idx: 0
I20260925 21:58:54.807343  1673 rpc-test-base.h:240] got call: sleep_micros: 500 pattern: 4294967295 num_repetitions: 2097152 sidecar_idx: 0
I20260925 21:58:54.820740  1673 rpc-test-base.h:240] got call: sleep_micros: 500 pattern: 4294967295 num_repetitions: 2097152 sidecar_idx: 0
W20260925 21:58:54.824039  1667 connection.cc:441] server connection from 127.0.0.1:42388 torn down before Call kudu.rpc.GenericCalculatorService.SleepWithSidecar from 127.0.0.1:42388 (request call id 9) could send its response
[       OK ] Parameters/TestRpc.TestCancellationAsync/SSL_TCP (148 ms)
[ RUN      ] Parameters/TestRpc.TestPerformanceBySocketType/SSL_TCP
I20260925 21:58:54.839465  1694 acceptor_pool.cc:254] collecting diagnostics on the listening RPC socket 0.0.0.0:43877 every 8 connection(s)
I20260925 21:58:54.839510  1695 acceptor_pool.cc:254] collecting diagnostics on the listening RPC socket 0.0.0.0:43877 every 8 connection(s)
I20260925 21:58:54.839697  1237 rpc-test.cc:1846] Connecting to 0.0.0.0:43877
I20260925 21:58:56.629972  1237 rpc-test.cc:1859] Sending 1024MB via ssl-enabled tcp socket: real 1.779s	user 1.559s	sys 1.579s
I20260925 21:58:58.555632  1237 rpc-test.cc:1859] Sending 1024MB via ssl-enabled tcp socket: real 1.926s	user 1.714s	sys 1.653s
I20260925 21:59:00.421046  1237 rpc-test.cc:1859] Sending 1024MB via ssl-enabled tcp socket: real 1.865s	user 1.575s	sys 1.680s
I20260925 21:59:02.178161  1237 rpc-test.cc:1859] Sending 1024MB via ssl-enabled tcp socket: real 1.757s	user 1.611s	sys 1.487s
I20260925 21:59:04.070779  1237 rpc-test.cc:1859] Sending 1024MB via ssl-enabled tcp socket: real 1.893s	user 1.705s	sys 1.614s
[       OK ] Parameters/TestRpc.TestPerformanceBySocketType/SSL_TCP (9247 ms)
[----------] 20 tests from Parameters/TestRpc (30744 ms total)

[----------] 1 test from Parameters/TestRpcSocketTxRxQueue
[ RUN      ] Parameters/TestRpcSocketTxRxQueue.OverCapacity/0
W20260925 21:59:04.339046  1711 negotiation.cc:337] Failed RPC negotiation. Trace:
0925 21:59:04.074351 (+     0us) reactor.cc:625] Submitting negotiation task for client connection to 0.0.0.0:42443 (local address 127.0.0.1:51492)
0925 21:59:04.074395 (+    44us) negotiation.cc:107] Waiting for socket to connect
0925 21:59:04.074405 (+    10us) client_negotiation.cc:174] Beginning negotiation
0925 21:59:04.074462 (+    57us) client_negotiation.cc:252] Sending NEGOTIATE NegotiatePB request
0925 21:59:04.338916 (+264454us) negotiation.cc:327] Negotiation complete: Network error: Client connection negotiation failed: client connection to 0.0.0.0:42443: BlockingRecv error: recv error from unknown peer: Transport endpoint is not connected (error 107)
Metrics: {"client-negotiator.queue_time_us":18}
W20260925 21:59:04.339165  1720 negotiation.cc:337] Failed RPC negotiation. Trace:
0925 21:59:04.075411 (+     0us) reactor.cc:625] Submitting negotiation task for client connection to 0.0.0.0:42443 (local address 127.0.0.1:51506)
0925 21:59:04.075466 (+    55us) negotiation.cc:107] Waiting for socket to connect
0925 21:59:04.075475 (+     9us) client_negotiation.cc:174] Beginning negotiation
0925 21:59:04.075552 (+    77us) client_negotiation.cc:252] Sending NEGOTIATE NegotiatePB request
0925 21:59:04.339011 (+263459us) negotiation.cc:327] Negotiation complete: Network error: Client connection negotiation failed: client connection to 0.0.0.0:42443: BlockingRecv error: recv error from unknown peer: Transport endpoint is not connected (error 107)
Metrics: {"client-negotiator.queue_time_us":35}
W20260925 21:59:04.339046  1738 negotiation.cc:337] Failed RPC negotiation. Trace:
0925 21:59:04.077314 (+     0us) reactor.cc:625] Submitting negotiation task for client connection to 0.0.0.0:42443 (local address 127.0.0.1:51526)
0925 21:59:04.077432 (+   118us) negotiation.cc:107] Waiting for socket to connect
0925 21:59:04.077442 (+    10us) client_negotiation.cc:174] Beginning negotiation
0925 21:59:04.077511 (+    69us) client_negotiation.cc:252] Sending NEGOTIATE NegotiatePB request
0925 21:59:04.338939 (+261428us) negotiation.cc:327] Negotiation complete: Network error: Client connection negotiation failed: client connection to 0.0.0.0:42443: BlockingRecv error: recv error from unknown peer: Transport endpoint is not connected (error 107)
Metrics: {"client-negotiator.queue_time_us":53}
W20260925 21:59:04.339296  1756 negotiation.cc:337] Failed RPC negotiation. Trace:
0925 21:59:04.079269 (+     0us) reactor.cc:625] Submitting negotiation task for client connection to 0.0.0.0:42443 (local address 127.0.0.1:51552)
0925 21:59:04.079349 (+    80us) negotiation.cc:107] Waiting for socket to connect
0925 21:59:04.079360 (+    11us) client_negotiation.cc:174] Beginning negotiation
0925 21:59:04.079415 (+    55us) client_negotiation.cc:252] Sending NEGOTIATE NegotiatePB request
0925 21:59:04.339255 (+259840us) negotiation.cc:327] Negotiation complete: Network error: Client connection negotiation failed: client connection to 0.0.0.0:42443: BlockingRecv error: recv error from unknown peer: Transport endpoint is not connected (error 107)
Metrics: {"client-negotiator.queue_time_us":37}
W20260925 21:59:04.339178  1747 negotiation.cc:337] Failed RPC negotiation. Trace:
0925 21:59:04.078283 (+     0us) reactor.cc:625] Submitting negotiation task for client connection to 0.0.0.0:42443 (local address 127.0.0.1:51540)
0925 21:59:04.078319 (+    36us) negotiation.cc:107] Waiting for socket to connect
0925 21:59:04.078327 (+     8us) client_negotiation.cc:174] Beginning negotiation
0925 21:59:04.078362 (+    35us) client_negotiation.cc:252] Sending NEGOTIATE NegotiatePB request
0925 21:59:04.339108 (+260746us) negotiation.cc:327] Negotiation complete: Network error: Client connection negotiation failed: client connection to 0.0.0.0:42443: BlockingRecv error: recv error from unknown peer: Transport endpoint is not connected (error 107)
Metrics: {"client-negotiator.queue_time_us":19}
W20260925 21:59:04.339476  1729 negotiation.cc:337] Failed RPC negotiation. Trace:
0925 21:59:04.076359 (+     0us) reactor.cc:625] Submitting negotiation task for client connection to 0.0.0.0:42443 (local address 127.0.0.1:51512)
0925 21:59:04.076441 (+    82us) negotiation.cc:107] Waiting for socket to connect
0925 21:59:04.076452 (+    11us) client_negotiation.cc:174] Beginning negotiation
0925 21:59:04.076501 (+    49us) client_negotiation.cc:252] Sending NEGOTIATE NegotiatePB request
0925 21:59:04.339011 (+262510us) negotiation.cc:327] Negotiation complete: Network error: Client connection negotiation failed: client connection to 0.0.0.0:42443: BlockingRecv error: recv error from unknown peer: Transport endpoint is not connected (error 107)
Metrics: {"client-negotiator.queue_time_us":38}
[       OK ] Parameters/TestRpcSocketTxRxQueue.OverCapacity/0 (1047 ms)
[----------] 1 test from Parameters/TestRpcSocketTxRxQueue (1047 ms total)

[----------] Global test environment tear-down
[==========] 21 tests from 2 test suites ran. (31792 ms total)
[  PASSED  ] 20 tests.
[  FAILED  ] 1 test, listed below:
[  FAILED  ] Parameters/TestRpc.TestCallWithChainCertAndChainCA/SSL_TCP, where GetParam() = (true, false)

 1 FAILED TEST