Diagnosed failure

Parameters/TestRpc.TestCallWithChainCertAndChainCA/SSL_TCP: /data0/somelongdirectorytoavoidrpathissues/src/kudu/src/kudu/rpc/rpc-test.cc:270: Failure
Failed
Bad status: Runtime error: could not verify certificate chain (error with cert: subject=CN = localhost, ST = sadfjas, C = AS, emailAddress = sdflkdsajf, O = lskdfjlsad, OU = sldfkja, issuer=C = AS, ST = ASDfkjdhf, L = lskdjf, O = saldfja, OU = skdjf, CN = localhost, emailAddress = sadjflkadsj): : certificate has expired
Google Test trace:
/data0/somelongdirectorytoavoidrpathissues/src/kudu/src/kudu/rpc/rpc-test.cc:267: Connecting to 0.0.0.0:36685
I20260924 00:20:32.570990  1211 test_util.cc:175] -----------------------------------------------
I20260924 00:20:32.571203  1211 test_util.cc:176] Had fatal failures, leaving test files at /tmp/dist-test-taskElLEG3/test-tmp/rpc-test.5.Parameters_TestRpc.TestCallWithChainCertAndChainCA_SSL_TCP.1790209231202027-1211-0

Full log

Note: This is test shard 6 of 8.
[==========] Running 21 tests from 2 test suites.
[----------] Global test environment set-up.
[----------] 20 tests from Parameters/TestRpc
[ RUN      ] Parameters/TestRpc.TestMessengerCreateDestroy/SSL_TCP
WARNING: Logging before InitGoogleLogging() is written to STDERR
I20260924 00:20:31.302668  1211 rpc-test.cc:169] started messenger TestCreateDestroy
[       OK ] Parameters/TestRpc.TestMessengerCreateDestroy/SSL_TCP (1166 ms)
[ RUN      ] Parameters/TestRpc.TestNegotiationDeadlock/SSL_TCP
I20260924 00:20:32.451037  1233 acceptor_pool.cc:254] collecting diagnostics on the listening RPC socket 0.0.0.0:38105 every 8 connection(s)
I20260924 00:20:32.452848  1234 acceptor_pool.cc:254] collecting diagnostics on the listening RPC socket 0.0.0.0:38105 every 8 connection(s)
[       OK ] Parameters/TestRpc.TestNegotiationDeadlock/SSL_TCP (90 ms)
[ RUN      ] Parameters/TestRpc.TestCallWithChainCertAndChainCA/SSL_TCP
I20260924 00:20:32.540127  1249 acceptor_pool.cc:254] collecting diagnostics on the listening RPC socket 0.0.0.0:36685 every 8 connection(s)
I20260924 00:20:32.542663  1250 acceptor_pool.cc:254] collecting diagnostics on the listening RPC socket 0.0.0.0:36685 every 8 connection(s)
/data0/somelongdirectorytoavoidrpathissues/src/kudu/src/kudu/rpc/rpc-test.cc:270: Failure
Failed
Bad status: Runtime error: could not verify certificate chain (error with cert: subject=CN = localhost, ST = sadfjas, C = AS, emailAddress = sdflkdsajf, O = lskdfjlsad, OU = sldfkja, issuer=C = AS, ST = ASDfkjdhf, L = lskdjf, O = saldfja, OU = skdjf, CN = localhost, emailAddress = sadjflkadsj): : certificate has expired
Google Test trace:
/data0/somelongdirectorytoavoidrpathissues/src/kudu/src/kudu/rpc/rpc-test.cc:267: Connecting to 0.0.0.0:36685
I20260924 00:20:32.570990  1211 test_util.cc:175] -----------------------------------------------
I20260924 00:20:32.571203  1211 test_util.cc:176] Had fatal failures, leaving test files at /tmp/dist-test-taskElLEG3/test-tmp/rpc-test.5.Parameters_TestRpc.TestCallWithChainCertAndChainCA_SSL_TCP.1790209231202027-1211-0
[  FAILED  ] Parameters/TestRpc.TestCallWithChainCertAndChainCA/SSL_TCP, where GetParam() = (true, false) (58 ms)
[ RUN      ] Parameters/TestRpc.TestCallWithPasswordProtectedKey/SSL_TCP
I20260924 00:20:32.592640  1274 acceptor_pool.cc:254] collecting diagnostics on the listening RPC socket 0.0.0.0:41427 every 8 connection(s)
I20260924 00:20:32.593384  1275 acceptor_pool.cc:254] collecting diagnostics on the listening RPC socket 0.0.0.0:41427 every 8 connection(s)
[       OK ] Parameters/TestRpc.TestCallWithPasswordProtectedKey/SSL_TCP (69 ms)
[ RUN      ] Parameters/TestRpc.TestCallToBadServer/SSL_TCP
I20260924 00:20:32.669462  1211 rpc-test.cc:394] Status: Network error: Client connection negotiation failed: client connection to 0.0.0.0:0: connect: Connection refused (error 111)
I20260924 00:20:32.670888  1211 rpc-test.cc:394] Status: Network error: Client connection negotiation failed: client connection to 0.0.0.0:0: connect: Connection refused (error 111)
I20260924 00:20:32.672274  1211 rpc-test.cc:394] Status: Network error: Client connection negotiation failed: client connection to 0.0.0.0:0: connect: Connection refused (error 111)
I20260924 00:20:32.673460  1211 rpc-test.cc:394] Status: Network error: Client connection negotiation failed: client connection to 0.0.0.0:0: connect: Connection refused (error 111)
I20260924 00:20:32.674744  1211 rpc-test.cc:394] Status: Network error: Client connection negotiation failed: client connection to 0.0.0.0:0: connect: Connection refused (error 111)
[       OK ] Parameters/TestRpc.TestCallToBadServer/SSL_TCP (36 ms)
[ RUN      ] Parameters/TestRpc.TestWrongService/SSL_TCP
I20260924 00:20:32.705953  1309 acceptor_pool.cc:254] collecting diagnostics on the listening RPC socket 0.0.0.0:46161 every 8 connection(s)
I20260924 00:20:32.706761  1310 acceptor_pool.cc:254] collecting diagnostics on the listening RPC socket 0.0.0.0:46161 every 8 connection(s)
I20260924 00:20:32.734953  1306 messenger.cc:345] service WrongServiceName not registered on TestServer
[       OK ] Parameters/TestRpc.TestWrongService/SSL_TCP (65 ms)
[ RUN      ] Parameters/TestRpc.TestConnectionKeepalive/SSL_TCP
I20260924 00:20:32.765864  1332 acceptor_pool.cc:254] collecting diagnostics on the listening RPC socket 0.0.0.0:41621 every 8 connection(s)
I20260924 00:20:32.766610  1333 acceptor_pool.cc:254] collecting diagnostics on the listening RPC socket 0.0.0.0:41621 every 8 connection(s)
I20260924 00:20:32.769946  1211 rpc-test.cc:488] Connecting to 0.0.0.0:41621
[       OK ] Parameters/TestRpc.TestConnectionKeepalive/SSL_TCP (1065 ms)
[ RUN      ] Parameters/TestRpc.TestClientConnectionMetrics/SSL_TCP
I20260924 00:20:33.829468  1357 acceptor_pool.cc:254] collecting diagnostics on the listening RPC socket 0.0.0.0:39567 every 8 connection(s)
I20260924 00:20:33.830349  1358 acceptor_pool.cc:254] collecting diagnostics on the listening RPC socket 0.0.0.0:39567 every 8 connection(s)
I20260924 00:20:33.833565  1211 rpc-test.cc:569] Connecting to 0.0.0.0:39567
[       OK ] Parameters/TestRpc.TestClientConnectionMetrics/SSL_TCP (118930 ms)
[ RUN      ] Parameters/TestRpc.TestCredentialsPolicy/SSL_TCP
I20260924 00:22:32.767159  1392 acceptor_pool.cc:254] collecting diagnostics on the listening RPC socket 0.0.0.0:36973 every 8 connection(s)
I20260924 00:22:32.767911  1393 acceptor_pool.cc:254] collecting diagnostics on the listening RPC socket 0.0.0.0:36973 every 8 connection(s)
I20260924 00:22:32.771453  1211 rpc-test.cc:700] Connecting to 0.0.0.0:36973
[       OK ] Parameters/TestRpc.TestCredentialsPolicy/SSL_TCP (91 ms)
[ RUN      ] Parameters/TestRpc.TestCallLongerThanKeepalive/SSL_TCP
I20260924 00:22:32.850517  1417 acceptor_pool.cc:254] collecting diagnostics on the listening RPC socket 0.0.0.0:39475 every 8 connection(s)
I20260924 00:22:32.851275  1418 acceptor_pool.cc:254] collecting diagnostics on the listening RPC socket 0.0.0.0:39475 every 8 connection(s)
I20260924 00:22:32.883882  1421 rpc-test-base.h:222] got call: sleep_micros: 3000000 deferred: true
I20260924 00:22:35.888298  1421 rpcz_store.cc:275] Call kudu.rpc.GenericCalculatorService.Sleep from 127.0.0.1:58272 (request call id 0) took 3004 ms. Trace:
I20260924 00:22:35.888639  1421 rpcz_store.cc:276] 0924 00:22:32.883601 (+     0us) service_pool.cc:170] Inserting onto call queue
0924 00:22:32.883729 (+   128us) service_pool.cc:227] Handling call
0924 00:22:35.888250 (+3004521us) inbound_call.cc:173] Queueing success response
Metrics: {}
[       OK ] Parameters/TestRpc.TestCallLongerThanKeepalive/SSL_TCP (3066 ms)
[ RUN      ] Parameters/TestRpc.TestRpcSidecar/SSL_TCP
I20260924 00:22:35.923370  1442 acceptor_pool.cc:254] collecting diagnostics on the listening RPC socket 0.0.0.0:37773 every 8 connection(s)
I20260924 00:22:35.924139  1443 acceptor_pool.cc:254] collecting diagnostics on the listening RPC socket 0.0.0.0:37773 every 8 connection(s)
[       OK ] Parameters/TestRpc.TestRpcSidecar/SSL_TCP (543 ms)
[ RUN      ] Parameters/TestRpc.TestRpcSidecarLimits/SSL_TCP
I20260924 00:22:53.703082  1469 acceptor_pool.cc:254] collecting diagnostics on the listening RPC socket 0.0.0.0:32881 every 8 connection(s)
I20260924 00:22:53.703984  1470 acceptor_pool.cc:254] collecting diagnostics on the listening RPC socket 0.0.0.0:32881 every 8 connection(s)
W20260924 00:22:53.752205  1211 serialization.cc:72] Serialized kudu.rpc_test.PushStringsRequestPB (2147483654 bytes) is larger than the maximum configured RPC message size (52428800 bytes). Sending anyway, but peer may reject the data.
W20260924 00:22:53.764606  1467 connection.cc:535] server connection from 127.0.0.1:59720 recv error: Network error: RPC frame had a length of 2147483714, but we only support messages up to 52428800 bytes long.
W20260924 00:22:53.765049  1467 connection.cc:158] shutting down server connection from 127.0.0.1:59720 with pending inbound data: 4/2147483714 bytes received; last active 0 ns ago: status Network error: RPC frame had a length of 2147483714, but we only support messages up to 52428800 bytes long.
W20260924 00:22:53.766057  1482 connection.cc:698] client connection to 0.0.0.0:32881 send error: Network error: failed to write to TLS socket: Connection reset by peer
W20260924 00:22:53.766726  1482 connection.cc:196] Error closing socket: Network error: TlsSocket::Close: Success
[       OK ] Parameters/TestRpc.TestRpcSidecarLimits/SSL_TCP (17979 ms)
[ RUN      ] Parameters/TestRpc.TestCallTimeoutDoesntAffectNegotiation/SSL_TCP
I20260924 00:22:54.460765  1494 acceptor_pool.cc:254] collecting diagnostics on the listening RPC socket 0.0.0.0:33103 every 8 connection(s)
I20260924 00:22:54.461464  1495 acceptor_pool.cc:254] collecting diagnostics on the listening RPC socket 0.0.0.0:33103 every 8 connection(s)
W20260924 00:22:54.479481  1490 negotiation.cc:266] Injecting 500ms delay in negotiation
I20260924 00:22:54.529175  1211 rpc-test-base.h:595] status: Timed out: connection negotiation to 0.0.0.0:33103 for RPC Sleep timed out after 0.050s (ON_OUTBOUND_QUEUE), seconds elapsed: 0.050774
[       OK ] Parameters/TestRpc.TestCallTimeoutDoesntAffectNegotiation/SSL_TCP (576 ms)
[ RUN      ] Parameters/TestRpc.TestRpcHandlerLatencyMetric/SSL_TCP
I20260924 00:22:55.017920  1519 acceptor_pool.cc:254] collecting diagnostics on the listening RPC socket 0.0.0.0:42207 every 8 connection(s)
I20260924 00:22:55.018599  1520 acceptor_pool.cc:254] collecting diagnostics on the listening RPC socket 0.0.0.0:42207 every 8 connection(s)
I20260924 00:22:55.075850  1211 rpc-test.cc:1236] Sleep() min lat: 21734
I20260924 00:22:55.076053  1211 rpc-test.cc:1237] Sleep() mean lat: 21734
I20260924 00:22:55.076277  1211 rpc-test.cc:1238] Sleep() max lat: 21734
I20260924 00:22:55.076454  1211 rpc-test.cc:1239] Sleep() #calls: 1
[       OK ] Parameters/TestRpc.TestRpcHandlerLatencyMetric/SSL_TCP (86 ms)
[ RUN      ] Parameters/TestRpc.TimedOutOnResponseMetricServiceQueue/SSL_TCP
I20260924 00:22:55.105897  1545 acceptor_pool.cc:254] collecting diagnostics on the listening RPC socket 0.0.0.0:39097 every 8 connection(s)
I20260924 00:22:55.106604  1546 acceptor_pool.cc:254] collecting diagnostics on the listening RPC socket 0.0.0.0:39097 every 8 connection(s)
W20260924 00:22:55.178346  1547 rpcz_store.cc:267] Call kudu.rpc_test.CalculatorService.Sleep from 127.0.0.1:47750 (request call id 2) took 20 ms (client timeout 20 ms). Trace:
W20260924 00:22:55.178725  1547 rpcz_store.cc:269] 0924 00:22:55.158028 (+     0us) service_pool.cc:170] Inserting onto call queue
0924 00:22:55.178223 (+ 20195us) service_pool.cc:214] Skipping call since client already timed out
0924 00:22:55.178300 (+    77us) inbound_call.cc:173] Queueing failure response
Metrics: {}
[       OK ] Parameters/TestRpc.TimedOutOnResponseMetricServiceQueue/SSL_TCP (100 ms)
[ RUN      ] Parameters/TestRpc.RpcPendingConnectionsMetric/SSL_TCP
I20260924 00:22:55.195611  1568 acceptor_pool.cc:254] collecting diagnostics on the listening RPC socket 0.0.0.0:33341 every 8 connection(s)
I20260924 00:22:55.196329  1569 acceptor_pool.cc:254] collecting diagnostics on the listening RPC socket 0.0.0.0:33341 every 8 connection(s)
W20260924 00:22:55.212513  1564 negotiation.cc:337] Failed RPC negotiation. Trace:
0924 00:22:55.210764 (+     0us) reactor.cc:625] Submitting negotiation task for server connection from 127.0.0.1:42442 (local address 127.0.0.1:33341)
0924 00:22:55.211533 (+   769us) server_negotiation.cc:206] Beginning negotiation
0924 00:22:55.211567 (+    34us) server_negotiation.cc:399] Waiting for connection header
0924 00:22:55.211937 (+   370us) negotiation.cc:327] Negotiation complete: Network error: Server connection negotiation failed: server connection from 127.0.0.1:42442: BlockingRecv error: recv got EOF from 127.0.0.1:42442 (error 108)
Metrics: {"server-negotiator.queue_time_us":146}
[       OK ] Parameters/TestRpc.RpcPendingConnectionsMetric/SSL_TCP (40 ms)
[ RUN      ] Parameters/TestRpc.TestRpcContextClientDeadline/SSL_TCP
I20260924 00:22:55.241178  1584 acceptor_pool.cc:254] collecting diagnostics on the listening RPC socket 0.0.0.0:44947 every 8 connection(s)
I20260924 00:22:55.241858  1585 acceptor_pool.cc:254] collecting diagnostics on the listening RPC socket 0.0.0.0:44947 every 8 connection(s)
[       OK ] Parameters/TestRpc.TestRpcContextClientDeadline/SSL_TCP (98 ms)
[ RUN      ] Parameters/TestRpc.TestApplicationFeatureFlagUnsupportedServer/SSL_TCP
I20260924 00:22:55.346418  1609 acceptor_pool.cc:254] collecting diagnostics on the listening RPC socket 0.0.0.0:45583 every 8 connection(s)
I20260924 00:22:55.347149  1610 acceptor_pool.cc:254] collecting diagnostics on the listening RPC socket 0.0.0.0:45583 every 8 connection(s)
[       OK ] Parameters/TestRpc.TestApplicationFeatureFlagUnsupportedServer/SSL_TCP (85 ms)
[ RUN      ] Parameters/TestRpc.TestCancellationAsync/SSL_TCP
I20260924 00:22:55.459357  1634 acceptor_pool.cc:254] collecting diagnostics on the listening RPC socket 0.0.0.0:39499 every 8 connection(s)
I20260924 00:22:55.460099  1635 acceptor_pool.cc:254] collecting diagnostics on the listening RPC socket 0.0.0.0:39499 every 8 connection(s)
I20260924 00:22:55.463207  1211 rpc-test.cc:1716] Connecting to 0.0.0.0:39499
I20260924 00:22:55.479244  1211 test_util.cc:268] Using random seed: -1712970316
I20260924 00:22:55.714522  1638 rpc-test-base.h:240] got call: sleep_micros: 500 pattern: 4294967295 num_repetitions: 2097152 sidecar_idx: 0
I20260924 00:22:55.893589  1637 rpc-test-base.h:240] got call: sleep_micros: 500 pattern: 4294967295 num_repetitions: 2097152 sidecar_idx: 0
I20260924 00:22:56.099030  1638 rpc-test-base.h:240] got call: sleep_micros: 500 pattern: 4294967295 num_repetitions: 2097152 sidecar_idx: 0
I20260924 00:22:56.290326  1638 rpc-test-base.h:240] got call: sleep_micros: 500 pattern: 4294967295 num_repetitions: 2097152 sidecar_idx: 0
I20260924 00:22:56.477768  1638 rpc-test-base.h:240] got call: sleep_micros: 500 pattern: 4294967295 num_repetitions: 2097152 sidecar_idx: 0
I20260924 00:22:56.658653  1638 rpc-test-base.h:240] got call: sleep_micros: 500 pattern: 4294967295 num_repetitions: 2097152 sidecar_idx: 0
I20260924 00:22:56.844148  1638 rpc-test-base.h:240] got call: sleep_micros: 500 pattern: 4294967295 num_repetitions: 2097152 sidecar_idx: 0
I20260924 00:22:57.029054  1638 rpc-test-base.h:240] got call: sleep_micros: 500 pattern: 4294967295 num_repetitions: 2097152 sidecar_idx: 0
W20260924 00:22:57.198295  1633 connection.cc:196] Error closing socket: Network error: TlsSocket::Close: Broken pipe
W20260924 00:22:57.210553  1633 connection.cc:441] server connection from 127.0.0.1:53952 torn down before Call kudu.rpc.GenericCalculatorService.SleepWithSidecar from 127.0.0.1:53952 (request call id 8) could send its response
[       OK ] Parameters/TestRpc.TestCancellationAsync/SSL_TCP (1809 ms)
[ RUN      ] Parameters/TestRpc.TestPerformanceBySocketType/SSL_TCP
I20260924 00:22:57.306362  1659 acceptor_pool.cc:254] collecting diagnostics on the listening RPC socket 0.0.0.0:40435 every 8 connection(s)
I20260924 00:22:57.307216  1660 acceptor_pool.cc:254] collecting diagnostics on the listening RPC socket 0.0.0.0:40435 every 8 connection(s)
I20260924 00:22:57.310279  1211 rpc-test.cc:1846] Connecting to 0.0.0.0:40435
I20260924 00:23:16.857488  1211 rpc-test.cc:1859] Sending 1024MB via ssl-enabled tcp socket: real 19.512s	user 16.765s	sys 11.119s
I20260924 00:23:36.358587  1211 rpc-test.cc:1859] Sending 1024MB via ssl-enabled tcp socket: real 19.501s	user 16.809s	sys 11.051s
I20260924 00:23:55.722831  1211 rpc-test.cc:1859] Sending 1024MB via ssl-enabled tcp socket: real 19.364s	user 16.852s	sys 10.864s
I20260924 00:24:15.118599  1211 rpc-test.cc:1859] Sending 1024MB via ssl-enabled tcp socket: real 19.395s	user 16.660s	sys 11.040s
I20260924 00:24:34.524847  1211 rpc-test.cc:1859] Sending 1024MB via ssl-enabled tcp socket: real 19.406s	user 16.805s	sys 10.954s
[       OK ] Parameters/TestRpc.TestPerformanceBySocketType/SSL_TCP (97322 ms)
[----------] 20 tests from Parameters/TestRpc (243288 ms total)

[----------] 1 test from Parameters/TestRpcSocketTxRxQueue
[ RUN      ] Parameters/TestRpcSocketTxRxQueue.OverCapacity/0
W20260924 00:24:34.980832  1686 negotiation.cc:337] Failed RPC negotiation. Trace:
0924 00:24:34.558052 (+     0us) reactor.cc:625] Submitting negotiation task for client connection to 0.0.0.0:38185 (local address 127.0.0.1:37950)
0924 00:24:34.558750 (+   698us) negotiation.cc:107] Waiting for socket to connect
0924 00:24:34.558801 (+    51us) client_negotiation.cc:174] Beginning negotiation
0924 00:24:34.559447 (+   646us) client_negotiation.cc:252] Sending NEGOTIATE NegotiatePB request
0924 00:24:34.979786 (+420339us) negotiation.cc:327] Negotiation complete: Network error: Client connection negotiation failed: client connection to 0.0.0.0:38185: BlockingRecv error: recv error from unknown peer: Transport endpoint is not connected (error 107)
Metrics: {"client-negotiator.queue_time_us":154}
W20260924 00:24:34.981266  1695 negotiation.cc:337] Failed RPC negotiation. Trace:
0924 00:24:34.564852 (+     0us) reactor.cc:625] Submitting negotiation task for client connection to 0.0.0.0:38185 (local address 127.0.0.1:37952)
0924 00:24:34.565425 (+   573us) negotiation.cc:107] Waiting for socket to connect
0924 00:24:34.565454 (+    29us) client_negotiation.cc:174] Beginning negotiation
0924 00:24:34.565638 (+   184us) client_negotiation.cc:252] Sending NEGOTIATE NegotiatePB request
0924 00:24:34.979773 (+414135us) negotiation.cc:327] Negotiation complete: Network error: Client connection negotiation failed: client connection to 0.0.0.0:38185: BlockingRecv error: recv error from unknown peer: Transport endpoint is not connected (error 107)
Metrics: {"client-negotiator.queue_time_us":125}
W20260924 00:24:34.982529  1722 negotiation.cc:337] Failed RPC negotiation. Trace:
0924 00:24:34.596193 (+     0us) reactor.cc:625] Submitting negotiation task for client connection to 0.0.0.0:38185 (local address 127.0.0.1:37978)
0924 00:24:34.596792 (+   599us) negotiation.cc:107] Waiting for socket to connect
0924 00:24:34.596823 (+    31us) client_negotiation.cc:174] Beginning negotiation
0924 00:24:34.597077 (+   254us) client_negotiation.cc:252] Sending NEGOTIATE NegotiatePB request
0924 00:24:34.981837 (+384760us) negotiation.cc:327] Negotiation complete: Network error: Client connection negotiation failed: client connection to 0.0.0.0:38185: BlockingRecv error: recv error from unknown peer: Transport endpoint is not connected (error 107)
Metrics: {"client-negotiator.queue_time_us":175}
W20260924 00:24:34.982692  1704 negotiation.cc:337] Failed RPC negotiation. Trace:
0924 00:24:34.572113 (+     0us) reactor.cc:625] Submitting negotiation task for client connection to 0.0.0.0:38185 (local address 127.0.0.1:37964)
0924 00:24:34.572572 (+   459us) negotiation.cc:107] Waiting for socket to connect
0924 00:24:34.572601 (+    29us) client_negotiation.cc:174] Beginning negotiation
0924 00:24:34.572791 (+   190us) client_negotiation.cc:252] Sending NEGOTIATE NegotiatePB request
0924 00:24:34.979773 (+406982us) negotiation.cc:327] Negotiation complete: Network error: Client connection negotiation failed: client connection to 0.0.0.0:38185: BlockingRecv error: recv error from unknown peer: Transport endpoint is not connected (error 107)
Metrics: {"client-negotiator.queue_time_us":116}
W20260924 00:24:34.982863  1731 negotiation.cc:337] Failed RPC negotiation. Trace:
0924 00:24:34.607787 (+     0us) reactor.cc:625] Submitting negotiation task for client connection to 0.0.0.0:38185 (local address 127.0.0.1:37980)
0924 00:24:34.608374 (+   587us) negotiation.cc:107] Waiting for socket to connect
0924 00:24:34.608404 (+    30us) client_negotiation.cc:174] Beginning negotiation
0924 00:24:34.608706 (+   302us) client_negotiation.cc:252] Sending NEGOTIATE NegotiatePB request
0924 00:24:34.981898 (+373192us) negotiation.cc:327] Negotiation complete: Network error: Client connection negotiation failed: client connection to 0.0.0.0:38185: BlockingRecv error: recv error from unknown peer: Transport endpoint is not connected (error 107)
Metrics: {"client-negotiator.queue_time_us":138}
W20260924 00:24:34.981317  1713 negotiation.cc:337] Failed RPC negotiation. Trace:
0924 00:24:34.584493 (+     0us) reactor.cc:625] Submitting negotiation task for client connection to 0.0.0.0:38185 (local address 127.0.0.1:37976)
0924 00:24:34.585093 (+   600us) negotiation.cc:107] Waiting for socket to connect
0924 00:24:34.585123 (+    30us) client_negotiation.cc:174] Beginning negotiation
0924 00:24:34.585442 (+   319us) client_negotiation.cc:252] Sending NEGOTIATE NegotiatePB request
0924 00:24:34.980336 (+394894us) negotiation.cc:327] Negotiation complete: Network error: Client connection negotiation failed: client connection to 0.0.0.0:38185: BlockingRecv error: recv error from unknown peer: Transport endpoint is not connected (error 107)
Metrics: {"client-negotiator.queue_time_us":166}
[       OK ] Parameters/TestRpcSocketTxRxQueue.OverCapacity/0 (1237 ms)
[----------] 1 test from Parameters/TestRpcSocketTxRxQueue (1237 ms total)

[----------] Global test environment tear-down
[==========] 21 tests from 2 test suites ran. (244526 ms total)
[  PASSED  ] 20 tests.
[  FAILED  ] 1 test, listed below:
[  FAILED  ] Parameters/TestRpc.TestCallWithChainCertAndChainCA/SSL_TCP, where GetParam() = (true, false)

 1 FAILED TEST