Diagnosed failure

Parameters/TestRpc.TestCallWithChainCertAndChainCA/SSL_UnixSocket: /data0/somelongdirectorytoavoidrpathissues/src/kudu/src/kudu/rpc/rpc-test.cc:270: Failure
Failed
Bad status: Runtime error: could not verify certificate chain (error with cert: subject=CN = localhost, ST = sadfjas, C = AS, emailAddress = sdflkdsajf, O = lskdfjlsad, OU = sldfkja, issuer=C = AS, ST = ASDfkjdhf, L = lskdjf, O = saldfja, OU = skdjf, CN = localhost, emailAddress = sadjflkadsj): : certificate has expired
Google Test trace:
/data0/somelongdirectorytoavoidrpathissues/src/kudu/src/kudu/rpc/rpc-test.cc:267: Connecting to unix:/tmp/dist-test-tasknddQ0g/test-tmp/rpc-test-48ea7732e6a04bb98640557dd009f604.sock
I20260925 07:18:09.053445   383 test_util.cc:175] -----------------------------------------------
I20260925 07:18:09.053494   383 test_util.cc:176] Had fatal failures, leaving test files at /tmp/dist-test-tasknddQ0g/test-tmp/rpc-test.6.Parameters_TestRpc.TestCallWithChainCertAndChainCA_SSL_UnixSocket.1790320688990961-383-0

Full log

Note: This is test shard 7 of 8.
[==========] Running 21 tests from 2 test suites.
[----------] Global test environment set-up.
[----------] 20 tests from Parameters/TestRpc
[ RUN      ] Parameters/TestRpc.TestMessengerCreateDestroy/SSL_UnixSocket
WARNING: Logging before InitGoogleLogging() is written to STDERR
I20260925 07:18:09.011673   383 rpc-test.cc:169] started messenger TestCreateDestroy
[       OK ] Parameters/TestRpc.TestMessengerCreateDestroy/SSL_UnixSocket (19 ms)
[ RUN      ] Parameters/TestRpc.TestNegotiationDeadlock/SSL_UnixSocket
I20260925 07:18:09.019305   403 acceptor_pool.cc:254] collecting diagnostics on the listening RPC socket unix:/tmp/dist-test-tasknddQ0g/test-tmp/rpc-test-455f739beecc4140bbc52f321765c77b.sock every 8 connection(s)
I20260925 07:18:09.019305   404 acceptor_pool.cc:254] collecting diagnostics on the listening RPC socket unix:/tmp/dist-test-tasknddQ0g/test-tmp/rpc-test-455f739beecc4140bbc52f321765c77b.sock every 8 connection(s)
[       OK ] Parameters/TestRpc.TestNegotiationDeadlock/SSL_UnixSocket (12 ms)
[ RUN      ] Parameters/TestRpc.TestCallWithChainCertAndChainCA/SSL_UnixSocket
I20260925 07:18:09.049384   420 acceptor_pool.cc:254] collecting diagnostics on the listening RPC socket unix:/tmp/dist-test-tasknddQ0g/test-tmp/rpc-test-48ea7732e6a04bb98640557dd009f604.sock every 8 connection(s)
I20260925 07:18:09.049355   419 acceptor_pool.cc:254] collecting diagnostics on the listening RPC socket unix:/tmp/dist-test-tasknddQ0g/test-tmp/rpc-test-48ea7732e6a04bb98640557dd009f604.sock every 8 connection(s)
/data0/somelongdirectorytoavoidrpathissues/src/kudu/src/kudu/rpc/rpc-test.cc:270: Failure
Failed
Bad status: Runtime error: could not verify certificate chain (error with cert: subject=CN = localhost, ST = sadfjas, C = AS, emailAddress = sdflkdsajf, O = lskdfjlsad, OU = sldfkja, issuer=C = AS, ST = ASDfkjdhf, L = lskdjf, O = saldfja, OU = skdjf, CN = localhost, emailAddress = sadjflkadsj): : certificate has expired
Google Test trace:
/data0/somelongdirectorytoavoidrpathissues/src/kudu/src/kudu/rpc/rpc-test.cc:267: Connecting to unix:/tmp/dist-test-tasknddQ0g/test-tmp/rpc-test-48ea7732e6a04bb98640557dd009f604.sock
I20260925 07:18:09.053445   383 test_util.cc:175] -----------------------------------------------
I20260925 07:18:09.053494   383 test_util.cc:176] Had fatal failures, leaving test files at /tmp/dist-test-tasknddQ0g/test-tmp/rpc-test.6.Parameters_TestRpc.TestCallWithChainCertAndChainCA_SSL_UnixSocket.1790320688990961-383-0
[  FAILED  ] Parameters/TestRpc.TestCallWithChainCertAndChainCA/SSL_UnixSocket, where GetParam() = (true, true) (27 ms)
[ RUN      ] Parameters/TestRpc.TestCallWithPasswordProtectedKey/SSL_UnixSocket
I20260925 07:18:09.065523   444 acceptor_pool.cc:254] collecting diagnostics on the listening RPC socket unix:/tmp/dist-test-tasknddQ0g/test-tmp/rpc-test-1f01c485c3aa4c71aac4ac62f03048e9.sock every 8 connection(s)
I20260925 07:18:09.065542   445 acceptor_pool.cc:254] collecting diagnostics on the listening RPC socket unix:/tmp/dist-test-tasknddQ0g/test-tmp/rpc-test-1f01c485c3aa4c71aac4ac62f03048e9.sock every 8 connection(s)
W20260925 07:18:09.076505   441 connection.cc:196] Error closing socket: Network error: TlsSocket::Close: Broken pipe
[       OK ] Parameters/TestRpc.TestCallWithPasswordProtectedKey/SSL_UnixSocket (24 ms)
[ RUN      ] Parameters/TestRpc.TestCallToBadServer/SSL_UnixSocket
I20260925 07:18:09.113147   383 rpc-test.cc:394] Status: Network error: Client connection negotiation failed: client connection to 0.0.0.0:0: connect: Connection refused (error 111)
I20260925 07:18:09.113512   383 rpc-test.cc:394] Status: Network error: Client connection negotiation failed: client connection to 0.0.0.0:0: connect: Connection refused (error 111)
I20260925 07:18:09.113782   383 rpc-test.cc:394] Status: Network error: Client connection negotiation failed: client connection to 0.0.0.0:0: connect: Connection refused (error 111)
I20260925 07:18:09.114012   383 rpc-test.cc:394] Status: Network error: Client connection negotiation failed: client connection to 0.0.0.0:0: connect: Connection refused (error 111)
I20260925 07:18:09.114210   383 rpc-test.cc:394] Status: Network error: Client connection negotiation failed: client connection to 0.0.0.0:0: connect: Connection refused (error 111)
[       OK ] Parameters/TestRpc.TestCallToBadServer/SSL_UnixSocket (36 ms)
[ RUN      ] Parameters/TestRpc.TestWrongService/SSL_UnixSocket
I20260925 07:18:09.132905   479 acceptor_pool.cc:254] collecting diagnostics on the listening RPC socket unix:/tmp/dist-test-tasknddQ0g/test-tmp/rpc-test-9ee989a04cd541ecbcf5aa2cf33fbb6d.sock every 8 connection(s)
I20260925 07:18:09.132932   480 acceptor_pool.cc:254] collecting diagnostics on the listening RPC socket unix:/tmp/dist-test-tasknddQ0g/test-tmp/rpc-test-9ee989a04cd541ecbcf5aa2cf33fbb6d.sock every 8 connection(s)
I20260925 07:18:09.158571   476 messenger.cc:345] service WrongServiceName not registered on TestServer
[       OK ] Parameters/TestRpc.TestWrongService/SSL_UnixSocket (45 ms)
[ RUN      ] Parameters/TestRpc.TestConnectionKeepalive/SSL_UnixSocket
I20260925 07:18:09.171079   502 acceptor_pool.cc:254] collecting diagnostics on the listening RPC socket unix:/tmp/dist-test-tasknddQ0g/test-tmp/rpc-test-b88c956e0a1f410fb7c0ec8a13e82fa9.sock every 8 connection(s)
I20260925 07:18:09.171137   503 acceptor_pool.cc:254] collecting diagnostics on the listening RPC socket unix:/tmp/dist-test-tasknddQ0g/test-tmp/rpc-test-b88c956e0a1f410fb7c0ec8a13e82fa9.sock every 8 connection(s)
I20260925 07:18:09.171319   383 rpc-test.cc:488] Connecting to unix:/tmp/dist-test-tasknddQ0g/test-tmp/rpc-test-b88c956e0a1f410fb7c0ec8a13e82fa9.sock
W20260925 07:18:09.662355   515 connection.cc:196] Error closing socket: Network error: TlsSocket::Close: Broken pipe
[       OK ] Parameters/TestRpc.TestConnectionKeepalive/SSL_UnixSocket (1034 ms)
[ RUN      ] Parameters/TestRpc.TestClientConnectionMetrics/SSL_UnixSocket
I20260925 07:18:10.205302   527 acceptor_pool.cc:254] collecting diagnostics on the listening RPC socket unix:/tmp/dist-test-tasknddQ0g/test-tmp/rpc-test-fa86095649124c31b8d4c7e35b1fb79e.sock every 8 connection(s)
I20260925 07:18:10.205375   528 acceptor_pool.cc:254] collecting diagnostics on the listening RPC socket unix:/tmp/dist-test-tasknddQ0g/test-tmp/rpc-test-fa86095649124c31b8d4c7e35b1fb79e.sock every 8 connection(s)
I20260925 07:18:10.205564   383 rpc-test.cc:569] Connecting to unix:/tmp/dist-test-tasknddQ0g/test-tmp/rpc-test-fa86095649124c31b8d4c7e35b1fb79e.sock
W20260925 07:18:18.985662   524 connection.cc:196] Error closing socket: Network error: TlsSocket::Close: Broken pipe
[       OK ] Parameters/TestRpc.TestClientConnectionMetrics/SSL_UnixSocket (8792 ms)
[ RUN      ] Parameters/TestRpc.TestCredentialsPolicy/SSL_UnixSocket
I20260925 07:18:18.997663   550 acceptor_pool.cc:254] collecting diagnostics on the listening RPC socket unix:/tmp/dist-test-tasknddQ0g/test-tmp/rpc-test-c92c60c9ae574c3e8d3db48de7d8273a.sock every 8 connection(s)
I20260925 07:18:18.997771   551 acceptor_pool.cc:254] collecting diagnostics on the listening RPC socket unix:/tmp/dist-test-tasknddQ0g/test-tmp/rpc-test-c92c60c9ae574c3e8d3db48de7d8273a.sock every 8 connection(s)
I20260925 07:18:18.997923   383 rpc-test.cc:700] Connecting to unix:/tmp/dist-test-tasknddQ0g/test-tmp/rpc-test-c92c60c9ae574c3e8d3db48de7d8273a.sock
W20260925 07:18:19.039776   549 connection.cc:196] Error closing socket: Network error: TlsSocket::Close: Broken pipe
[       OK ] Parameters/TestRpc.TestCredentialsPolicy/SSL_UnixSocket (58 ms)
[ RUN      ] Parameters/TestRpc.TestCallLongerThanKeepalive/SSL_UnixSocket
I20260925 07:18:19.060755   575 acceptor_pool.cc:254] collecting diagnostics on the listening RPC socket unix:/tmp/dist-test-tasknddQ0g/test-tmp/rpc-test-8d626c50bda44786b592b6fdeb557a6d.sock every 8 connection(s)
I20260925 07:18:19.060802   576 acceptor_pool.cc:254] collecting diagnostics on the listening RPC socket unix:/tmp/dist-test-tasknddQ0g/test-tmp/rpc-test-8d626c50bda44786b592b6fdeb557a6d.sock every 8 connection(s)
I20260925 07:18:19.068410   579 rpc-test-base.h:222] got call: sleep_micros: 3000000 deferred: true
I20260925 07:18:22.069120   579 rpcz_store.cc:275] Call kudu.rpc.GenericCalculatorService.Sleep from unix:<unnamed> (request call id 0) took 3000 ms. Trace:
I20260925 07:18:22.069252   579 rpcz_store.cc:276] 0925 07:18:19.068364 (+     0us) service_pool.cc:170] Inserting onto call queue
0925 07:18:19.068397 (+    33us) service_pool.cc:227] Handling call
0925 07:18:22.069103 (+3000706us) inbound_call.cc:173] Queueing success response
Metrics: {}
[       OK ] Parameters/TestRpc.TestCallLongerThanKeepalive/SSL_UnixSocket (3025 ms)
[ RUN      ] Parameters/TestRpc.TestRpcSidecar/SSL_UnixSocket
I20260925 07:18:22.080968   600 acceptor_pool.cc:254] collecting diagnostics on the listening RPC socket unix:/tmp/dist-test-tasknddQ0g/test-tmp/rpc-test-d54d2cca6b4a4f4388a9a8383650b7ea.sock every 8 connection(s)
I20260925 07:18:22.081020   601 acceptor_pool.cc:254] collecting diagnostics on the listening RPC socket unix:/tmp/dist-test-tasknddQ0g/test-tmp/rpc-test-d54d2cca6b4a4f4388a9a8383650b7ea.sock every 8 connection(s)
W20260925 07:18:22.124096   597 connection.cc:196] Error closing socket: Network error: TlsSocket::Close: Broken pipe
[       OK ] Parameters/TestRpc.TestRpcSidecar/SSL_UnixSocket (53 ms)
[ RUN      ] Parameters/TestRpc.TestRpcSidecarLimits/SSL_UnixSocket
I20260925 07:18:23.832640   625 acceptor_pool.cc:254] collecting diagnostics on the listening RPC socket unix:/tmp/dist-test-tasknddQ0g/test-tmp/rpc-test-08d8d38303814373a925446578f081fa.sock every 8 connection(s)
I20260925 07:18:23.832640   626 acceptor_pool.cc:254] collecting diagnostics on the listening RPC socket unix:/tmp/dist-test-tasknddQ0g/test-tmp/rpc-test-08d8d38303814373a925446578f081fa.sock every 8 connection(s)
W20260925 07:18:23.854825   383 serialization.cc:72] Serialized kudu.rpc_test.PushStringsRequestPB (2147483654 bytes) is larger than the maximum configured RPC message size (52428800 bytes). Sending anyway, but peer may reject the data.
W20260925 07:18:23.857875   622 connection.cc:535] server connection from unix:<unnamed> recv error: Network error: RPC frame had a length of 2147483714, but we only support messages up to 52428800 bytes long.
W20260925 07:18:23.857928   622 connection.cc:158] shutting down server connection from unix:<unnamed> with pending inbound data: 4/2147483714 bytes received; last active 0 ns ago: status Network error: RPC frame had a length of 2147483714, but we only support messages up to 52428800 bytes long.
W20260925 07:18:23.858354   638 connection.cc:698] client connection to unix:/tmp/dist-test-tasknddQ0g/test-tmp/rpc-test-08d8d38303814373a925446578f081fa.sock send error: Network error: failed to write to TLS socket: Broken pipe
W20260925 07:18:23.858470   638 connection.cc:196] Error closing socket: Network error: TlsSocket::Close: Success
I20260925 07:18:23.864959   651 acceptor_pool.cc:254] collecting diagnostics on the listening RPC socket unix:/tmp/dist-test-tasknddQ0g/test-tmp/rpc-test-08d8d38303814373a925446578f081fa.sock every 8 connection(s)
I20260925 07:18:23.865031   650 acceptor_pool.cc:254] collecting diagnostics on the listening RPC socket unix:/tmp/dist-test-tasknddQ0g/test-tmp/rpc-test-08d8d38303814373a925446578f081fa.sock every 8 connection(s)
W20260925 07:18:28.098547   647 connection.cc:577] server connection from unix:<unnamed>: received bad data: 'Corruption: Invalid packet: message had a length of 2147483710, but we only support messages up to 2147483647 bytes
'
W20260925 07:18:28.098920   663 connection.cc:196] Error closing socket: Network error: TlsSocket::Close: Broken pipe
[       OK ] Parameters/TestRpc.TestRpcSidecarLimits/SSL_UnixSocket (5975 ms)
[ RUN      ] Parameters/TestRpc.TestCallTimeoutDoesntAffectNegotiation/SSL_UnixSocket
I20260925 07:18:28.119261   675 acceptor_pool.cc:254] collecting diagnostics on the listening RPC socket unix:/tmp/dist-test-tasknddQ0g/test-tmp/rpc-test-2dab172e47524013a0f3f5f944c636e5.sock every 8 connection(s)
I20260925 07:18:28.119285   676 acceptor_pool.cc:254] collecting diagnostics on the listening RPC socket unix:/tmp/dist-test-tasknddQ0g/test-tmp/rpc-test-2dab172e47524013a0f3f5f944c636e5.sock every 8 connection(s)
W20260925 07:18:28.133433   671 negotiation.cc:266] Injecting 500ms delay in negotiation
I20260925 07:18:28.183746   383 rpc-test-base.h:595] status: Timed out: connection negotiation to unix:/tmp/dist-test-tasknddQ0g/test-tmp/rpc-test-2dab172e47524013a0f3f5f944c636e5.sock for RPC Sleep timed out after 0.050s (ON_OUTBOUND_QUEUE), seconds elapsed: 0.0506291
W20260925 07:18:28.637555   672 connection.cc:196] Error closing socket: Network error: TlsSocket::Close: Broken pipe
[       OK ] Parameters/TestRpc.TestCallTimeoutDoesntAffectNegotiation/SSL_UnixSocket (537 ms)
[ RUN      ] Parameters/TestRpc.TestRpcHandlerLatencyMetric/SSL_UnixSocket
I20260925 07:18:28.672425   700 acceptor_pool.cc:254] collecting diagnostics on the listening RPC socket unix:/tmp/dist-test-tasknddQ0g/test-tmp/rpc-test-bee9da5a2248440caaa2907ed1efd5e4.sock every 8 connection(s)
I20260925 07:18:28.672474   701 acceptor_pool.cc:254] collecting diagnostics on the listening RPC socket unix:/tmp/dist-test-tasknddQ0g/test-tmp/rpc-test-bee9da5a2248440caaa2907ed1efd5e4.sock every 8 connection(s)
I20260925 07:18:28.711577   383 rpc-test.cc:1236] Sleep() min lat: 20247
I20260925 07:18:28.711640   383 rpc-test.cc:1237] Sleep() mean lat: 20247
I20260925 07:18:28.711664   383 rpc-test.cc:1238] Sleep() max lat: 20247
I20260925 07:18:28.711678   383 rpc-test.cc:1239] Sleep() #calls: 1
[       OK ] Parameters/TestRpc.TestRpcHandlerLatencyMetric/SSL_UnixSocket (74 ms)
[ RUN      ] Parameters/TestRpc.TimedOutOnResponseMetricServiceQueue/SSL_UnixSocket
I20260925 07:18:28.724618   726 acceptor_pool.cc:254] collecting diagnostics on the listening RPC socket unix:/tmp/dist-test-tasknddQ0g/test-tmp/rpc-test-02ede33768a24cb3ad1327f15741f81e.sock every 8 connection(s)
I20260925 07:18:28.724653   727 acceptor_pool.cc:254] collecting diagnostics on the listening RPC socket unix:/tmp/dist-test-tasknddQ0g/test-tmp/rpc-test-02ede33768a24cb3ad1327f15741f81e.sock every 8 connection(s)
W20260925 07:18:28.775305   728 rpcz_store.cc:267] Call kudu.rpc_test.CalculatorService.Sleep from unix:<unnamed> (request call id 2) took 20 ms (client timeout 20 ms). Trace:
W20260925 07:18:28.775431   728 rpcz_store.cc:269] 0925 07:18:28.755012 (+     0us) service_pool.cc:170] Inserting onto call queue
0925 07:18:28.775280 (+ 20268us) service_pool.cc:214] Skipping call since client already timed out
0925 07:18:28.775290 (+    10us) inbound_call.cc:173] Queueing failure response
Metrics: {}
W20260925 07:18:28.776167   723 connection.cc:196] Error closing socket: Network error: TlsSocket::Close: Broken pipe
[       OK ] Parameters/TestRpc.TimedOutOnResponseMetricServiceQueue/SSL_UnixSocket (63 ms)
[ RUN      ] Parameters/TestRpc.RpcPendingConnectionsMetric/SSL_UnixSocket
I20260925 07:18:28.778884   749 acceptor_pool.cc:254] collecting diagnostics on the listening RPC socket 0.0.0.0:38579 every 8 connection(s)
I20260925 07:18:28.778947   750 acceptor_pool.cc:254] collecting diagnostics on the listening RPC socket 0.0.0.0:38579 every 8 connection(s)
W20260925 07:18:28.791074   745 negotiation.cc:337] Failed RPC negotiation. Trace:
0925 07:18:28.790865 (+     0us) reactor.cc:625] Submitting negotiation task for server connection from 127.0.0.1:53008 (local address 127.0.0.1:38579)
0925 07:18:28.790944 (+    79us) server_negotiation.cc:206] Beginning negotiation
0925 07:18:28.790946 (+     2us) server_negotiation.cc:399] Waiting for connection header
0925 07:18:28.791018 (+    72us) negotiation.cc:327] Negotiation complete: Network error: Server connection negotiation failed: server connection from 127.0.0.1:53008: BlockingRecv error: recv got EOF from 127.0.0.1:53008 (error 108)
Metrics: {"server-negotiator.queue_time_us":46}
[       OK ] Parameters/TestRpc.RpcPendingConnectionsMetric/SSL_UnixSocket (24 ms)
[ RUN      ] Parameters/TestRpc.TestRpcContextClientDeadline/SSL_UnixSocket
I20260925 07:18:28.815629   765 acceptor_pool.cc:254] collecting diagnostics on the listening RPC socket unix:/tmp/dist-test-tasknddQ0g/test-tmp/rpc-test-7eb879a8f2a447e98eda4e851fbcda08.sock every 8 connection(s)
I20260925 07:18:28.815665   766 acceptor_pool.cc:254] collecting diagnostics on the listening RPC socket unix:/tmp/dist-test-tasknddQ0g/test-tmp/rpc-test-7eb879a8f2a447e98eda4e851fbcda08.sock every 8 connection(s)
[       OK ] Parameters/TestRpc.TestRpcContextClientDeadline/SSL_UnixSocket (44 ms)
[ RUN      ] Parameters/TestRpc.TestApplicationFeatureFlagUnsupportedServer/SSL_UnixSocket
I20260925 07:18:28.860822   790 acceptor_pool.cc:254] collecting diagnostics on the listening RPC socket unix:/tmp/dist-test-tasknddQ0g/test-tmp/rpc-test-ed812744936f4a7491a975bca77ad67a.sock every 8 connection(s)
I20260925 07:18:28.860865   791 acceptor_pool.cc:254] collecting diagnostics on the listening RPC socket unix:/tmp/dist-test-tasknddQ0g/test-tmp/rpc-test-ed812744936f4a7491a975bca77ad67a.sock every 8 connection(s)
W20260925 07:18:28.875339   787 connection.cc:196] Error closing socket: Network error: TlsSocket::Close: Broken pipe
[       OK ] Parameters/TestRpc.TestApplicationFeatureFlagUnsupportedServer/SSL_UnixSocket (29 ms)
[ RUN      ] Parameters/TestRpc.TestCancellationAsync/SSL_UnixSocket
I20260925 07:18:28.884378   815 acceptor_pool.cc:254] collecting diagnostics on the listening RPC socket unix:/tmp/dist-test-tasknddQ0g/test-tmp/rpc-test-525a82a1c9cc4508a17e30fb35110b8a.sock every 8 connection(s)
I20260925 07:18:28.884428   816 acceptor_pool.cc:254] collecting diagnostics on the listening RPC socket unix:/tmp/dist-test-tasknddQ0g/test-tmp/rpc-test-525a82a1c9cc4508a17e30fb35110b8a.sock every 8 connection(s)
I20260925 07:18:28.884588   383 rpc-test.cc:1716] Connecting to unix:/tmp/dist-test-tasknddQ0g/test-tmp/rpc-test-525a82a1c9cc4508a17e30fb35110b8a.sock
I20260925 07:18:28.903538   383 test_util.cc:268] Using random seed: -2048695697
I20260925 07:18:28.917104   819 rpc-test-base.h:240] got call: sleep_micros: 500 pattern: 4294967295 num_repetitions: 2097152 sidecar_idx: 0
I20260925 07:18:28.928936   819 rpc-test-base.h:240] got call: sleep_micros: 500 pattern: 4294967295 num_repetitions: 2097152 sidecar_idx: 0
I20260925 07:18:28.938915   819 rpc-test-base.h:240] got call: sleep_micros: 500 pattern: 4294967295 num_repetitions: 2097152 sidecar_idx: 0
I20260925 07:18:28.948978   819 rpc-test-base.h:240] got call: sleep_micros: 500 pattern: 4294967295 num_repetitions: 2097152 sidecar_idx: 0
I20260925 07:18:28.959184   819 rpc-test-base.h:240] got call: sleep_micros: 500 pattern: 4294967295 num_repetitions: 2097152 sidecar_idx: 0
I20260925 07:18:28.969563   819 rpc-test-base.h:240] got call: sleep_micros: 500 pattern: 4294967295 num_repetitions: 2097152 sidecar_idx: 0
I20260925 07:18:28.980981   819 rpc-test-base.h:240] got call: sleep_micros: 500 pattern: 4294967295 num_repetitions: 2097152 sidecar_idx: 0
I20260925 07:18:28.991833   819 rpc-test-base.h:240] got call: sleep_micros: 500 pattern: 4294967295 num_repetitions: 2097152 sidecar_idx: 0
W20260925 07:18:28.993346   812 connection.cc:196] Error closing socket: Network error: TlsSocket::Close: Broken pipe
W20260925 07:18:28.994995   812 connection.cc:441] server connection from unix:<unnamed> torn down before Call kudu.rpc.GenericCalculatorService.SleepWithSidecar from unix:<unnamed> (request call id 9) could send its response
[       OK ] Parameters/TestRpc.TestCancellationAsync/SSL_UnixSocket (119 ms)
[ RUN      ] Parameters/TestRpc.TestPerformanceBySocketType/SSL_UnixSocket
I20260925 07:18:29.005147   840 acceptor_pool.cc:254] collecting diagnostics on the listening RPC socket unix:/tmp/dist-test-tasknddQ0g/test-tmp/rpc-test-afee47a88fbb4588aa1d203d40db6197.sock every 8 connection(s)
I20260925 07:18:29.005187   841 acceptor_pool.cc:254] collecting diagnostics on the listening RPC socket unix:/tmp/dist-test-tasknddQ0g/test-tmp/rpc-test-afee47a88fbb4588aa1d203d40db6197.sock every 8 connection(s)
I20260925 07:18:29.005370   383 rpc-test.cc:1846] Connecting to unix:/tmp/dist-test-tasknddQ0g/test-tmp/rpc-test-afee47a88fbb4588aa1d203d40db6197.sock
I20260925 07:18:30.289059   383 rpc-test.cc:1859] Sending 1024MB via ssl-enabled unix socket: real 1.255s	user 1.329s	sys 0.939s
I20260925 07:18:31.472200   383 rpc-test.cc:1859] Sending 1024MB via ssl-enabled unix socket: real 1.183s	user 1.206s	sys 0.930s
I20260925 07:18:32.727725   383 rpc-test.cc:1859] Sending 1024MB via ssl-enabled unix socket: real 1.255s	user 1.352s	sys 0.924s
I20260925 07:18:34.007017   383 rpc-test.cc:1859] Sending 1024MB via ssl-enabled unix socket: real 1.279s	user 1.309s	sys 0.985s
I20260925 07:18:35.199904   383 rpc-test.cc:1859] Sending 1024MB via ssl-enabled unix socket: real 1.193s	user 1.251s	sys 0.906s
W20260925 07:18:35.200562   837 connection.cc:196] Error closing socket: Network error: TlsSocket::Close: Broken pipe
[       OK ] Parameters/TestRpc.TestPerformanceBySocketType/SSL_UnixSocket (6205 ms)
[----------] 20 tests from Parameters/TestRpc (26208 ms total)

[----------] 1 test from Parameters/TestRpcSocketTxRxQueue
[ RUN      ] Parameters/TestRpcSocketTxRxQueue.AcceptorRxQueueSizeMetric/0
I20260925 07:18:35.209275   865 acceptor_pool.cc:254] collecting diagnostics on the listening RPC socket 0.0.0.0:34485 every 1 connection(s)
I20260925 07:18:35.209365   866 acceptor_pool.cc:254] collecting diagnostics on the listening RPC socket 0.0.0.0:34485 every 1 connection(s)
W20260925 07:18:35.209914   861 negotiation.cc:337] Failed RPC negotiation. Trace:
0925 07:18:35.209774 (+     0us) reactor.cc:625] Submitting negotiation task for server connection from 127.0.0.1:56070 (local address 127.0.0.1:34485)
0925 07:18:35.209824 (+    50us) server_negotiation.cc:206] Beginning negotiation
0925 07:18:35.209826 (+     2us) server_negotiation.cc:399] Waiting for connection header
0925 07:18:35.209888 (+    62us) negotiation.cc:327] Negotiation complete: Network error: Server connection negotiation failed: server connection from 127.0.0.1:56070: BlockingRecv error: recv got EOF from 127.0.0.1:56070 (error 108)
Metrics: {"server-negotiator.queue_time_us":16}
[       OK ] Parameters/TestRpcSocketTxRxQueue.AcceptorRxQueueSizeMetric/0 (10 ms)
[----------] 1 test from Parameters/TestRpcSocketTxRxQueue (10 ms total)

[----------] Global test environment tear-down
[==========] 21 tests from 2 test suites ran. (26218 ms total)
[  PASSED  ] 20 tests.
[  FAILED  ] 1 test, listed below:
[  FAILED  ] Parameters/TestRpc.TestCallWithChainCertAndChainCA/SSL_UnixSocket, where GetParam() = (true, true)

 1 FAILED TEST