Diagnosed failure

Parameters/TestRpc.TestCallWithChainCertAndChainCA/SSL_TCP: /data0/somelongdirectorytoavoidrpathissues/src/kudu/src/kudu/rpc/rpc-test.cc:270: Failure
Failed
Bad status: Runtime error: could not verify certificate chain (error with cert: subject=CN = localhost, ST = sadfjas, C = AS, emailAddress = sdflkdsajf, O = lskdfjlsad, OU = sldfkja, issuer=C = AS, ST = ASDfkjdhf, L = lskdjf, O = saldfja, OU = skdjf, CN = localhost, emailAddress = sadjflkadsj): : certificate has expired
Google Test trace:
/data0/somelongdirectorytoavoidrpathissues/src/kudu/src/kudu/rpc/rpc-test.cc:267: Connecting to 0.0.0.0:37745
I20260925 07:18:07.212873   383 test_util.cc:175] -----------------------------------------------
I20260925 07:18:07.212925   383 test_util.cc:176] Had fatal failures, leaving test files at /tmp/dist-test-taskiu_DWt/test-tmp/rpc-test.5.Parameters_TestRpc.TestCallWithChainCertAndChainCA_SSL_TCP.1790320687115636-383-0

Full log

Note: This is test shard 6 of 8.
[==========] Running 21 tests from 2 test suites.
[----------] Global test environment set-up.
[----------] 20 tests from Parameters/TestRpc
[ RUN      ] Parameters/TestRpc.TestMessengerCreateDestroy/SSL_TCP
WARNING: Logging before InitGoogleLogging() is written to STDERR
I20260925 07:18:07.168923   383 rpc-test.cc:169] started messenger TestCreateDestroy
[       OK ] Parameters/TestRpc.TestMessengerCreateDestroy/SSL_TCP (51 ms)
[ RUN      ] Parameters/TestRpc.TestNegotiationDeadlock/SSL_TCP
I20260925 07:18:07.177953   403 acceptor_pool.cc:254] collecting diagnostics on the listening RPC socket 0.0.0.0:38811 every 8 connection(s)
I20260925 07:18:07.177961   404 acceptor_pool.cc:254] collecting diagnostics on the listening RPC socket 0.0.0.0:38811 every 8 connection(s)
[       OK ] Parameters/TestRpc.TestNegotiationDeadlock/SSL_TCP (15 ms)
[ RUN      ] Parameters/TestRpc.TestCallWithChainCertAndChainCA/SSL_TCP
I20260925 07:18:07.209053   419 acceptor_pool.cc:254] collecting diagnostics on the listening RPC socket 0.0.0.0:37745 every 8 connection(s)
I20260925 07:18:07.209069   420 acceptor_pool.cc:254] collecting diagnostics on the listening RPC socket 0.0.0.0:37745 every 8 connection(s)
/data0/somelongdirectorytoavoidrpathissues/src/kudu/src/kudu/rpc/rpc-test.cc:270: Failure
Failed
Bad status: Runtime error: could not verify certificate chain (error with cert: subject=CN = localhost, ST = sadfjas, C = AS, emailAddress = sdflkdsajf, O = lskdfjlsad, OU = sldfkja, issuer=C = AS, ST = ASDfkjdhf, L = lskdjf, O = saldfja, OU = skdjf, CN = localhost, emailAddress = sadjflkadsj): : certificate has expired
Google Test trace:
/data0/somelongdirectorytoavoidrpathissues/src/kudu/src/kudu/rpc/rpc-test.cc:267: Connecting to 0.0.0.0:37745
I20260925 07:18:07.212873   383 test_util.cc:175] -----------------------------------------------
I20260925 07:18:07.212925   383 test_util.cc:176] Had fatal failures, leaving test files at /tmp/dist-test-taskiu_DWt/test-tmp/rpc-test.5.Parameters_TestRpc.TestCallWithChainCertAndChainCA_SSL_TCP.1790320687115636-383-0
[  FAILED  ] Parameters/TestRpc.TestCallWithChainCertAndChainCA/SSL_TCP, where GetParam() = (true, false) (27 ms)
[ RUN      ] Parameters/TestRpc.TestCallWithPasswordProtectedKey/SSL_TCP
I20260925 07:18:07.261572   444 acceptor_pool.cc:254] collecting diagnostics on the listening RPC socket 0.0.0.0:39661 every 8 connection(s)
I20260925 07:18:07.261572   445 acceptor_pool.cc:254] collecting diagnostics on the listening RPC socket 0.0.0.0:39661 every 8 connection(s)
[       OK ] Parameters/TestRpc.TestCallWithPasswordProtectedKey/SSL_TCP (61 ms)
[ RUN      ] Parameters/TestRpc.TestCallToBadServer/SSL_TCP
I20260925 07:18:07.294775   383 rpc-test.cc:394] Status: Network error: Client connection negotiation failed: client connection to 0.0.0.0:0: connect: Connection refused (error 111)
I20260925 07:18:07.295051   383 rpc-test.cc:394] Status: Network error: Client connection negotiation failed: client connection to 0.0.0.0:0: connect: Connection refused (error 111)
I20260925 07:18:07.295212   383 rpc-test.cc:394] Status: Network error: Client connection negotiation failed: client connection to 0.0.0.0:0: connect: Connection refused (error 111)
I20260925 07:18:07.295372   383 rpc-test.cc:394] Status: Network error: Client connection negotiation failed: client connection to 0.0.0.0:0: connect: Connection refused (error 111)
I20260925 07:18:07.295516   383 rpc-test.cc:394] Status: Network error: Client connection negotiation failed: client connection to 0.0.0.0:0: connect: Connection refused (error 111)
[       OK ] Parameters/TestRpc.TestCallToBadServer/SSL_TCP (22 ms)
[ RUN      ] Parameters/TestRpc.TestWrongService/SSL_TCP
I20260925 07:18:07.307053   479 acceptor_pool.cc:254] collecting diagnostics on the listening RPC socket 0.0.0.0:33333 every 8 connection(s)
I20260925 07:18:07.307083   480 acceptor_pool.cc:254] collecting diagnostics on the listening RPC socket 0.0.0.0:33333 every 8 connection(s)
I20260925 07:18:07.322968   477 messenger.cc:345] service WrongServiceName not registered on TestServer
[       OK ] Parameters/TestRpc.TestWrongService/SSL_TCP (28 ms)
[ RUN      ] Parameters/TestRpc.TestConnectionKeepalive/SSL_TCP
I20260925 07:18:07.344274   502 acceptor_pool.cc:254] collecting diagnostics on the listening RPC socket 0.0.0.0:42065 every 8 connection(s)
I20260925 07:18:07.344334   503 acceptor_pool.cc:254] collecting diagnostics on the listening RPC socket 0.0.0.0:42065 every 8 connection(s)
I20260925 07:18:07.344453   383 rpc-test.cc:488] Connecting to 0.0.0.0:42065
[       OK ] Parameters/TestRpc.TestConnectionKeepalive/SSL_TCP (1038 ms)
[ RUN      ] Parameters/TestRpc.TestClientConnectionMetrics/SSL_TCP
I20260925 07:18:08.377686   527 acceptor_pool.cc:254] collecting diagnostics on the listening RPC socket 0.0.0.0:38783 every 8 connection(s)
I20260925 07:18:08.377727   528 acceptor_pool.cc:254] collecting diagnostics on the listening RPC socket 0.0.0.0:38783 every 8 connection(s)
I20260925 07:18:08.377830   383 rpc-test.cc:569] Connecting to 0.0.0.0:38783
[       OK ] Parameters/TestRpc.TestClientConnectionMetrics/SSL_TCP (8070 ms)
[ RUN      ] Parameters/TestRpc.TestCredentialsPolicy/SSL_TCP
I20260925 07:18:16.451185   550 acceptor_pool.cc:254] collecting diagnostics on the listening RPC socket 0.0.0.0:44843 every 8 connection(s)
I20260925 07:18:16.451195   551 acceptor_pool.cc:254] collecting diagnostics on the listening RPC socket 0.0.0.0:44843 every 8 connection(s)
I20260925 07:18:16.451315   383 rpc-test.cc:700] Connecting to 0.0.0.0:44843
[       OK ] Parameters/TestRpc.TestCredentialsPolicy/SSL_TCP (36 ms)
[ RUN      ] Parameters/TestRpc.TestCallLongerThanKeepalive/SSL_TCP
I20260925 07:18:16.478097   575 acceptor_pool.cc:254] collecting diagnostics on the listening RPC socket 0.0.0.0:44789 every 8 connection(s)
I20260925 07:18:16.478158   576 acceptor_pool.cc:254] collecting diagnostics on the listening RPC socket 0.0.0.0:44789 every 8 connection(s)
I20260925 07:18:16.497174   579 rpc-test-base.h:222] got call: sleep_micros: 3000000 deferred: true
I20260925 07:18:19.497844   579 rpcz_store.cc:275] Call kudu.rpc.GenericCalculatorService.Sleep from 127.0.0.1:45694 (request call id 0) took 3000 ms. Trace:
I20260925 07:18:19.497949   579 rpcz_store.cc:276] 0925 07:18:16.497127 (+     0us) service_pool.cc:170] Inserting onto call queue
0925 07:18:16.497157 (+    30us) service_pool.cc:227] Handling call
0925 07:18:19.497821 (+3000664us) inbound_call.cc:173] Queueing success response
Metrics: {}
[       OK ] Parameters/TestRpc.TestCallLongerThanKeepalive/SSL_TCP (3029 ms)
[ RUN      ] Parameters/TestRpc.TestRpcSidecar/SSL_TCP
I20260925 07:18:19.516680   600 acceptor_pool.cc:254] collecting diagnostics on the listening RPC socket 0.0.0.0:42515 every 8 connection(s)
I20260925 07:18:19.516717   601 acceptor_pool.cc:254] collecting diagnostics on the listening RPC socket 0.0.0.0:42515 every 8 connection(s)
[       OK ] Parameters/TestRpc.TestRpcSidecar/SSL_TCP (59 ms)
[ RUN      ] Parameters/TestRpc.TestRpcSidecarLimits/SSL_TCP
I20260925 07:18:21.227706   625 acceptor_pool.cc:254] collecting diagnostics on the listening RPC socket 0.0.0.0:39679 every 8 connection(s)
I20260925 07:18:21.227746   626 acceptor_pool.cc:254] collecting diagnostics on the listening RPC socket 0.0.0.0:39679 every 8 connection(s)
W20260925 07:18:21.236493   383 serialization.cc:72] Serialized kudu.rpc_test.PushStringsRequestPB (2147483654 bytes) is larger than the maximum configured RPC message size (52428800 bytes). Sending anyway, but peer may reject the data.
W20260925 07:18:21.239579   623 connection.cc:535] server connection from 127.0.0.1:33758 recv error: Network error: RPC frame had a length of 2147483714, but we only support messages up to 52428800 bytes long.
W20260925 07:18:21.239658   623 connection.cc:158] shutting down server connection from 127.0.0.1:33758 with pending inbound data: 4/2147483714 bytes received; last active 0 ns ago: status Network error: RPC frame had a length of 2147483714, but we only support messages up to 52428800 bytes long.
W20260925 07:18:21.239821   638 connection.cc:698] client connection to 0.0.0.0:39679 send error: Network error: failed to write to TLS socket: Connection reset by peer
W20260925 07:18:21.239955   638 connection.cc:196] Error closing socket: Network error: TlsSocket::Close: Success
I20260925 07:18:21.254972   651 acceptor_pool.cc:254] collecting diagnostics on the listening RPC socket 0.0.0.0:44379 every 8 connection(s)
I20260925 07:18:21.254977   650 acceptor_pool.cc:254] collecting diagnostics on the listening RPC socket 0.0.0.0:44379 every 8 connection(s)
W20260925 07:18:24.930637   647 connection.cc:577] server connection from 127.0.0.1:56182: received bad data: 'Corruption: Invalid packet: message had a length of 2147483710, but we only support messages up to 2147483647 bytes
'
[       OK ] Parameters/TestRpc.TestRpcSidecarLimits/SSL_TCP (5373 ms)
[ RUN      ] Parameters/TestRpc.TestCallTimeoutDoesntAffectNegotiation/SSL_TCP
I20260925 07:18:24.953531   675 acceptor_pool.cc:254] collecting diagnostics on the listening RPC socket 0.0.0.0:38245 every 8 connection(s)
I20260925 07:18:24.953552   676 acceptor_pool.cc:254] collecting diagnostics on the listening RPC socket 0.0.0.0:38245 every 8 connection(s)
W20260925 07:18:24.972525   671 negotiation.cc:266] Injecting 500ms delay in negotiation
I20260925 07:18:25.022795   383 rpc-test-base.h:595] status: Timed out: connection negotiation to 0.0.0.0:38245 for RPC Sleep timed out after 0.050s (ON_OUTBOUND_QUEUE), seconds elapsed: 0.050665
[       OK ] Parameters/TestRpc.TestCallTimeoutDoesntAffectNegotiation/SSL_TCP (544 ms)
[ RUN      ] Parameters/TestRpc.TestRpcHandlerLatencyMetric/SSL_TCP
I20260925 07:18:25.494515   700 acceptor_pool.cc:254] collecting diagnostics on the listening RPC socket 0.0.0.0:36327 every 8 connection(s)
I20260925 07:18:25.494524   701 acceptor_pool.cc:254] collecting diagnostics on the listening RPC socket 0.0.0.0:36327 every 8 connection(s)
I20260925 07:18:25.527230   383 rpc-test.cc:1236] Sleep() min lat: 20310
I20260925 07:18:25.527303   383 rpc-test.cc:1237] Sleep() mean lat: 20310
I20260925 07:18:25.527328   383 rpc-test.cc:1238] Sleep() max lat: 20310
I20260925 07:18:25.527339   383 rpc-test.cc:1239] Sleep() #calls: 1
[       OK ] Parameters/TestRpc.TestRpcHandlerLatencyMetric/SSL_TCP (51 ms)
[ RUN      ] Parameters/TestRpc.TimedOutOnResponseMetricServiceQueue/SSL_TCP
I20260925 07:18:25.541332   726 acceptor_pool.cc:254] collecting diagnostics on the listening RPC socket 0.0.0.0:33613 every 8 connection(s)
I20260925 07:18:25.541368   727 acceptor_pool.cc:254] collecting diagnostics on the listening RPC socket 0.0.0.0:33613 every 8 connection(s)
W20260925 07:18:25.607482   728 rpcz_store.cc:267] Call kudu.rpc_test.CalculatorService.Sleep from 127.0.0.1:52808 (request call id 2) took 20 ms (client timeout 20 ms). Trace:
W20260925 07:18:25.607594   728 rpcz_store.cc:269] 0925 07:18:25.587196 (+     0us) service_pool.cc:170] Inserting onto call queue
0925 07:18:25.607455 (+ 20259us) service_pool.cc:214] Skipping call since client already timed out
0925 07:18:25.607466 (+    11us) inbound_call.cc:173] Queueing failure response
Metrics: {}
[       OK ] Parameters/TestRpc.TimedOutOnResponseMetricServiceQueue/SSL_TCP (80 ms)
[ RUN      ] Parameters/TestRpc.RpcPendingConnectionsMetric/SSL_TCP
I20260925 07:18:25.610525   749 acceptor_pool.cc:254] collecting diagnostics on the listening RPC socket 0.0.0.0:42871 every 8 connection(s)
I20260925 07:18:25.610541   750 acceptor_pool.cc:254] collecting diagnostics on the listening RPC socket 0.0.0.0:42871 every 8 connection(s)
W20260925 07:18:25.619149   745 negotiation.cc:337] Failed RPC negotiation. Trace:
0925 07:18:25.618871 (+     0us) reactor.cc:625] Submitting negotiation task for server connection from 127.0.0.1:34742 (local address 127.0.0.1:42871)
0925 07:18:25.618944 (+    73us) server_negotiation.cc:206] Beginning negotiation
0925 07:18:25.618946 (+     2us) server_negotiation.cc:399] Waiting for connection header
0925 07:18:25.619054 (+   108us) negotiation.cc:327] Negotiation complete: Network error: Server connection negotiation failed: server connection from 127.0.0.1:34742: BlockingRecv error: recv got EOF from 127.0.0.1:34742 (error 108)
Metrics: {"server-negotiator.queue_time_us":31}
[       OK ] Parameters/TestRpc.RpcPendingConnectionsMetric/SSL_TCP (20 ms)
[ RUN      ] Parameters/TestRpc.TestRpcContextClientDeadline/SSL_TCP
I20260925 07:18:25.647421   765 acceptor_pool.cc:254] collecting diagnostics on the listening RPC socket 0.0.0.0:41143 every 8 connection(s)
I20260925 07:18:25.647455   766 acceptor_pool.cc:254] collecting diagnostics on the listening RPC socket 0.0.0.0:41143 every 8 connection(s)
[       OK ] Parameters/TestRpc.TestRpcContextClientDeadline/SSL_TCP (51 ms)
[ RUN      ] Parameters/TestRpc.TestApplicationFeatureFlagUnsupportedServer/SSL_TCP
I20260925 07:18:25.696813   790 acceptor_pool.cc:254] collecting diagnostics on the listening RPC socket 0.0.0.0:44769 every 8 connection(s)
I20260925 07:18:25.696851   791 acceptor_pool.cc:254] collecting diagnostics on the listening RPC socket 0.0.0.0:44769 every 8 connection(s)
[       OK ] Parameters/TestRpc.TestApplicationFeatureFlagUnsupportedServer/SSL_TCP (33 ms)
[ RUN      ] Parameters/TestRpc.TestCancellationAsync/SSL_TCP
I20260925 07:18:25.728533   815 acceptor_pool.cc:254] collecting diagnostics on the listening RPC socket 0.0.0.0:45289 every 8 connection(s)
I20260925 07:18:25.728536   816 acceptor_pool.cc:254] collecting diagnostics on the listening RPC socket 0.0.0.0:45289 every 8 connection(s)
I20260925 07:18:25.728665   383 rpc-test.cc:1716] Connecting to 0.0.0.0:45289
I20260925 07:18:25.760978   383 test_util.cc:268] Using random seed: -2051838257
I20260925 07:18:25.779120   819 rpc-test-base.h:240] got call: sleep_micros: 500 pattern: 4294967295 num_repetitions: 2097152 sidecar_idx: 0
I20260925 07:18:25.794056   819 rpc-test-base.h:240] got call: sleep_micros: 500 pattern: 4294967295 num_repetitions: 2097152 sidecar_idx: 0
I20260925 07:18:25.810689   819 rpc-test-base.h:240] got call: sleep_micros: 500 pattern: 4294967295 num_repetitions: 2097152 sidecar_idx: 0
I20260925 07:18:25.827015   819 rpc-test-base.h:240] got call: sleep_micros: 500 pattern: 4294967295 num_repetitions: 2097152 sidecar_idx: 0
I20260925 07:18:25.843539   819 rpc-test-base.h:240] got call: sleep_micros: 500 pattern: 4294967295 num_repetitions: 2097152 sidecar_idx: 0
I20260925 07:18:25.857884   819 rpc-test-base.h:240] got call: sleep_micros: 500 pattern: 4294967295 num_repetitions: 2097152 sidecar_idx: 0
I20260925 07:18:25.869624   819 rpc-test-base.h:240] got call: sleep_micros: 500 pattern: 4294967295 num_repetitions: 2097152 sidecar_idx: 0
I20260925 07:18:25.882308   819 rpc-test-base.h:240] got call: sleep_micros: 500 pattern: 4294967295 num_repetitions: 2097152 sidecar_idx: 0
W20260925 07:18:25.885288   813 connection.cc:441] server connection from 127.0.0.1:56744 torn down before Call kudu.rpc.GenericCalculatorService.SleepWithSidecar from 127.0.0.1:56744 (request call id 9) could send its response
[       OK ] Parameters/TestRpc.TestCancellationAsync/SSL_TCP (170 ms)
[ RUN      ] Parameters/TestRpc.TestPerformanceBySocketType/SSL_TCP
I20260925 07:18:25.908815   840 acceptor_pool.cc:254] collecting diagnostics on the listening RPC socket 0.0.0.0:40483 every 8 connection(s)
I20260925 07:18:25.908844   841 acceptor_pool.cc:254] collecting diagnostics on the listening RPC socket 0.0.0.0:40483 every 8 connection(s)
I20260925 07:18:25.908957   383 rpc-test.cc:1846] Connecting to 0.0.0.0:40483
I20260925 07:18:27.508404   383 rpc-test.cc:1859] Sending 1024MB via ssl-enabled tcp socket: real 1.579s	user 1.627s	sys 1.156s
I20260925 07:18:29.156308   383 rpc-test.cc:1859] Sending 1024MB via ssl-enabled tcp socket: real 1.648s	user 1.587s	sys 1.322s
I20260925 07:18:30.776176   383 rpc-test.cc:1859] Sending 1024MB via ssl-enabled tcp socket: real 1.620s	user 1.583s	sys 1.281s
I20260925 07:18:32.365068   383 rpc-test.cc:1859] Sending 1024MB via ssl-enabled tcp socket: real 1.589s	user 1.496s	sys 1.303s
I20260925 07:18:33.981642   383 rpc-test.cc:1859] Sending 1024MB via ssl-enabled tcp socket: real 1.616s	user 1.510s	sys 1.311s
[       OK ] Parameters/TestRpc.TestPerformanceBySocketType/SSL_TCP (8096 ms)
[----------] 20 tests from Parameters/TestRpc (26865 ms total)

[----------] 1 test from Parameters/TestRpcSocketTxRxQueue
[ RUN      ] Parameters/TestRpcSocketTxRxQueue.OverCapacity/0
W20260925 07:18:34.247284   857 negotiation.cc:337] Failed RPC negotiation. Trace:
0925 07:18:33.984835 (+     0us) reactor.cc:625] Submitting negotiation task for client connection to 0.0.0.0:38191 (local address 127.0.0.1:57076)
0925 07:18:33.984899 (+    64us) negotiation.cc:107] Waiting for socket to connect
0925 07:18:33.984910 (+    11us) client_negotiation.cc:174] Beginning negotiation
0925 07:18:33.984957 (+    47us) client_negotiation.cc:252] Sending NEGOTIATE NegotiatePB request
0925 07:18:34.247212 (+262255us) negotiation.cc:327] Negotiation complete: Network error: Client connection negotiation failed: client connection to 0.0.0.0:38191: BlockingRecv error: recv error from unknown peer: Transport endpoint is not connected (error 107)
Metrics: {"client-negotiator.queue_time_us":35}
W20260925 07:18:34.247458   902 negotiation.cc:337] Failed RPC negotiation. Trace:
0925 07:18:33.989194 (+     0us) reactor.cc:625] Submitting negotiation task for client connection to 0.0.0.0:38191 (local address 127.0.0.1:57112)
0925 07:18:33.989248 (+    54us) negotiation.cc:107] Waiting for socket to connect
0925 07:18:33.989257 (+     9us) client_negotiation.cc:174] Beginning negotiation
0925 07:18:33.989301 (+    44us) client_negotiation.cc:252] Sending NEGOTIATE NegotiatePB request
0925 07:18:34.247356 (+258055us) negotiation.cc:327] Negotiation complete: Network error: Client connection negotiation failed: client connection to 0.0.0.0:38191: BlockingRecv error: recv error from unknown peer: Transport endpoint is not connected (error 107)
Metrics: {"client-negotiator.queue_time_us":34}
W20260925 07:18:34.247356   884 negotiation.cc:337] Failed RPC negotiation. Trace:
0925 07:18:33.987513 (+     0us) reactor.cc:625] Submitting negotiation task for client connection to 0.0.0.0:38191 (local address 127.0.0.1:57088)
0925 07:18:33.987549 (+    36us) negotiation.cc:107] Waiting for socket to connect
0925 07:18:33.987556 (+     7us) client_negotiation.cc:174] Beginning negotiation
0925 07:18:33.987590 (+    34us) client_negotiation.cc:252] Sending NEGOTIATE NegotiatePB request
0925 07:18:34.247176 (+259586us) negotiation.cc:327] Negotiation complete: Network error: Client connection negotiation failed: client connection to 0.0.0.0:38191: BlockingRecv error: recv error from unknown peer: Transport endpoint is not connected (error 107)
Metrics: {"client-negotiator.queue_time_us":18}
W20260925 07:18:34.247285   875 negotiation.cc:337] Failed RPC negotiation. Trace:
0925 07:18:33.986697 (+     0us) reactor.cc:625] Submitting negotiation task for client connection to 0.0.0.0:38191 (local address 127.0.0.1:57086)
0925 07:18:33.986738 (+    41us) negotiation.cc:107] Waiting for socket to connect
0925 07:18:33.986747 (+     9us) client_negotiation.cc:174] Beginning negotiation
0925 07:18:33.986791 (+    44us) client_negotiation.cc:252] Sending NEGOTIATE NegotiatePB request
0925 07:18:34.247203 (+260412us) negotiation.cc:327] Negotiation complete: Network error: Client connection negotiation failed: client connection to 0.0.0.0:38191: BlockingRecv error: recv error from unknown peer: Transport endpoint is not connected (error 107)
Metrics: {"client-negotiator.queue_time_us":18}
W20260925 07:18:34.247704   893 negotiation.cc:337] Failed RPC negotiation. Trace:
0925 07:18:33.988357 (+     0us) reactor.cc:625] Submitting negotiation task for client connection to 0.0.0.0:38191 (local address 127.0.0.1:57098)
0925 07:18:33.988391 (+    34us) negotiation.cc:107] Waiting for socket to connect
0925 07:18:33.988398 (+     7us) client_negotiation.cc:174] Beginning negotiation
0925 07:18:33.988431 (+    33us) client_negotiation.cc:252] Sending NEGOTIATE NegotiatePB request
0925 07:18:34.247287 (+258856us) negotiation.cc:327] Negotiation complete: Network error: Client connection negotiation failed: client connection to 0.0.0.0:38191: BlockingRecv error: recv error from unknown peer: Transport endpoint is not connected (error 107)
Metrics: {"client-negotiator.queue_time_us":18}
W20260925 07:18:34.247289   866 negotiation.cc:337] Failed RPC negotiation. Trace:
0925 07:18:33.985885 (+     0us) reactor.cc:625] Submitting negotiation task for client connection to 0.0.0.0:38191 (local address 127.0.0.1:57082)
0925 07:18:33.985928 (+    43us) negotiation.cc:107] Waiting for socket to connect
0925 07:18:33.985937 (+     9us) client_negotiation.cc:174] Beginning negotiation
0925 07:18:33.985983 (+    46us) client_negotiation.cc:252] Sending NEGOTIATE NegotiatePB request
0925 07:18:34.247195 (+261212us) negotiation.cc:327] Negotiation complete: Network error: Client connection negotiation failed: client connection to 0.0.0.0:38191: BlockingRecv error: recv error from unknown peer: Transport endpoint is not connected (error 107)
Metrics: {"client-negotiator.queue_time_us":17}
[       OK ] Parameters/TestRpcSocketTxRxQueue.OverCapacity/0 (1028 ms)
[----------] 1 test from Parameters/TestRpcSocketTxRxQueue (1028 ms total)

[----------] Global test environment tear-down
[==========] 21 tests from 2 test suites ran. (27893 ms total)
[  PASSED  ] 20 tests.
[  FAILED  ] 1 test, listed below:
[  FAILED  ] Parameters/TestRpc.TestCallWithChainCertAndChainCA/SSL_TCP, where GetParam() = (true, false)

 1 FAILED TEST