Parameters/TestRpc.TestCallWithChainCertAndRootCA/SSL_UnixSocket: /data0/somelongdirectorytoavoidrpathissues/src/kudu/src/kudu/rpc/rpc-test.cc:303: Failure
Failed
Bad status: Runtime error: could not verify certificate chain (error with cert: subject=CN = localhost, ST = sadfjas, C = AS, emailAddress = sdflkdsajf, O = lskdfjlsad, OU = sldfkja, issuer=C = AS, ST = ASDfkjdhf, L = lskdjf, O = saldfja, OU = skdjf, CN = localhost, emailAddress = sadjflkadsj): : certificate has expired
Google Test trace:
/data0/somelongdirectorytoavoidrpathissues/src/kudu/src/kudu/rpc/rpc-test.cc:300: Connecting to unix:/tmp/dist-test-taskbC_oXa/test-tmp/rpc-test-0ac8ad13057d4350bb30cf7e231ec1d8.sock
I20260929 02:19:41.587082 5562 test_util.cc:175] -----------------------------------------------
I20260929 02:19:41.587260 5562 test_util.cc:176] Had fatal failures, leaving test files at /tmp/dist-test-taskbC_oXa/test-tmp/rpc-test.2.Parameters_TestRpc.TestCallWithChainCertAndRootCA_SSL_UnixSocket.1790648378107288-5562-0
Note: This is test shard 3 of 8.
[==========] Running 21 tests from 2 test suites.
[----------] Global test environment set-up.
[----------] 1 test from TestRpc
[ RUN ] TestRpc.TestNegotiationTimeout
WARNING: Logging before InitGoogleLogging() is written to STDERR
I20260929 02:19:38.327031 5562 rpc-test-base.h:595] status: Timed out: connection negotiation to 0.0.0.0:44567 for RPC Sleep timed out after 0.100s (ON_OUTBOUND_QUEUE), seconds elapsed: 0.10093
W20260929 02:19:41.301463 5572 negotiation.cc:337] Failed RPC negotiation. Trace:
0929 02:19:38.227120 (+ 0us) reactor.cc:625] Submitting negotiation task for client connection to 0.0.0.0:44567 (local address 127.0.0.1:42768)
0929 02:19:38.227920 (+ 800us) negotiation.cc:107] Waiting for socket to connect
0929 02:19:38.227969 (+ 49us) client_negotiation.cc:174] Beginning negotiation
0929 02:19:38.242106 (+ 14137us) client_negotiation.cc:252] Sending NEGOTIATE NegotiatePB request
0929 02:19:41.300171 (+3058065us) negotiation.cc:327] Negotiation complete: Timed out: Client connection negotiation failed: client connection to 0.0.0.0:44567: received 0 of 4 requested bytes
Metrics: {"client-negotiator.queue_time_us":203}
[ OK ] TestRpc.TestNegotiationTimeout (3130 ms)
[----------] 1 test from TestRpc (3130 ms total)
[----------] 20 tests from Parameters/TestRpc
[ RUN ] Parameters/TestRpc.TestAcceptorPoolStartStop/SSL_UnixSocket
I20260929 02:19:41.340818 5588 acceptor_pool.cc:254] collecting diagnostics on the listening RPC socket unix:/tmp/dist-test-taskbC_oXa/test-tmp/rpc-test-a848bd7fee1f4e4c8e97adfa66c921fc.sock every 8 connection(s)
I20260929 02:19:41.342700 5589 acceptor_pool.cc:254] collecting diagnostics on the listening RPC socket unix:/tmp/dist-test-taskbC_oXa/test-tmp/rpc-test-a848bd7fee1f4e4c8e97adfa66c921fc.sock every 8 connection(s)
I20260929 02:19:41.391145 5599 acceptor_pool.cc:254] collecting diagnostics on the listening RPC socket unix:/tmp/dist-test-taskbC_oXa/test-tmp/rpc-test-a848bd7fee1f4e4c8e97adfa66c921fc.sock every 8 connection(s)
I20260929 02:19:41.392690 5600 acceptor_pool.cc:254] collecting diagnostics on the listening RPC socket unix:/tmp/dist-test-taskbC_oXa/test-tmp/rpc-test-a848bd7fee1f4e4c8e97adfa66c921fc.sock every 8 connection(s)
I20260929 02:19:41.414937 5610 acceptor_pool.cc:254] collecting diagnostics on the listening RPC socket unix:/tmp/dist-test-taskbC_oXa/test-tmp/rpc-test-a848bd7fee1f4e4c8e97adfa66c921fc.sock every 8 connection(s)
I20260929 02:19:41.415675 5611 acceptor_pool.cc:254] collecting diagnostics on the listening RPC socket unix:/tmp/dist-test-taskbC_oXa/test-tmp/rpc-test-a848bd7fee1f4e4c8e97adfa66c921fc.sock every 8 connection(s)
I20260929 02:19:41.443202 5621 acceptor_pool.cc:254] collecting diagnostics on the listening RPC socket unix:/tmp/dist-test-taskbC_oXa/test-tmp/rpc-test-a848bd7fee1f4e4c8e97adfa66c921fc.sock every 8 connection(s)
I20260929 02:19:41.443958 5622 acceptor_pool.cc:254] collecting diagnostics on the listening RPC socket unix:/tmp/dist-test-taskbC_oXa/test-tmp/rpc-test-a848bd7fee1f4e4c8e97adfa66c921fc.sock every 8 connection(s)
I20260929 02:19:41.462039 5632 acceptor_pool.cc:254] collecting diagnostics on the listening RPC socket unix:/tmp/dist-test-taskbC_oXa/test-tmp/rpc-test-a848bd7fee1f4e4c8e97adfa66c921fc.sock every 8 connection(s)
I20260929 02:19:41.462785 5633 acceptor_pool.cc:254] collecting diagnostics on the listening RPC socket unix:/tmp/dist-test-taskbC_oXa/test-tmp/rpc-test-a848bd7fee1f4e4c8e97adfa66c921fc.sock every 8 connection(s)
[ OK ] Parameters/TestRpc.TestAcceptorPoolStartStop/SSL_UnixSocket (161 ms)
[ RUN ] Parameters/TestRpc.TestCall/SSL_UnixSocket
I20260929 02:19:41.485195 5645 acceptor_pool.cc:254] collecting diagnostics on the listening RPC socket unix:/tmp/dist-test-taskbC_oXa/test-tmp/rpc-test-f845f92791f049e6ab0849094b52a088.sock every 8 connection(s)
I20260929 02:19:41.487326 5646 acceptor_pool.cc:254] collecting diagnostics on the listening RPC socket unix:/tmp/dist-test-taskbC_oXa/test-tmp/rpc-test-f845f92791f049e6ab0849094b52a088.sock every 8 connection(s)
I20260929 02:19:41.493229 5562 rpc-test.cc:234] Connecting to unix:/tmp/dist-test-taskbC_oXa/test-tmp/rpc-test-f845f92791f049e6ab0849094b52a088.sock
W20260929 02:19:41.543018 5642 connection.cc:196] Error closing socket: Network error: TlsSocket::Close: Broken pipe
[ OK ] Parameters/TestRpc.TestCall/SSL_UnixSocket (82 ms)
[ RUN ] Parameters/TestRpc.TestCallWithChainCertAndRootCA/SSL_UnixSocket
I20260929 02:19:41.566022 5670 acceptor_pool.cc:254] collecting diagnostics on the listening RPC socket unix:/tmp/dist-test-taskbC_oXa/test-tmp/rpc-test-0ac8ad13057d4350bb30cf7e231ec1d8.sock every 8 connection(s)
I20260929 02:19:41.566777 5671 acceptor_pool.cc:254] collecting diagnostics on the listening RPC socket unix:/tmp/dist-test-taskbC_oXa/test-tmp/rpc-test-0ac8ad13057d4350bb30cf7e231ec1d8.sock every 8 connection(s)
/data0/somelongdirectorytoavoidrpathissues/src/kudu/src/kudu/rpc/rpc-test.cc:303: Failure
Failed
Bad status: Runtime error: could not verify certificate chain (error with cert: subject=CN = localhost, ST = sadfjas, C = AS, emailAddress = sdflkdsajf, O = lskdfjlsad, OU = sldfkja, issuer=C = AS, ST = ASDfkjdhf, L = lskdjf, O = saldfja, OU = skdjf, CN = localhost, emailAddress = sadjflkadsj): : certificate has expired
Google Test trace:
/data0/somelongdirectorytoavoidrpathissues/src/kudu/src/kudu/rpc/rpc-test.cc:300: Connecting to unix:/tmp/dist-test-taskbC_oXa/test-tmp/rpc-test-0ac8ad13057d4350bb30cf7e231ec1d8.sock
I20260929 02:19:41.587082 5562 test_util.cc:175] -----------------------------------------------
I20260929 02:19:41.587260 5562 test_util.cc:176] Had fatal failures, leaving test files at /tmp/dist-test-taskbC_oXa/test-tmp/rpc-test.2.Parameters_TestRpc.TestCallWithChainCertAndRootCA_SSL_UnixSocket.1790648378107288-5562-0
[ FAILED ] Parameters/TestRpc.TestCallWithChainCertAndRootCA/SSL_UnixSocket, where GetParam() = (true, true) (38 ms)
[ RUN ] Parameters/TestRpc.TestCallWithBadPasswordProtectedKey/SSL_UnixSocket
[ OK ] Parameters/TestRpc.TestCallWithBadPasswordProtectedKey/SSL_UnixSocket (32 ms)
[ RUN ] Parameters/TestRpc.TestInvalidMethodCall/SSL_UnixSocket
I20260929 02:19:41.653895 5707 acceptor_pool.cc:254] collecting diagnostics on the listening RPC socket unix:/tmp/dist-test-taskbC_oXa/test-tmp/rpc-test-1b79c239c6b64a68b57a537c5c5390ba.sock every 8 connection(s)
I20260929 02:19:41.654753 5708 acceptor_pool.cc:254] collecting diagnostics on the listening RPC socket unix:/tmp/dist-test-taskbC_oXa/test-tmp/rpc-test-1b79c239c6b64a68b57a537c5c5390ba.sock every 8 connection(s)
I20260929 02:19:41.658216 5562 rpc-test.cc:406] Connecting to unix:/tmp/dist-test-taskbC_oXa/test-tmp/rpc-test-1b79c239c6b64a68b57a537c5c5390ba.sock
W20260929 02:19:41.691107 5704 connection.cc:196] Error closing socket: Network error: TlsSocket::Close: Broken pipe
[ OK ] Parameters/TestRpc.TestInvalidMethodCall/SSL_UnixSocket (77 ms)
[ RUN ] Parameters/TestRpc.TestHighFDs/SSL_UnixSocket
I20260929 02:19:41.909582 5732 acceptor_pool.cc:254] collecting diagnostics on the listening RPC socket unix:/tmp/dist-test-taskbC_oXa/test-tmp/rpc-test-b68b390d2e3d49ba94c8c432837671e6.sock every 8 connection(s)
I20260929 02:19:41.910331 5733 acceptor_pool.cc:254] collecting diagnostics on the listening RPC socket unix:/tmp/dist-test-taskbC_oXa/test-tmp/rpc-test-b68b390d2e3d49ba94c8c432837671e6.sock every 8 connection(s)
W20260929 02:19:41.946419 5729 connection.cc:196] Error closing socket: Network error: TlsSocket::Close: Broken pipe
[ OK ] Parameters/TestRpc.TestHighFDs/SSL_UnixSocket (262 ms)
[ RUN ] Parameters/TestRpc.TestConnectionAlwaysKeepalive/SSL_UnixSocket
I20260929 02:19:41.980903 5755 acceptor_pool.cc:254] collecting diagnostics on the listening RPC socket unix:/tmp/dist-test-taskbC_oXa/test-tmp/rpc-test-6e7b368ec65a48fd9e3617fcbb33e447.sock every 8 connection(s)
I20260929 02:19:41.981631 5756 acceptor_pool.cc:254] collecting diagnostics on the listening RPC socket unix:/tmp/dist-test-taskbC_oXa/test-tmp/rpc-test-6e7b368ec65a48fd9e3617fcbb33e447.sock every 8 connection(s)
I20260929 02:19:41.984750 5562 rpc-test.cc:532] Connecting to unix:/tmp/dist-test-taskbC_oXa/test-tmp/rpc-test-6e7b368ec65a48fd9e3617fcbb33e447.sock
W20260929 02:19:45.029560 5754 connection.cc:196] Error closing socket: Network error: TlsSocket::Close: Broken pipe
[ OK ] Parameters/TestRpc.TestConnectionAlwaysKeepalive/SSL_UnixSocket (3074 ms)
[ RUN ] Parameters/TestRpc.TestReopenOutboundConnections/SSL_UnixSocket
I20260929 02:19:45.055914 5778 acceptor_pool.cc:254] collecting diagnostics on the listening RPC socket unix:/tmp/dist-test-taskbC_oXa/test-tmp/rpc-test-6be50035834a43fa9b05950c8fab2b6a.sock every 8 connection(s)
I20260929 02:19:45.056679 5779 acceptor_pool.cc:254] collecting diagnostics on the listening RPC socket unix:/tmp/dist-test-taskbC_oXa/test-tmp/rpc-test-6be50035834a43fa9b05950c8fab2b6a.sock every 8 connection(s)
I20260929 02:19:45.059827 5562 rpc-test.cc:658] Connecting to unix:/tmp/dist-test-taskbC_oXa/test-tmp/rpc-test-6be50035834a43fa9b05950c8fab2b6a.sock
W20260929 02:19:45.099359 5777 connection.cc:196] Error closing socket: Network error: TlsSocket::Close: Broken pipe
W20260929 02:19:45.110438 5777 connection.cc:196] Error closing socket: Network error: TlsSocket::Close: Broken pipe
W20260929 02:19:45.121263 5777 connection.cc:196] Error closing socket: Network error: TlsSocket::Close: Broken pipe
W20260929 02:19:45.133177 5777 connection.cc:196] Error closing socket: Network error: TlsSocket::Close: Broken pipe
W20260929 02:19:45.144026 5777 connection.cc:196] Error closing socket: Network error: TlsSocket::Close: Broken pipe
W20260929 02:19:45.154678 5777 connection.cc:196] Error closing socket: Network error: TlsSocket::Close: Broken pipe
W20260929 02:19:45.165422 5777 connection.cc:196] Error closing socket: Network error: TlsSocket::Close: Broken pipe
W20260929 02:19:45.177506 5777 connection.cc:196] Error closing socket: Network error: TlsSocket::Close: Broken pipe
W20260929 02:19:45.188539 5777 connection.cc:196] Error closing socket: Network error: TlsSocket::Close: Broken pipe
W20260929 02:19:45.199730 5777 connection.cc:196] Error closing socket: Network error: TlsSocket::Close: Broken pipe
W20260929 02:19:45.212909 5777 connection.cc:196] Error closing socket: Network error: TlsSocket::Close: Broken pipe
W20260929 02:19:45.222903 5777 connection.cc:196] Error closing socket: Network error: TlsSocket::Close: Broken pipe
W20260929 02:19:45.234113 5777 connection.cc:196] Error closing socket: Network error: TlsSocket::Close: Broken pipe
W20260929 02:19:45.245800 5777 connection.cc:196] Error closing socket: Network error: TlsSocket::Close: Broken pipe
W20260929 02:19:45.245891 5778 acceptor_pool.cc:285] unable to collect diagnostics on RPC socket unix:/tmp/dist-test-taskbC_oXa/test-tmp/rpc-test-6be50035834a43fa9b05950c8fab2b6a.sock: Not implemented: netlink diagnostics is currently supported only on IPv4 TCP sockets
W20260929 02:19:45.257324 5777 connection.cc:196] Error closing socket: Network error: TlsSocket::Close: Broken pipe
W20260929 02:19:45.269646 5777 connection.cc:196] Error closing socket: Network error: TlsSocket::Close: Broken pipe
W20260929 02:19:45.281168 5777 connection.cc:196] Error closing socket: Network error: TlsSocket::Close: Broken pipe
W20260929 02:19:45.292562 5777 connection.cc:196] Error closing socket: Network error: TlsSocket::Close: Broken pipe
W20260929 02:19:45.304414 5777 connection.cc:196] Error closing socket: Network error: TlsSocket::Close: Broken pipe
W20260929 02:19:45.327528 5777 connection.cc:196] Error closing socket: Network error: TlsSocket::Close: Broken pipe
W20260929 02:19:45.339383 5777 connection.cc:196] Error closing socket: Network error: TlsSocket::Close: Broken pipe
W20260929 02:19:45.351029 5777 connection.cc:196] Error closing socket: Network error: TlsSocket::Close: Broken pipe
W20260929 02:19:45.362702 5777 connection.cc:196] Error closing socket: Network error: TlsSocket::Close: Broken pipe
W20260929 02:19:45.373617 5777 connection.cc:196] Error closing socket: Network error: TlsSocket::Close: Broken pipe
W20260929 02:19:45.384552 5777 connection.cc:196] Error closing socket: Network error: TlsSocket::Close: Broken pipe
W20260929 02:19:45.404742 5777 connection.cc:196] Error closing socket: Network error: TlsSocket::Close: Broken pipe
W20260929 02:19:45.415233 5777 connection.cc:196] Error closing socket: Network error: TlsSocket::Close: Broken pipe
W20260929 02:19:45.425585 5777 connection.cc:196] Error closing socket: Network error: TlsSocket::Close: Broken pipe
W20260929 02:19:45.435736 5777 connection.cc:196] Error closing socket: Network error: TlsSocket::Close: Broken pipe
W20260929 02:19:45.446585 5777 connection.cc:196] Error closing socket: Network error: TlsSocket::Close: Broken pipe
[ OK ] Parameters/TestRpc.TestReopenOutboundConnections/SSL_UnixSocket (417 ms)
[ RUN ] Parameters/TestRpc.TestConnectionNetworkPlane/SSL_UnixSocket
I20260929 02:19:45.481283 5801 acceptor_pool.cc:254] collecting diagnostics on the listening RPC socket unix:/tmp/dist-test-taskbC_oXa/test-tmp/rpc-test-a9ee3506a6964ccca2f7dfe00c573786.sock every 8 connection(s)
I20260929 02:19:45.482028 5802 acceptor_pool.cc:254] collecting diagnostics on the listening RPC socket unix:/tmp/dist-test-taskbC_oXa/test-tmp/rpc-test-a9ee3506a6964ccca2f7dfe00c573786.sock every 8 connection(s)
I20260929 02:19:45.485219 5562 rpc-test.cc:772] Connecting to unix:/tmp/dist-test-taskbC_oXa/test-tmp/rpc-test-a9ee3506a6964ccca2f7dfe00c573786.sock
W20260929 02:19:45.535060 5800 connection.cc:196] Error closing socket: Network error: TlsSocket::Close: Broken pipe
W20260929 02:19:45.536576 5800 connection.cc:196] Error closing socket: Network error: TlsSocket::Close: Broken pipe
[ OK ] Parameters/TestRpc.TestConnectionNetworkPlane/SSL_UnixSocket (88 ms)
[ RUN ] Parameters/TestRpc.TestTCPKeepalive/SSL_UnixSocket
I20260929 02:19:45.557870 5826 acceptor_pool.cc:254] collecting diagnostics on the listening RPC socket unix:/tmp/dist-test-taskbC_oXa/test-tmp/rpc-test-a178860191c3477db3428e6ff6a3ba5b.sock every 8 connection(s)
I20260929 02:19:45.558630 5827 acceptor_pool.cc:254] collecting diagnostics on the listening RPC socket unix:/tmp/dist-test-taskbC_oXa/test-tmp/rpc-test-a178860191c3477db3428e6ff6a3ba5b.sock every 8 connection(s)
I20260929 02:19:45.584558 5830 rpc-test-base.h:222] got call: sleep_micros: 8000000 deferred: true
I20260929 02:19:53.588867 5830 rpcz_store.cc:275] Call kudu.rpc.GenericCalculatorService.Sleep from unix:<unnamed> (request call id 0) took 8004 ms. Trace:
I20260929 02:19:53.589309 5830 rpcz_store.cc:276] 0929 02:19:45.584388 (+ 0us) service_pool.cc:170] Inserting onto call queue
0929 02:19:45.584498 (+ 110us) service_pool.cc:227] Handling call
0929 02:19:53.588698 (+8004200us) inbound_call.cc:173] Queueing success response
Metrics: {}
W20260929 02:19:53.595275 5823 connection.cc:196] Error closing socket: Network error: TlsSocket::Close: Broken pipe
[ OK ] Parameters/TestRpc.TestTCPKeepalive/SSL_UnixSocket (8061 ms)
[ RUN ] Parameters/TestRpc.TestMaxSmallSidecars/SSL_UnixSocket
I20260929 02:19:53.637040 5852 acceptor_pool.cc:254] collecting diagnostics on the listening RPC socket unix:/tmp/dist-test-taskbC_oXa/test-tmp/rpc-test-72245343887f4afdad03176c9da2aa36.sock every 8 connection(s)
I20260929 02:19:53.637945 5853 acceptor_pool.cc:254] collecting diagnostics on the listening RPC socket unix:/tmp/dist-test-taskbC_oXa/test-tmp/rpc-test-72245343887f4afdad03176c9da2aa36.sock every 8 connection(s)
W20260929 02:19:53.822341 5849 connection.cc:196] Error closing socket: Network error: TlsSocket::Close: Broken pipe
[ OK ] Parameters/TestRpc.TestMaxSmallSidecars/SSL_UnixSocket (225 ms)
[ RUN ] Parameters/TestRpc.TestCallTimeout/SSL_UnixSocket
I20260929 02:19:53.858299 5877 acceptor_pool.cc:254] collecting diagnostics on the listening RPC socket unix:/tmp/dist-test-taskbC_oXa/test-tmp/rpc-test-2cfaca4c22c142b887460f3a66968237.sock every 8 connection(s)
I20260929 02:19:53.859067 5878 acceptor_pool.cc:254] collecting diagnostics on the listening RPC socket unix:/tmp/dist-test-taskbC_oXa/test-tmp/rpc-test-2cfaca4c22c142b887460f3a66968237.sock every 8 connection(s)
I20260929 02:19:53.886996 5562 rpc-test-base.h:595] status: Timed out: connection negotiation to unix:/tmp/dist-test-taskbC_oXa/test-tmp/rpc-test-2cfaca4c22c142b887460f3a66968237.sock for RPC Sleep timed out after 0.000s (ON_OUTBOUND_QUEUE), seconds elapsed: 0.0024924
I20260929 02:19:53.894687 5881 rpc-test-base.h:222] got call: sleep_micros: 700000
I20260929 02:19:54.088490 5562 rpc-test-base.h:595] status: Timed out: Sleep RPC to unix:/tmp/dist-test-taskbC_oXa/test-tmp/rpc-test-2cfaca4c22c142b887460f3a66968237.sock timed out after 0.200s (SENT), seconds elapsed: 0.201078
I20260929 02:19:54.089854 5880 rpc-test-base.h:222] got call: sleep_micros: 2000000
W20260929 02:19:54.595369 5881 rpcz_store.cc:267] Call kudu.rpc.GenericCalculatorService.Sleep from unix:<unnamed> (request call id 1) took 700 ms (client timeout 200 ms). Trace:
W20260929 02:19:54.595724 5881 rpcz_store.cc:269] 0929 02:19:53.894498 (+ 0us) service_pool.cc:170] Inserting onto call queue
0929 02:19:53.894616 (+ 118us) service_pool.cc:227] Handling call
0929 02:19:54.595310 (+700694us) inbound_call.cc:173] Queueing success response
Metrics: {}
I20260929 02:19:55.591033 5562 rpc-test-base.h:595] status: Timed out: Sleep RPC to unix:/tmp/dist-test-taskbC_oXa/test-tmp/rpc-test-2cfaca4c22c142b887460f3a66968237.sock timed out after 1.500s (SENT), seconds elapsed: 1.50223
W20260929 02:19:56.090408 5880 rpcz_store.cc:267] Call kudu.rpc.GenericCalculatorService.Sleep from unix:<unnamed> (request call id 2) took 2000 ms (client timeout 1500 ms). Trace:
W20260929 02:19:56.090726 5880 rpcz_store.cc:269] 0929 02:19:54.089614 (+ 0us) service_pool.cc:170] Inserting onto call queue
0929 02:19:54.089787 (+ 173us) service_pool.cc:227] Handling call
0929 02:19:56.090349 (+2000562us) inbound_call.cc:173] Queueing success response
Metrics: {}
W20260929 02:19:56.091259 5874 connection.cc:441] server connection from unix:<unnamed> torn down before Call kudu.rpc.GenericCalculatorService.Sleep from unix:<unnamed> (request call id 2) could send its response
[ OK ] Parameters/TestRpc.TestCallTimeout/SSL_UnixSocket (2268 ms)
[ RUN ] Parameters/TestRpc.TestServerShutsDown/SSL_UnixSocket
I20260929 02:19:56.098556 5562 rpc-test.cc:1125] Connecting to 0.0.0.0:39747
W20260929 02:19:56.107314 5894 negotiation.cc:337] Failed RPC negotiation. Trace:
0929 02:19:56.105852 (+ 0us) reactor.cc:625] Submitting negotiation task for client connection to 0.0.0.0:39747 (local address 127.0.0.1:41960)
0929 02:19:56.106324 (+ 472us) negotiation.cc:107] Waiting for socket to connect
0929 02:19:56.106356 (+ 32us) client_negotiation.cc:174] Beginning negotiation
0929 02:19:56.106590 (+ 234us) client_negotiation.cc:252] Sending NEGOTIATE NegotiatePB request
0929 02:19:56.106800 (+ 210us) negotiation.cc:327] Negotiation complete: Network error: Client connection negotiation failed: client connection to 0.0.0.0:39747: BlockingWrite error: write error: Broken pipe (error 32)
Metrics: {"client-negotiator.queue_time_us":133}
[ OK ] Parameters/TestRpc.TestServerShutsDown/SSL_UnixSocket (13 ms)
[ RUN ] Parameters/TestRpc.TimedOutOnResponseMetric/SSL_UnixSocket
I20260929 02:19:56.143787 5911 acceptor_pool.cc:254] collecting diagnostics on the listening RPC socket unix:/tmp/dist-test-taskbC_oXa/test-tmp/rpc-test-55a641535a1342838ad5035fbb0d32d4.sock every 8 connection(s)
I20260929 02:19:56.144479 5912 acceptor_pool.cc:254] collecting diagnostics on the listening RPC socket unix:/tmp/dist-test-taskbC_oXa/test-tmp/rpc-test-55a641535a1342838ad5035fbb0d32d4.sock every 8 connection(s)
W20260929 02:19:56.380775 5915 rpcz_store.cc:267] Call kudu.rpc_test.CalculatorService.Sleep from unix:<unnamed> (request call id 3) took 50 ms (client timeout 25 ms). Trace:
W20260929 02:19:56.381129 5915 rpcz_store.cc:269] 0929 02:19:56.330069 (+ 0us) service_pool.cc:170] Inserting onto call queue
0929 02:19:56.330186 (+ 117us) service_pool.cc:227] Handling call
0929 02:19:56.380694 (+ 50508us) inbound_call.cc:173] Queueing success response
Related trace 'test_child':
Metrics: {"test_sleep_us":50000,"child_traces":[["test_child",{"related_trace_metric":1}]]}
W20260929 02:19:56.440587 5915 rpcz_store.cc:267] Call kudu.rpc_test.CalculatorService.Sleep from unix:<unnamed> (request call id 4) took 50 ms (client timeout 50 ms). Trace:
W20260929 02:19:56.440893 5915 rpcz_store.cc:269] 0929 02:19:56.389986 (+ 0us) service_pool.cc:170] Inserting onto call queue
0929 02:19:56.390130 (+ 144us) service_pool.cc:227] Handling call
0929 02:19:56.440528 (+ 50398us) inbound_call.cc:173] Queueing success response
Related trace 'test_child':
Metrics: {"test_sleep_us":50000,"child_traces":[["test_child",{"related_trace_metric":1}]]}
[ OK ] Parameters/TestRpc.TimedOutOnResponseMetric/SSL_UnixSocket (339 ms)
[ RUN ] Parameters/TestRpc.AcceptorDispatchingTimesMetric/SSL_UnixSocket
I20260929 02:19:56.460600 5936 acceptor_pool.cc:254] collecting diagnostics on the listening RPC socket 0.0.0.0:33501 every 8 connection(s)
I20260929 02:19:56.461315 5937 acceptor_pool.cc:254] collecting diagnostics on the listening RPC socket 0.0.0.0:33501 every 8 connection(s)
W20260929 02:19:56.467662 5932 negotiation.cc:337] Failed RPC negotiation. Trace:
0929 02:19:56.465407 (+ 0us) reactor.cc:625] Submitting negotiation task for server connection from 127.0.0.1:37762 (local address 127.0.0.1:33501)
0929 02:19:56.466064 (+ 657us) server_negotiation.cc:206] Beginning negotiation
0929 02:19:56.466104 (+ 40us) server_negotiation.cc:399] Waiting for connection header
0929 02:19:56.466431 (+ 327us) negotiation.cc:327] Negotiation complete: Network error: Server connection negotiation failed: server connection from 127.0.0.1:37762: BlockingRecv error: recv got EOF from 127.0.0.1:37762 (error 108)
Metrics: {"server-negotiator.queue_time_us":135}
[ OK ] Parameters/TestRpc.AcceptorDispatchingTimesMetric/SSL_UnixSocket (21 ms)
[ RUN ] Parameters/TestRpc.TestRpcCallbackDestroysMessenger/SSL_UnixSocket
[ OK ] Parameters/TestRpc.TestRpcCallbackDestroysMessenger/SSL_UnixSocket (19 ms)
[ RUN ] Parameters/TestRpc.TestApplicationFeatureFlag/SSL_UnixSocket
I20260929 02:19:56.522256 5961 acceptor_pool.cc:254] collecting diagnostics on the listening RPC socket unix:/tmp/dist-test-taskbC_oXa/test-tmp/rpc-test-6bfea62444e24af49b6735d7696a78a1.sock every 8 connection(s)
I20260929 02:19:56.522989 5962 acceptor_pool.cc:254] collecting diagnostics on the listening RPC socket unix:/tmp/dist-test-taskbC_oXa/test-tmp/rpc-test-6bfea62444e24af49b6735d7696a78a1.sock every 8 connection(s)
W20260929 02:19:56.568466 5958 messenger.cc:357] Unable to handle RPC call: Not implemented: call requires unsupported application feature flags: 99
[ OK ] Parameters/TestRpc.TestApplicationFeatureFlag/SSL_UnixSocket (85 ms)
[ RUN ] Parameters/TestRpc.TestCancellation/SSL_UnixSocket
I20260929 02:19:56.597194 5986 acceptor_pool.cc:254] collecting diagnostics on the listening RPC socket unix:/tmp/dist-test-taskbC_oXa/test-tmp/rpc-test-fc05171c246442969d8cba80ebc86917.sock every 8 connection(s)
I20260929 02:19:56.597910 5987 acceptor_pool.cc:254] collecting diagnostics on the listening RPC socket unix:/tmp/dist-test-taskbC_oXa/test-tmp/rpc-test-fc05171c246442969d8cba80ebc86917.sock every 8 connection(s)
I20260929 02:19:56.601362 5562 rpc-test.cc:1648] Connecting to unix:/tmp/dist-test-taskbC_oXa/test-tmp/rpc-test-fc05171c246442969d8cba80ebc86917.sock
I20260929 02:19:56.721575 5562 rpc-test-base.h:595] status: Aborted: Sleep RPC to unix:/tmp/dist-test-taskbC_oXa/test-tmp/rpc-test-fc05171c246442969d8cba80ebc86917.sock is cancelled in state READY, seconds elapsed: 0.000483179
I20260929 02:19:56.924943 5562 rpc-test-base.h:595] status: Aborted: Sleep RPC to unix:/tmp/dist-test-taskbC_oXa/test-tmp/rpc-test-fc05171c246442969d8cba80ebc86917.sock is cancelled in state SENT, seconds elapsed: 0.000760752
I20260929 02:19:56.925312 5989 rpc-test-base.h:222] got call: sleep_micros: 510000
I20260929 02:19:57.106985 5562 rpc-test-base.h:595] status: Aborted: Sleep RPC to unix:/tmp/dist-test-taskbC_oXa/test-tmp/rpc-test-fc05171c246442969d8cba80ebc86917.sock is cancelled in state SENT, seconds elapsed: 0.000710153
I20260929 02:19:57.107427 5988 rpc-test-base.h:222] got call: sleep_micros: 510000
I20260929 02:19:57.295568 5562 rpc-test-base.h:595] status: Aborted: Sleep RPC to unix:/tmp/dist-test-taskbC_oXa/test-tmp/rpc-test-fc05171c246442969d8cba80ebc86917.sock is cancelled in state SENT, seconds elapsed: 0.000981483
W20260929 02:19:57.307214 5990 rpcz_store.cc:267] Call kudu.rpc.GenericCalculatorService.Sleep from unix:<unnamed> (request call id 11) took 11 ms (client timeout 10 ms). Trace:
W20260929 02:19:57.307600 5990 rpcz_store.cc:269] 0929 02:19:57.295784 (+ 0us) service_pool.cc:170] Inserting onto call queue
0929 02:19:57.306916 (+ 11132us) service_pool.cc:214] Skipping call since client already timed out
0929 02:19:57.307010 (+ 94us) inbound_call.cc:173] Queueing failure response
Metrics: {}
I20260929 02:19:57.308173 5990 rpc-test-base.h:222] got call: sleep_micros: 1500000
W20260929 02:19:57.435902 5989 rpcz_store.cc:267] Call kudu.rpc.GenericCalculatorService.Sleep from unix:<unnamed> (request call id 3) took 510 ms (client timeout 10 ms). Trace:
W20260929 02:19:57.436218 5989 rpcz_store.cc:269] 0929 02:19:56.925141 (+ 0us) service_pool.cc:170] Inserting onto call queue
0929 02:19:56.925258 (+ 117us) service_pool.cc:227] Handling call
0929 02:19:57.435843 (+510585us) inbound_call.cc:173] Queueing success response
Metrics: {}
W20260929 02:19:57.618218 5988 rpcz_store.cc:267] Call kudu.rpc.GenericCalculatorService.Sleep from unix:<unnamed> (request call id 7) took 511 ms (client timeout 10 ms). Trace:
W20260929 02:19:57.618579 5988 rpcz_store.cc:269] 0929 02:19:57.107154 (+ 0us) service_pool.cc:170] Inserting onto call queue
0929 02:19:57.107357 (+ 203us) service_pool.cc:227] Handling call
0929 02:19:57.618159 (+510802us) inbound_call.cc:173] Queueing success response
Metrics: {}
I20260929 02:19:58.298259 5562 rpc-test-base.h:595] status: Timed out: Sleep RPC to unix:/tmp/dist-test-taskbC_oXa/test-tmp/rpc-test-fc05171c246442969d8cba80ebc86917.sock timed out after 1.000s (SENT), seconds elapsed: 1.00206
I20260929 02:19:58.300277 5988 rpc-test-base.h:222] got call: sleep_micros: 1500000
W20260929 02:19:58.808849 5990 rpcz_store.cc:267] Call kudu.rpc.GenericCalculatorService.Sleep from unix:<unnamed> (request call id 12) took 1511 ms (client timeout 1000 ms). Trace:
W20260929 02:19:58.809249 5990 rpcz_store.cc:269] 0929 02:19:57.296847 (+ 0us) service_pool.cc:170] Inserting onto call queue
0929 02:19:57.308140 (+ 11293us) service_pool.cc:227] Handling call
0929 02:19:58.808709 (+1500569us) inbound_call.cc:173] Queueing success response
Metrics: {}
I20260929 02:19:59.300800 5562 rpc-test-base.h:595] status: Timed out: Sleep RPC to unix:/tmp/dist-test-taskbC_oXa/test-tmp/rpc-test-fc05171c246442969d8cba80ebc86917.sock timed out after 1.000s (SENT), seconds elapsed: 1.00206
W20260929 02:19:59.302328 5983 messenger.cc:357] Unable to handle RPC call: Not implemented: call requires unsupported application feature flags: 99, 1
W20260929 02:19:59.303821 5983 messenger.cc:357] Unable to handle RPC call: Not implemented: call requires unsupported application feature flags: 99, 1
W20260929 02:19:59.539043 5983 connection.cc:196] Error closing socket: Network error: TlsSocket::Close: Broken pipe
W20260929 02:19:59.800925 5988 rpcz_store.cc:267] Call kudu.rpc.GenericCalculatorService.Sleep from unix:<unnamed> (request call id 13) took 1501 ms (client timeout 1000 ms). Trace:
W20260929 02:19:59.801231 5988 rpcz_store.cc:269] 0929 02:19:58.299941 (+ 0us) service_pool.cc:170] Inserting onto call queue
0929 02:19:58.300133 (+ 192us) service_pool.cc:227] Handling call
0929 02:19:59.800856 (+1500723us) inbound_call.cc:173] Queueing success response
Metrics: {}
W20260929 02:19:59.801851 5983 connection.cc:441] server connection from unix:<unnamed> torn down before Call kudu.rpc.GenericCalculatorService.Sleep from unix:<unnamed> (request call id 13) could send its response
[ OK ] Parameters/TestRpc.TestCancellation/SSL_UnixSocket (3233 ms)
[ RUN ] Parameters/TestRpc.TestCancellationMultiThreads/SSL_UnixSocket
I20260929 02:19:59.832511 6012 acceptor_pool.cc:254] collecting diagnostics on the listening RPC socket unix:/tmp/dist-test-taskbC_oXa/test-tmp/rpc-test-d3108351c0d6481dab20ada3c52c3d73.sock every 8 connection(s)
I20260929 02:19:59.833377 6013 acceptor_pool.cc:254] collecting diagnostics on the listening RPC socket unix:/tmp/dist-test-taskbC_oXa/test-tmp/rpc-test-d3108351c0d6481dab20ada3c52c3d73.sock every 8 connection(s)
I20260929 02:19:59.836483 5562 rpc-test.cc:1808] Connecting to unix:/tmp/dist-test-taskbC_oXa/test-tmp/rpc-test-d3108351c0d6481dab20ada3c52c3d73.sock
I20260929 02:19:59.999847 6026 test_util.cc:268] Using random seed: -775113992
I20260929 02:20:00.001425 6027 test_util.cc:268] Using random seed: -775112341
I20260929 02:20:00.002986 6028 test_util.cc:268] Using random seed: -775110773
I20260929 02:20:00.004845 6029 test_util.cc:268] Using random seed: -775109139
I20260929 02:20:00.006997 6030 test_util.cc:268] Using random seed: -775106893
I20260929 02:20:00.009689 6031 test_util.cc:268] Using random seed: -775104751
I20260929 02:20:00.011715 6032 test_util.cc:268] Using random seed: -775102755
I20260929 02:20:00.014863 6033 test_util.cc:268] Using random seed: -775099340
I20260929 02:20:00.017537 6034 test_util.cc:268] Using random seed: -775096343
I20260929 02:20:00.019027 6035 test_util.cc:268] Using random seed: -775094858
I20260929 02:20:00.020900 6036 test_util.cc:268] Using random seed: -775093055
I20260929 02:20:00.022449 6037 test_util.cc:268] Using random seed: -775091420
I20260929 02:20:00.024073 6038 test_util.cc:268] Using random seed: -775089810
I20260929 02:20:00.025934 6039 test_util.cc:268] Using random seed: -775087969
I20260929 02:20:00.027879 6040 test_util.cc:268] Using random seed: -775086370
I20260929 02:20:00.029688 6041 test_util.cc:268] Using random seed: -775084276
I20260929 02:20:00.031075 6042 test_util.cc:268] Using random seed: -775082781
I20260929 02:20:00.032644 6043 test_util.cc:268] Using random seed: -775081213
I20260929 02:20:00.034380 6044 test_util.cc:268] Using random seed: -775079467
I20260929 02:20:00.036631 6045 test_util.cc:268] Using random seed: -775077304
I20260929 02:20:00.038319 6046 test_util.cc:268] Using random seed: -775075568
I20260929 02:20:00.040248 6047 test_util.cc:268] Using random seed: -775073680
I20260929 02:20:00.044423 6048 test_util.cc:268] Using random seed: -775069995
I20260929 02:20:00.047093 6049 test_util.cc:268] Using random seed: -775066844
I20260929 02:20:00.049367 6050 test_util.cc:268] Using random seed: -775064593
I20260929 02:20:00.051578 6051 test_util.cc:268] Using random seed: -775062365
I20260929 02:20:00.054557 6052 test_util.cc:268] Using random seed: -775059562
I20260929 02:20:00.057258 6053 test_util.cc:268] Using random seed: -775056899
I20260929 02:20:00.059815 6054 test_util.cc:268] Using random seed: -775054110
I20260929 02:20:00.062424 6055 test_util.cc:268] Using random seed: -775051457
W20260929 02:20:19.749920 6009 connection.cc:196] Error closing socket: Network error: TlsSocket::Close: Broken pipe
[ OK ] Parameters/TestRpc.TestCancellationMultiThreads/SSL_UnixSocket (19958 ms)
[ RUN ] Parameters/TestRpc.TestCallId/SSL_UnixSocket
I20260929 02:20:19.808135 6069 acceptor_pool.cc:254] collecting diagnostics on the listening RPC socket unix:/tmp/dist-test-taskbC_oXa/test-tmp/rpc-test-1be2042bcc664d0c86ed4f61426e8bf8.sock every 8 connection(s)
I20260929 02:20:19.809089 6070 acceptor_pool.cc:254] collecting diagnostics on the listening RPC socket unix:/tmp/dist-test-taskbC_oXa/test-tmp/rpc-test-1be2042bcc664d0c86ed4f61426e8bf8.sock every 8 connection(s)
[ OK ] Parameters/TestRpc.TestCallId/SSL_UnixSocket (91 ms)
[----------] 20 tests from Parameters/TestRpc (38555 ms total)
[----------] Global test environment tear-down
[==========] 21 tests from 2 test suites ran. (41687 ms total)
[ PASSED ] 20 tests.
[ FAILED ] 1 test, listed below:
[ FAILED ] Parameters/TestRpc.TestCallWithChainCertAndRootCA/SSL_UnixSocket, where GetParam() = (true, true)
1 FAILED TEST
I20260929 02:20:19.879801 5562 logging.cc:424] LogThrottler /data0/somelongdirectorytoavoidrpathissues/src/kudu/src/kudu/rpc/acceptor_pool.cc:285: suppressed but not reported on 3 messages since previous log ~34 seconds ago