Diagnosed failure

Parameters/TestRpc.TestCallWithChainCertAndChainCA/SSL_TCP: /data0/somelongdirectorytoavoidrpathissues/src/kudu/src/kudu/rpc/rpc-test.cc:270: Failure
Failed
Bad status: Runtime error: could not verify certificate chain (error with cert: subject=CN = localhost, ST = sadfjas, C = AS, emailAddress = sdflkdsajf, O = lskdfjlsad, OU = sldfkja, issuer=C = AS, ST = ASDfkjdhf, L = lskdjf, O = saldfja, OU = skdjf, CN = localhost, emailAddress = sadjflkadsj): : certificate has expired
Google Test trace:
/data0/somelongdirectorytoavoidrpathissues/src/kudu/src/kudu/rpc/rpc-test.cc:267: Connecting to 0.0.0.0:36441
I20260928 14:52:15.931749 32293 test_util.cc:175] -----------------------------------------------
I20260928 14:52:15.931885 32293 test_util.cc:176] Had fatal failures, leaving test files at /tmp/dist-test-taskQOjiVa/test-tmp/rpc-test.5.Parameters_TestRpc.TestCallWithChainCertAndChainCA_SSL_TCP.1790607135775021-32293-0

Full log

Note: This is test shard 6 of 8.
[==========] Running 21 tests from 2 test suites.
[----------] Global test environment set-up.
[----------] 20 tests from Parameters/TestRpc
[ RUN      ] Parameters/TestRpc.TestMessengerCreateDestroy/SSL_TCP
WARNING: Logging before InitGoogleLogging() is written to STDERR
I20260928 14:52:15.848737 32293 rpc-test.cc:169] started messenger TestCreateDestroy
[       OK ] Parameters/TestRpc.TestMessengerCreateDestroy/SSL_TCP (56 ms)
[ RUN      ] Parameters/TestRpc.TestNegotiationDeadlock/SSL_TCP
I20260928 14:52:15.870733 32313 acceptor_pool.cc:254] collecting diagnostics on the listening RPC socket 0.0.0.0:37821 every 8 connection(s)
I20260928 14:52:15.871003 32314 acceptor_pool.cc:254] collecting diagnostics on the listening RPC socket 0.0.0.0:37821 every 8 connection(s)
[       OK ] Parameters/TestRpc.TestNegotiationDeadlock/SSL_TCP (40 ms)
[ RUN      ] Parameters/TestRpc.TestCallWithChainCertAndChainCA/SSL_TCP
I20260928 14:52:15.919194 32329 acceptor_pool.cc:254] collecting diagnostics on the listening RPC socket 0.0.0.0:36441 every 8 connection(s)
I20260928 14:52:15.919538 32330 acceptor_pool.cc:254] collecting diagnostics on the listening RPC socket 0.0.0.0:36441 every 8 connection(s)
/data0/somelongdirectorytoavoidrpathissues/src/kudu/src/kudu/rpc/rpc-test.cc:270: Failure
Failed
Bad status: Runtime error: could not verify certificate chain (error with cert: subject=CN = localhost, ST = sadfjas, C = AS, emailAddress = sdflkdsajf, O = lskdfjlsad, OU = sldfkja, issuer=C = AS, ST = ASDfkjdhf, L = lskdjf, O = saldfja, OU = skdjf, CN = localhost, emailAddress = sadjflkadsj): : certificate has expired
Google Test trace:
/data0/somelongdirectorytoavoidrpathissues/src/kudu/src/kudu/rpc/rpc-test.cc:267: Connecting to 0.0.0.0:36441
I20260928 14:52:15.931749 32293 test_util.cc:175] -----------------------------------------------
I20260928 14:52:15.931885 32293 test_util.cc:176] Had fatal failures, leaving test files at /tmp/dist-test-taskQOjiVa/test-tmp/rpc-test.5.Parameters_TestRpc.TestCallWithChainCertAndChainCA_SSL_TCP.1790607135775021-32293-0
[  FAILED  ] Parameters/TestRpc.TestCallWithChainCertAndChainCA/SSL_TCP, where GetParam() = (true, false) (38 ms)
[ RUN      ] Parameters/TestRpc.TestCallWithPasswordProtectedKey/SSL_TCP
I20260928 14:52:15.963680 32354 acceptor_pool.cc:254] collecting diagnostics on the listening RPC socket 0.0.0.0:42971 every 8 connection(s)
I20260928 14:52:15.964032 32355 acceptor_pool.cc:254] collecting diagnostics on the listening RPC socket 0.0.0.0:42971 every 8 connection(s)
[       OK ] Parameters/TestRpc.TestCallWithPasswordProtectedKey/SSL_TCP (69 ms)
[ RUN      ] Parameters/TestRpc.TestCallToBadServer/SSL_TCP
I20260928 14:52:16.014806 32293 rpc-test.cc:394] Status: Network error: Client connection negotiation failed: client connection to 0.0.0.0:0: connect: Connection refused (error 111)
I20260928 14:52:16.015641 32293 rpc-test.cc:394] Status: Network error: Client connection negotiation failed: client connection to 0.0.0.0:0: connect: Connection refused (error 111)
I20260928 14:52:16.016364 32293 rpc-test.cc:394] Status: Network error: Client connection negotiation failed: client connection to 0.0.0.0:0: connect: Connection refused (error 111)
I20260928 14:52:16.017119 32293 rpc-test.cc:394] Status: Network error: Client connection negotiation failed: client connection to 0.0.0.0:0: connect: Connection refused (error 111)
I20260928 14:52:16.017932 32293 rpc-test.cc:394] Status: Network error: Client connection negotiation failed: client connection to 0.0.0.0:0: connect: Connection refused (error 111)
[       OK ] Parameters/TestRpc.TestCallToBadServer/SSL_TCP (19 ms)
[ RUN      ] Parameters/TestRpc.TestWrongService/SSL_TCP
I20260928 14:52:16.043810 32389 acceptor_pool.cc:254] collecting diagnostics on the listening RPC socket 0.0.0.0:33449 every 8 connection(s)
I20260928 14:52:16.044090 32390 acceptor_pool.cc:254] collecting diagnostics on the listening RPC socket 0.0.0.0:33449 every 8 connection(s)
I20260928 14:52:16.062774 32387 messenger.cc:345] service WrongServiceName not registered on TestServer
[       OK ] Parameters/TestRpc.TestWrongService/SSL_TCP (47 ms)
[ RUN      ] Parameters/TestRpc.TestConnectionKeepalive/SSL_TCP
I20260928 14:52:16.086740 32412 acceptor_pool.cc:254] collecting diagnostics on the listening RPC socket 0.0.0.0:46383 every 8 connection(s)
I20260928 14:52:16.087024 32413 acceptor_pool.cc:254] collecting diagnostics on the listening RPC socket 0.0.0.0:46383 every 8 connection(s)
I20260928 14:52:16.088101 32293 rpc-test.cc:488] Connecting to 0.0.0.0:46383
[       OK ] Parameters/TestRpc.TestConnectionKeepalive/SSL_TCP (1057 ms)
[ RUN      ] Parameters/TestRpc.TestClientConnectionMetrics/SSL_TCP
I20260928 14:52:17.173297 32437 acceptor_pool.cc:254] collecting diagnostics on the listening RPC socket 0.0.0.0:35333 every 8 connection(s)
I20260928 14:52:17.173660 32438 acceptor_pool.cc:254] collecting diagnostics on the listening RPC socket 0.0.0.0:35333 every 8 connection(s)
I20260928 14:52:17.174690 32293 rpc-test.cc:569] Connecting to 0.0.0.0:35333
[       OK ] Parameters/TestRpc.TestClientConnectionMetrics/SSL_TCP (20406 ms)
[ RUN      ] Parameters/TestRpc.TestCredentialsPolicy/SSL_TCP
I20260928 14:52:37.559237 32460 acceptor_pool.cc:254] collecting diagnostics on the listening RPC socket 0.0.0.0:35269 every 8 connection(s)
I20260928 14:52:37.559499 32461 acceptor_pool.cc:254] collecting diagnostics on the listening RPC socket 0.0.0.0:35269 every 8 connection(s)
I20260928 14:52:37.560523 32293 rpc-test.cc:700] Connecting to 0.0.0.0:35269
[       OK ] Parameters/TestRpc.TestCredentialsPolicy/SSL_TCP (68 ms)
[ RUN      ] Parameters/TestRpc.TestCallLongerThanKeepalive/SSL_TCP
I20260928 14:52:37.616917 32485 acceptor_pool.cc:254] collecting diagnostics on the listening RPC socket 0.0.0.0:41935 every 8 connection(s)
I20260928 14:52:37.617259 32486 acceptor_pool.cc:254] collecting diagnostics on the listening RPC socket 0.0.0.0:41935 every 8 connection(s)
I20260928 14:52:37.646811 32489 rpc-test-base.h:222] got call: sleep_micros: 3000000 deferred: true
I20260928 14:52:40.648574 32489 rpcz_store.cc:275] Call kudu.rpc.GenericCalculatorService.Sleep from 127.0.0.1:49028 (request call id 0) took 3001 ms. Trace:
I20260928 14:52:40.648751 32489 rpcz_store.cc:276] 0928 14:52:37.646674 (+     0us) service_pool.cc:170] Inserting onto call queue
0928 14:52:37.646740 (+    66us) service_pool.cc:227] Handling call
0928 14:52:40.648524 (+3001784us) inbound_call.cc:173] Queueing success response
Metrics: {}
[       OK ] Parameters/TestRpc.TestCallLongerThanKeepalive/SSL_TCP (3055 ms)
[ RUN      ] Parameters/TestRpc.TestRpcSidecar/SSL_TCP
I20260928 14:52:40.686890 32510 acceptor_pool.cc:254] collecting diagnostics on the listening RPC socket 0.0.0.0:42011 every 8 connection(s)
I20260928 14:52:40.687114 32511 acceptor_pool.cc:254] collecting diagnostics on the listening RPC socket 0.0.0.0:42011 every 8 connection(s)
[       OK ] Parameters/TestRpc.TestRpcSidecar/SSL_TCP (131 ms)
[ RUN      ] Parameters/TestRpc.TestRpcSidecarLimits/SSL_TCP
I20260928 14:52:43.075327 32535 acceptor_pool.cc:254] collecting diagnostics on the listening RPC socket 0.0.0.0:35137 every 8 connection(s)
I20260928 14:52:43.075601 32536 acceptor_pool.cc:254] collecting diagnostics on the listening RPC socket 0.0.0.0:35137 every 8 connection(s)
W20260928 14:52:43.090155 32293 serialization.cc:72] Serialized kudu.rpc_test.PushStringsRequestPB (2147483654 bytes) is larger than the maximum configured RPC message size (52428800 bytes). Sending anyway, but peer may reject the data.
W20260928 14:52:43.096366 32534 connection.cc:535] server connection from 127.0.0.1:54790 recv error: Network error: RPC frame had a length of 2147483714, but we only support messages up to 52428800 bytes long.
W20260928 14:52:43.096499 32534 connection.cc:158] shutting down server connection from 127.0.0.1:54790 with pending inbound data: 4/2147483714 bytes received; last active 0 ns ago: status Network error: RPC frame had a length of 2147483714, but we only support messages up to 52428800 bytes long.
W20260928 14:52:43.097016 32548 connection.cc:196] Error closing socket: Network error: TlsSocket::Close: Connection reset by peer
I20260928 14:52:43.112182 32560 acceptor_pool.cc:254] collecting diagnostics on the listening RPC socket 0.0.0.0:43611 every 8 connection(s)
I20260928 14:52:43.112366 32561 acceptor_pool.cc:254] collecting diagnostics on the listening RPC socket 0.0.0.0:43611 every 8 connection(s)
W20260928 14:52:49.666077 32558 connection.cc:577] server connection from 127.0.0.1:50942: received bad data: 'Corruption: Invalid packet: message had a length of 2147483710, but we only support messages up to 2147483647 bytes
'
[       OK ] Parameters/TestRpc.TestRpcSidecarLimits/SSL_TCP (9356 ms)
[ RUN      ] Parameters/TestRpc.TestCallTimeoutDoesntAffectNegotiation/SSL_TCP
I20260928 14:52:50.177618 32585 acceptor_pool.cc:254] collecting diagnostics on the listening RPC socket 0.0.0.0:46789 every 8 connection(s)
I20260928 14:52:50.177770 32586 acceptor_pool.cc:254] collecting diagnostics on the listening RPC socket 0.0.0.0:46789 every 8 connection(s)
W20260928 14:52:50.204288 32581 negotiation.cc:266] Injecting 500ms delay in negotiation
I20260928 14:52:50.254745 32293 rpc-test-base.h:595] status: Timed out: connection negotiation to 0.0.0.0:46789 for RPC Sleep timed out after 0.050s (ON_OUTBOUND_QUEUE), seconds elapsed: 0.0511919
[       OK ] Parameters/TestRpc.TestCallTimeoutDoesntAffectNegotiation/SSL_TCP (571 ms)
[ RUN      ] Parameters/TestRpc.TestRpcHandlerLatencyMetric/SSL_TCP
I20260928 14:52:50.729387 32610 acceptor_pool.cc:254] collecting diagnostics on the listening RPC socket 0.0.0.0:35989 every 8 connection(s)
I20260928 14:52:50.729655 32611 acceptor_pool.cc:254] collecting diagnostics on the listening RPC socket 0.0.0.0:35989 every 8 connection(s)
I20260928 14:52:50.780784 32293 rpc-test.cc:1236] Sleep() min lat: 20770
I20260928 14:52:50.780872 32293 rpc-test.cc:1237] Sleep() mean lat: 20770
I20260928 14:52:50.780918 32293 rpc-test.cc:1238] Sleep() max lat: 20770
I20260928 14:52:50.780938 32293 rpc-test.cc:1239] Sleep() #calls: 1
[       OK ] Parameters/TestRpc.TestRpcHandlerLatencyMetric/SSL_TCP (71 ms)
[ RUN      ] Parameters/TestRpc.TimedOutOnResponseMetricServiceQueue/SSL_TCP
I20260928 14:52:50.802479 32636 acceptor_pool.cc:254] collecting diagnostics on the listening RPC socket 0.0.0.0:40535 every 8 connection(s)
I20260928 14:52:50.802698 32637 acceptor_pool.cc:254] collecting diagnostics on the listening RPC socket 0.0.0.0:40535 every 8 connection(s)
W20260928 14:52:50.866720 32638 rpcz_store.cc:267] Call kudu.rpc_test.CalculatorService.Sleep from 127.0.0.1:38852 (request call id 2) took 20 ms (client timeout 20 ms). Trace:
W20260928 14:52:50.866930 32638 rpcz_store.cc:269] 0928 14:52:50.846311 (+     0us) service_pool.cc:170] Inserting onto call queue
0928 14:52:50.866662 (+ 20351us) service_pool.cc:214] Skipping call since client already timed out
0928 14:52:50.866701 (+    39us) inbound_call.cc:173] Queueing failure response
Metrics: {}
[       OK ] Parameters/TestRpc.TimedOutOnResponseMetricServiceQueue/SSL_TCP (84 ms)
[ RUN      ] Parameters/TestRpc.RpcPendingConnectionsMetric/SSL_TCP
I20260928 14:52:50.876156 32659 acceptor_pool.cc:254] collecting diagnostics on the listening RPC socket 0.0.0.0:44011 every 8 connection(s)
I20260928 14:52:50.876398 32660 acceptor_pool.cc:254] collecting diagnostics on the listening RPC socket 0.0.0.0:44011 every 8 connection(s)
W20260928 14:52:50.878427 32655 negotiation.cc:337] Failed RPC negotiation. Trace:
0928 14:52:50.877791 (+     0us) reactor.cc:625] Submitting negotiation task for server connection from 127.0.0.1:43670 (local address 127.0.0.1:44011)
0928 14:52:50.877963 (+   172us) server_negotiation.cc:206] Beginning negotiation
0928 14:52:50.877967 (+     4us) server_negotiation.cc:399] Waiting for connection header
0928 14:52:50.878111 (+   144us) negotiation.cc:327] Negotiation complete: Network error: Server connection negotiation failed: server connection from 127.0.0.1:43670: BlockingRecv error: recv got EOF from 127.0.0.1:43670 (error 108)
Metrics: {"server-negotiator.queue_time_us":53}
[       OK ] Parameters/TestRpc.RpcPendingConnectionsMetric/SSL_TCP (19 ms)
[ RUN      ] Parameters/TestRpc.TestRpcContextClientDeadline/SSL_TCP
I20260928 14:52:50.908046 32675 acceptor_pool.cc:254] collecting diagnostics on the listening RPC socket 0.0.0.0:36063 every 8 connection(s)
I20260928 14:52:50.908295 32676 acceptor_pool.cc:254] collecting diagnostics on the listening RPC socket 0.0.0.0:36063 every 8 connection(s)
[       OK ] Parameters/TestRpc.TestRpcContextClientDeadline/SSL_TCP (80 ms)
[ RUN      ] Parameters/TestRpc.TestApplicationFeatureFlagUnsupportedServer/SSL_TCP
I20260928 14:52:50.987103 32700 acceptor_pool.cc:254] collecting diagnostics on the listening RPC socket 0.0.0.0:37017 every 8 connection(s)
I20260928 14:52:50.987426 32701 acceptor_pool.cc:254] collecting diagnostics on the listening RPC socket 0.0.0.0:37017 every 8 connection(s)
[       OK ] Parameters/TestRpc.TestApplicationFeatureFlagUnsupportedServer/SSL_TCP (44 ms)
[ RUN      ] Parameters/TestRpc.TestCancellationAsync/SSL_TCP
I20260928 14:52:51.027868 32725 acceptor_pool.cc:254] collecting diagnostics on the listening RPC socket 0.0.0.0:35737 every 8 connection(s)
I20260928 14:52:51.028092 32726 acceptor_pool.cc:254] collecting diagnostics on the listening RPC socket 0.0.0.0:35737 every 8 connection(s)
I20260928 14:52:51.028975 32293 rpc-test.cc:1716] Connecting to 0.0.0.0:35737
I20260928 14:52:51.060297 32293 test_util.cc:268] Using random seed: 945619497
I20260928 14:52:51.102532 32729 rpc-test-base.h:240] got call: sleep_micros: 500 pattern: 4294967295 num_repetitions: 2097152 sidecar_idx: 0
I20260928 14:52:51.124469 32728 rpc-test-base.h:240] got call: sleep_micros: 500 pattern: 4294967295 num_repetitions: 2097152 sidecar_idx: 0
I20260928 14:52:51.150780 32727 rpc-test-base.h:240] got call: sleep_micros: 500 pattern: 4294967295 num_repetitions: 2097152 sidecar_idx: 0
I20260928 14:52:51.189947 32728 rpc-test-base.h:240] got call: sleep_micros: 500 pattern: 4294967295 num_repetitions: 2097152 sidecar_idx: 0
I20260928 14:52:51.224013 32727 rpc-test-base.h:240] got call: sleep_micros: 500 pattern: 4294967295 num_repetitions: 2097152 sidecar_idx: 0
I20260928 14:52:51.256806 32728 rpc-test-base.h:240] got call: sleep_micros: 500 pattern: 4294967295 num_repetitions: 2097152 sidecar_idx: 0
W20260928 14:52:51.288978 32723 connection.cc:196] Error closing socket: Network error: TlsSocket::Close: Broken pipe
W20260928 14:52:51.296609 32723 connection.cc:441] server connection from 127.0.0.1:58094 torn down before Call kudu.rpc.GenericCalculatorService.SleepWithSidecar from 127.0.0.1:58094 (request call id 8) could send its response
[       OK ] Parameters/TestRpc.TestCancellationAsync/SSL_TCP (283 ms)
[ RUN      ] Parameters/TestRpc.TestPerformanceBySocketType/SSL_TCP
I20260928 14:52:51.332623 32750 acceptor_pool.cc:254] collecting diagnostics on the listening RPC socket 0.0.0.0:33565 every 8 connection(s)
I20260928 14:52:51.332767 32751 acceptor_pool.cc:254] collecting diagnostics on the listening RPC socket 0.0.0.0:33565 every 8 connection(s)
I20260928 14:52:51.333870 32293 rpc-test.cc:1846] Connecting to 0.0.0.0:33565
I20260928 14:52:54.471290 32293 rpc-test.cc:1859] Sending 1024MB via ssl-enabled tcp socket: real 3.120s	user 2.947s	sys 2.209s
I20260928 14:52:57.538928 32293 rpc-test.cc:1859] Sending 1024MB via ssl-enabled tcp socket: real 3.067s	user 2.759s	sys 2.309s
I20260928 14:53:00.646032 32293 rpc-test.cc:1859] Sending 1024MB via ssl-enabled tcp socket: real 3.107s	user 2.653s	sys 2.485s
I20260928 14:53:03.849196 32293 rpc-test.cc:1859] Sending 1024MB via ssl-enabled tcp socket: real 3.203s	user 2.985s	sys 2.314s
I20260928 14:53:06.981926 32293 rpc-test.cc:1859] Sending 1024MB via ssl-enabled tcp socket: real 3.133s	user 2.928s	sys 2.259s
[       OK ] Parameters/TestRpc.TestPerformanceBySocketType/SSL_TCP (15691 ms)
[----------] 20 tests from Parameters/TestRpc (51195 ms total)

[----------] 1 test from Parameters/TestRpcSocketTxRxQueue
[ RUN      ] Parameters/TestRpcSocketTxRxQueue.OverCapacity/0
W20260928 14:53:07.294703   317 negotiation.cc:337] Failed RPC negotiation. Trace:
0928 14:53:07.007575 (+     0us) reactor.cc:625] Submitting negotiation task for client connection to 0.0.0.0:38705 (local address 127.0.0.1:58252)
0928 14:53:07.007743 (+   168us) negotiation.cc:107] Waiting for socket to connect
0928 14:53:07.007759 (+    16us) client_negotiation.cc:174] Beginning negotiation
0928 14:53:07.007852 (+    93us) client_negotiation.cc:252] Sending NEGOTIATE NegotiatePB request
0928 14:53:07.294208 (+286356us) negotiation.cc:327] Negotiation complete: Network error: Client connection negotiation failed: client connection to 0.0.0.0:38705: BlockingRecv error: recv error from unknown peer: Transport endpoint is not connected (error 107)
Metrics: {"client-negotiator.queue_time_us":55}
W20260928 14:53:07.295022 32767 negotiation.cc:337] Failed RPC negotiation. Trace:
0928 14:53:07.002409 (+     0us) reactor.cc:625] Submitting negotiation task for client connection to 0.0.0.0:38705 (local address 127.0.0.1:58242)
0928 14:53:07.002587 (+   178us) negotiation.cc:107] Waiting for socket to connect
0928 14:53:07.002609 (+    22us) client_negotiation.cc:174] Beginning negotiation
0928 14:53:07.002720 (+   111us) client_negotiation.cc:252] Sending NEGOTIATE NegotiatePB request
0928 14:53:07.294092 (+291372us) negotiation.cc:327] Negotiation complete: Network error: Client connection negotiation failed: client connection to 0.0.0.0:38705: BlockingRecv error: recv error from unknown peer: Transport endpoint is not connected (error 107)
Metrics: {"client-negotiator.queue_time_us":53}
W20260928 14:53:07.295624   344 negotiation.cc:337] Failed RPC negotiation. Trace:
0928 14:53:07.015431 (+     0us) reactor.cc:625] Submitting negotiation task for client connection to 0.0.0.0:38705 (local address 127.0.0.1:58276)
0928 14:53:07.015622 (+   191us) negotiation.cc:107] Waiting for socket to connect
0928 14:53:07.015644 (+    22us) client_negotiation.cc:174] Beginning negotiation
0928 14:53:07.015730 (+    86us) client_negotiation.cc:252] Sending NEGOTIATE NegotiatePB request
0928 14:53:07.294405 (+278675us) negotiation.cc:327] Negotiation complete: Network error: Client connection negotiation failed: client connection to 0.0.0.0:38705: BlockingRecv error: recv error from unknown peer: Transport endpoint is not connected (error 107)
Metrics: {"client-negotiator.queue_time_us":55}
W20260928 14:53:07.296303   335 negotiation.cc:337] Failed RPC negotiation. Trace:
0928 14:53:07.012676 (+     0us) reactor.cc:625] Submitting negotiation task for client connection to 0.0.0.0:38705 (local address 127.0.0.1:58266)
0928 14:53:07.012856 (+   180us) negotiation.cc:107] Waiting for socket to connect
0928 14:53:07.012872 (+    16us) client_negotiation.cc:174] Beginning negotiation
0928 14:53:07.012961 (+    89us) client_negotiation.cc:252] Sending NEGOTIATE NegotiatePB request
0928 14:53:07.294441 (+281480us) negotiation.cc:327] Negotiation complete: Network error: Client connection negotiation failed: client connection to 0.0.0.0:38705: BlockingRecv error: recv error from unknown peer: Transport endpoint is not connected (error 107)
Metrics: {"client-negotiator.queue_time_us":54}
W20260928 14:53:07.297165   308 negotiation.cc:337] Failed RPC negotiation. Trace:
0928 14:53:07.004965 (+     0us) reactor.cc:625] Submitting negotiation task for client connection to 0.0.0.0:38705 (local address 127.0.0.1:58248)
0928 14:53:07.005144 (+   179us) negotiation.cc:107] Waiting for socket to connect
0928 14:53:07.005159 (+    15us) client_negotiation.cc:174] Beginning negotiation
0928 14:53:07.005252 (+    93us) client_negotiation.cc:252] Sending NEGOTIATE NegotiatePB request
0928 14:53:07.294171 (+288919us) negotiation.cc:327] Negotiation complete: Network error: Client connection negotiation failed: client connection to 0.0.0.0:38705: BlockingRecv error: recv error from unknown peer: Transport endpoint is not connected (error 107)
Metrics: {"client-negotiator.queue_time_us":53}
W20260928 14:53:07.297168   326 negotiation.cc:337] Failed RPC negotiation. Trace:
0928 14:53:07.010147 (+     0us) reactor.cc:625] Submitting negotiation task for client connection to 0.0.0.0:38705 (local address 127.0.0.1:58258)
0928 14:53:07.010320 (+   173us) negotiation.cc:107] Waiting for socket to connect
0928 14:53:07.010333 (+    13us) client_negotiation.cc:174] Beginning negotiation
0928 14:53:07.010421 (+    88us) client_negotiation.cc:252] Sending NEGOTIATE NegotiatePB request
0928 14:53:07.294092 (+283671us) negotiation.cc:327] Negotiation complete: Network error: Client connection negotiation failed: client connection to 0.0.0.0:38705: BlockingRecv error: recv error from unknown peer: Transport endpoint is not connected (error 107)
Metrics: {"client-negotiator.queue_time_us":53}
[       OK ] Parameters/TestRpcSocketTxRxQueue.OverCapacity/0 (1070 ms)
[----------] 1 test from Parameters/TestRpcSocketTxRxQueue (1070 ms total)

[----------] Global test environment tear-down
[==========] 21 tests from 2 test suites ran. (52267 ms total)
[  PASSED  ] 20 tests.
[  FAILED  ] 1 test, listed below:
[  FAILED  ] Parameters/TestRpc.TestCallWithChainCertAndChainCA/SSL_TCP, where GetParam() = (true, false)

 1 FAILED TEST