Note: This is test shard 5 of 8.
[==========] Running 21 tests from 2 test suites.
[----------] Global test environment set-up.
[----------] 20 tests from Parameters/TestRpc
[ RUN ] Parameters/TestRpc.TestMessengerCreateDestroy/NoSSL_UnixSocket
WARNING: Logging before InitGoogleLogging() is written to STDERR
I20260923 19:30:37.504602 379 rpc-test.cc:169] started messenger TestCreateDestroy
[ OK ] Parameters/TestRpc.TestMessengerCreateDestroy/NoSSL_UnixSocket (17 ms)
[ RUN ] Parameters/TestRpc.TestNegotiationDeadlock/NoSSL_UnixSocket
I20260923 19:30:37.513248 399 acceptor_pool.cc:254] collecting diagnostics on the listening RPC socket unix:/tmp/dist-test-taskawU7Jg/test-tmp/rpc-test-bced053407f54f71bb2b34a3c5d6f605.sock every 8 connection(s)
I20260923 19:30:37.513558 400 acceptor_pool.cc:254] collecting diagnostics on the listening RPC socket unix:/tmp/dist-test-taskawU7Jg/test-tmp/rpc-test-bced053407f54f71bb2b34a3c5d6f605.sock every 8 connection(s)
[ OK ] Parameters/TestRpc.TestNegotiationDeadlock/NoSSL_UnixSocket (23 ms)
[ RUN ] Parameters/TestRpc.TestCallWithChainCertAndChainCA/NoSSL_UnixSocket
/data0/somelongdirectorytoavoidrpathissues/src/kudu/src/kudu/rpc/rpc-test.cc:252: Skipped
[ SKIPPED ] Parameters/TestRpc.TestCallWithChainCertAndChainCA/NoSSL_UnixSocket (1 ms)
[ RUN ] Parameters/TestRpc.TestCallWithPasswordProtectedKey/NoSSL_UnixSocket
/data0/somelongdirectorytoavoidrpathissues/src/kudu/src/kudu/rpc/rpc-test.cc:319: Skipped
[ SKIPPED ] Parameters/TestRpc.TestCallWithPasswordProtectedKey/NoSSL_UnixSocket (1 ms)
[ RUN ] Parameters/TestRpc.TestCallToBadServer/NoSSL_UnixSocket
I20260923 19:30:37.539733 379 rpc-test.cc:394] Status: Network error: Client connection negotiation failed: client connection to 0.0.0.0:0: connect: Connection refused (error 111)
I20260923 19:30:37.540452 379 rpc-test.cc:394] Status: Network error: Client connection negotiation failed: client connection to 0.0.0.0:0: connect: Connection refused (error 111)
I20260923 19:30:37.541265 379 rpc-test.cc:394] Status: Network error: Client connection negotiation failed: client connection to 0.0.0.0:0: connect: Connection refused (error 111)
I20260923 19:30:37.541870 379 rpc-test.cc:394] Status: Network error: Client connection negotiation failed: client connection to 0.0.0.0:0: connect: Connection refused (error 111)
I20260923 19:30:37.542523 379 rpc-test.cc:394] Status: Network error: Client connection negotiation failed: client connection to 0.0.0.0:0: connect: Connection refused (error 111)
[ OK ] Parameters/TestRpc.TestCallToBadServer/NoSSL_UnixSocket (9 ms)
[ RUN ] Parameters/TestRpc.TestWrongService/NoSSL_UnixSocket
I20260923 19:30:37.549930 424 acceptor_pool.cc:254] collecting diagnostics on the listening RPC socket unix:/tmp/dist-test-taskawU7Jg/test-tmp/rpc-test-6b8c4b9676b54fab857eacef5efbea4d.sock every 8 connection(s)
I20260923 19:30:37.550220 425 acceptor_pool.cc:254] collecting diagnostics on the listening RPC socket unix:/tmp/dist-test-taskawU7Jg/test-tmp/rpc-test-6b8c4b9676b54fab857eacef5efbea4d.sock every 8 connection(s)
I20260923 19:30:37.559297 421 messenger.cc:345] service WrongServiceName not registered on TestServer
[ OK ] Parameters/TestRpc.TestWrongService/NoSSL_UnixSocket (20 ms)
[ RUN ] Parameters/TestRpc.TestConnectionKeepalive/NoSSL_UnixSocket
I20260923 19:30:37.569926 447 acceptor_pool.cc:254] collecting diagnostics on the listening RPC socket unix:/tmp/dist-test-taskawU7Jg/test-tmp/rpc-test-1286a8eaece145a68f892d5e2d91fb47.sock every 8 connection(s)
I20260923 19:30:37.570240 448 acceptor_pool.cc:254] collecting diagnostics on the listening RPC socket unix:/tmp/dist-test-taskawU7Jg/test-tmp/rpc-test-1286a8eaece145a68f892d5e2d91fb47.sock every 8 connection(s)
I20260923 19:30:37.571246 379 rpc-test.cc:488] Connecting to unix:/tmp/dist-test-taskawU7Jg/test-tmp/rpc-test-1286a8eaece145a68f892d5e2d91fb47.sock
[ OK ] Parameters/TestRpc.TestConnectionKeepalive/NoSSL_UnixSocket (1023 ms)
[ RUN ] Parameters/TestRpc.TestClientConnectionMetrics/NoSSL_UnixSocket
I20260923 19:30:38.611207 472 acceptor_pool.cc:254] collecting diagnostics on the listening RPC socket unix:/tmp/dist-test-taskawU7Jg/test-tmp/rpc-test-fbd97861371f4086a7f9499db53613b2.sock every 8 connection(s)
I20260923 19:30:38.611503 473 acceptor_pool.cc:254] collecting diagnostics on the listening RPC socket unix:/tmp/dist-test-taskawU7Jg/test-tmp/rpc-test-fbd97861371f4086a7f9499db53613b2.sock every 8 connection(s)
I20260923 19:30:38.612509 379 rpc-test.cc:569] Connecting to unix:/tmp/dist-test-taskawU7Jg/test-tmp/rpc-test-fbd97861371f4086a7f9499db53613b2.sock
[ OK ] Parameters/TestRpc.TestClientConnectionMetrics/NoSSL_UnixSocket (8603 ms)
[ RUN ] Parameters/TestRpc.TestCredentialsPolicy/NoSSL_UnixSocket
I20260923 19:30:47.206318 495 acceptor_pool.cc:254] collecting diagnostics on the listening RPC socket unix:/tmp/dist-test-taskawU7Jg/test-tmp/rpc-test-09260702915642ac828559607e428ef5.sock every 8 connection(s)
I20260923 19:30:47.206607 496 acceptor_pool.cc:254] collecting diagnostics on the listening RPC socket unix:/tmp/dist-test-taskawU7Jg/test-tmp/rpc-test-09260702915642ac828559607e428ef5.sock every 8 connection(s)
I20260923 19:30:47.207600 379 rpc-test.cc:700] Connecting to unix:/tmp/dist-test-taskawU7Jg/test-tmp/rpc-test-09260702915642ac828559607e428ef5.sock
[ OK ] Parameters/TestRpc.TestCredentialsPolicy/NoSSL_UnixSocket (35 ms)
[ RUN ] Parameters/TestRpc.TestCallLongerThanKeepalive/NoSSL_UnixSocket
I20260923 19:30:47.233369 520 acceptor_pool.cc:254] collecting diagnostics on the listening RPC socket unix:/tmp/dist-test-taskawU7Jg/test-tmp/rpc-test-2d72e6934ab1453d8b490b2022039fc9.sock every 8 connection(s)
I20260923 19:30:47.233728 521 acceptor_pool.cc:254] collecting diagnostics on the listening RPC socket unix:/tmp/dist-test-taskawU7Jg/test-tmp/rpc-test-2d72e6934ab1453d8b490b2022039fc9.sock every 8 connection(s)
I20260923 19:30:47.240532 524 rpc-test-base.h:222] got call: sleep_micros: 3000000 deferred: true
I20260923 19:30:50.242305 524 rpcz_store.cc:275] Call kudu.rpc.GenericCalculatorService.Sleep from unix:<unnamed> (request call id 0) took 3001 ms. Trace:
I20260923 19:30:50.242547 524 rpcz_store.cc:276] 0923 19:30:47.240399 (+ 0us) service_pool.cc:170] Inserting onto call queue
0923 19:30:47.240481 (+ 82us) service_pool.cc:227] Handling call
0923 19:30:50.242253 (+3001772us) inbound_call.cc:173] Queueing success response
Metrics: {}
[ OK ] Parameters/TestRpc.TestCallLongerThanKeepalive/NoSSL_UnixSocket (3020 ms)
[ RUN ] Parameters/TestRpc.TestRpcSidecar/NoSSL_UnixSocket
I20260923 19:30:50.254752 545 acceptor_pool.cc:254] collecting diagnostics on the listening RPC socket unix:/tmp/dist-test-taskawU7Jg/test-tmp/rpc-test-ebec7950aa3e4a759982410e62b22939.sock every 8 connection(s)
I20260923 19:30:50.255110 546 acceptor_pool.cc:254] collecting diagnostics on the listening RPC socket unix:/tmp/dist-test-taskawU7Jg/test-tmp/rpc-test-ebec7950aa3e4a759982410e62b22939.sock every 8 connection(s)
[ OK ] Parameters/TestRpc.TestRpcSidecar/NoSSL_UnixSocket (80 ms)
[ RUN ] Parameters/TestRpc.TestRpcSidecarLimits/NoSSL_UnixSocket
I20260923 19:30:52.497773 570 acceptor_pool.cc:254] collecting diagnostics on the listening RPC socket unix:/tmp/dist-test-taskawU7Jg/test-tmp/rpc-test-a3ad735452344c5fa89d60e366cf5a12.sock every 8 connection(s)
I20260923 19:30:52.498052 571 acceptor_pool.cc:254] collecting diagnostics on the listening RPC socket unix:/tmp/dist-test-taskawU7Jg/test-tmp/rpc-test-a3ad735452344c5fa89d60e366cf5a12.sock every 8 connection(s)
W20260923 19:30:52.502671 379 serialization.cc:72] Serialized kudu.rpc_test.PushStringsRequestPB (2147483654 bytes) is larger than the maximum configured RPC message size (52428800 bytes). Sending anyway, but peer may reject the data.
W20260923 19:30:52.505201 567 connection.cc:535] server connection from unix:<unnamed> recv error: Network error: RPC frame had a length of 2147483714, but we only support messages up to 52428800 bytes long.
W20260923 19:30:52.505330 567 connection.cc:158] shutting down server connection from unix:<unnamed> with pending inbound data: 4/2147483714 bytes received; last active 0 ns ago: status Network error: RPC frame had a length of 2147483714, but we only support messages up to 52428800 bytes long.
W20260923 19:30:52.505532 583 connection.cc:698] client connection to unix:/tmp/dist-test-taskawU7Jg/test-tmp/rpc-test-a3ad735452344c5fa89d60e366cf5a12.sock send error: Network error: sendmsg error: Broken pipe (error 32)
I20260923 19:30:52.512900 595 acceptor_pool.cc:254] collecting diagnostics on the listening RPC socket unix:/tmp/dist-test-taskawU7Jg/test-tmp/rpc-test-a3ad735452344c5fa89d60e366cf5a12.sock every 8 connection(s)
I20260923 19:30:52.513170 596 acceptor_pool.cc:254] collecting diagnostics on the listening RPC socket unix:/tmp/dist-test-taskawU7Jg/test-tmp/rpc-test-a3ad735452344c5fa89d60e366cf5a12.sock every 8 connection(s)
W20260923 19:30:55.098560 592 connection.cc:577] server connection from unix:<unnamed>: received bad data: 'Corruption: Invalid packet: message had a length of 2147483710, but we only support messages up to 2147483647 bytes
'
[ OK ] Parameters/TestRpc.TestRpcSidecarLimits/NoSSL_UnixSocket (5239 ms)
[ RUN ] Parameters/TestRpc.TestCallTimeoutDoesntAffectNegotiation/NoSSL_UnixSocket
I20260923 19:30:55.574585 620 acceptor_pool.cc:254] collecting diagnostics on the listening RPC socket unix:/tmp/dist-test-taskawU7Jg/test-tmp/rpc-test-4821d34773994af78b3dab48e2b8e778.sock every 8 connection(s)
I20260923 19:30:55.574869 621 acceptor_pool.cc:254] collecting diagnostics on the listening RPC socket unix:/tmp/dist-test-taskawU7Jg/test-tmp/rpc-test-4821d34773994af78b3dab48e2b8e778.sock every 8 connection(s)
W20260923 19:30:55.580199 616 negotiation.cc:266] Injecting 500ms delay in negotiation
I20260923 19:30:55.630676 379 rpc-test-base.h:595] status: Timed out: connection negotiation to unix:/tmp/dist-test-taskawU7Jg/test-tmp/rpc-test-4821d34773994af78b3dab48e2b8e778.sock for RPC Sleep timed out after 0.050s (ON_OUTBOUND_QUEUE), seconds elapsed: 0.0511677
[ OK ] Parameters/TestRpc.TestCallTimeoutDoesntAffectNegotiation/NoSSL_UnixSocket (517 ms)
[ RUN ] Parameters/TestRpc.TestRpcHandlerLatencyMetric/NoSSL_UnixSocket
I20260923 19:30:56.093636 645 acceptor_pool.cc:254] collecting diagnostics on the listening RPC socket unix:/tmp/dist-test-taskawU7Jg/test-tmp/rpc-test-79feee3afe514322975f0d919f43068a.sock every 8 connection(s)
I20260923 19:30:56.094015 646 acceptor_pool.cc:254] collecting diagnostics on the listening RPC socket unix:/tmp/dist-test-taskawU7Jg/test-tmp/rpc-test-79feee3afe514322975f0d919f43068a.sock every 8 connection(s)
I20260923 19:30:56.122987 379 rpc-test.cc:1236] Sleep() min lat: 20648
I20260923 19:30:56.123075 379 rpc-test.cc:1237] Sleep() mean lat: 20648
I20260923 19:30:56.123118 379 rpc-test.cc:1238] Sleep() max lat: 20648
I20260923 19:30:56.123137 379 rpc-test.cc:1239] Sleep() #calls: 1
[ OK ] Parameters/TestRpc.TestRpcHandlerLatencyMetric/NoSSL_UnixSocket (41 ms)
[ RUN ] Parameters/TestRpc.TimedOutOnResponseMetricServiceQueue/NoSSL_UnixSocket
I20260923 19:30:56.134752 671 acceptor_pool.cc:254] collecting diagnostics on the listening RPC socket unix:/tmp/dist-test-taskawU7Jg/test-tmp/rpc-test-e45d390a4db54bab8ec9647c5c571d0a.sock every 8 connection(s)
I20260923 19:30:56.135069 672 acceptor_pool.cc:254] collecting diagnostics on the listening RPC socket unix:/tmp/dist-test-taskawU7Jg/test-tmp/rpc-test-e45d390a4db54bab8ec9647c5c571d0a.sock every 8 connection(s)
W20260923 19:30:56.184010 673 rpcz_store.cc:267] Call kudu.rpc_test.CalculatorService.Sleep from unix:<unnamed> (request call id 2) took 20 ms (client timeout 20 ms). Trace:
/data0/somelongdirectorytoavoidrpathissues/src/kudu/src/kudu/rpc/rpc-test.cc:1427: Failure
Expected equality of these values:
3
latency_histogram->TotalCount()
Which is: 2
W20260923 19:30:56.184145 673 rpcz_store.cc:269] 0923 19:30:56.163330 (+ 0us) service_pool.cc:170] Inserting onto call queue
0923 19:30:56.183752 (+ 20422us) service_pool.cc:214] Skipping call since client already timed out
0923 19:30:56.183988 (+ 236us) inbound_call.cc:173] Queueing failure response
Metrics: {}
I20260923 19:30:56.188668 379 test_util.cc:175] -----------------------------------------------
I20260923 19:30:56.188755 379 test_util.cc:176] Had fatal failures, leaving test files at /tmp/dist-test-taskawU7Jg/test-tmp/rpc-test.4.Parameters_TestRpc.TimedOutOnResponseMetricServiceQueue_NoSSL_UnixSocket.1790191837469700-379-0
[ FAILED ] Parameters/TestRpc.TimedOutOnResponseMetricServiceQueue/NoSSL_UnixSocket, where GetParam() = (false, true) (59 ms)
[ RUN ] Parameters/TestRpc.RpcPendingConnectionsMetric/NoSSL_UnixSocket
I20260923 19:30:56.193435 694 acceptor_pool.cc:254] collecting diagnostics on the listening RPC socket 0.0.0.0:37075 every 8 connection(s)
I20260923 19:30:56.193611 695 acceptor_pool.cc:254] collecting diagnostics on the listening RPC socket 0.0.0.0:37075 every 8 connection(s)
W20260923 19:30:56.205633 690 negotiation.cc:337] Failed RPC negotiation. Trace:
0923 19:30:56.204625 (+ 0us) reactor.cc:625] Submitting negotiation task for server connection from 127.0.0.1:44760 (local address 127.0.0.1:37075)
0923 19:30:56.204879 (+ 254us) server_negotiation.cc:206] Beginning negotiation
0923 19:30:56.204887 (+ 8us) server_negotiation.cc:399] Waiting for connection header
0923 19:30:56.205106 (+ 219us) negotiation.cc:327] Negotiation complete: Network error: Server connection negotiation failed: server connection from 127.0.0.1:44760: BlockingRecv error: recv got EOF from 127.0.0.1:44760 (error 108)
Metrics: {"server-negotiator.queue_time_us":78}
[ OK ] Parameters/TestRpc.RpcPendingConnectionsMetric/NoSSL_UnixSocket (29 ms)
[ RUN ] Parameters/TestRpc.TestRpcContextClientDeadline/NoSSL_UnixSocket
I20260923 19:30:56.223980 710 acceptor_pool.cc:254] collecting diagnostics on the listening RPC socket unix:/tmp/dist-test-taskawU7Jg/test-tmp/rpc-test-686ea2dcd51e47b295d3860e81c287fe.sock every 8 connection(s)
I20260923 19:30:56.224392 711 acceptor_pool.cc:254] collecting diagnostics on the listening RPC socket unix:/tmp/dist-test-taskawU7Jg/test-tmp/rpc-test-686ea2dcd51e47b295d3860e81c287fe.sock every 8 connection(s)
[ OK ] Parameters/TestRpc.TestRpcContextClientDeadline/NoSSL_UnixSocket (40 ms)
[ RUN ] Parameters/TestRpc.TestApplicationFeatureFlagUnsupportedServer/NoSSL_UnixSocket
I20260923 19:30:56.264285 735 acceptor_pool.cc:254] collecting diagnostics on the listening RPC socket unix:/tmp/dist-test-taskawU7Jg/test-tmp/rpc-test-281885df0e0d44e581d0a7dce6282a34.sock every 8 connection(s)
I20260923 19:30:56.264542 736 acceptor_pool.cc:254] collecting diagnostics on the listening RPC socket unix:/tmp/dist-test-taskawU7Jg/test-tmp/rpc-test-281885df0e0d44e581d0a7dce6282a34.sock every 8 connection(s)
[ OK ] Parameters/TestRpc.TestApplicationFeatureFlagUnsupportedServer/NoSSL_UnixSocket (18 ms)
[ RUN ] Parameters/TestRpc.TestCancellationAsync/NoSSL_UnixSocket
I20260923 19:30:56.282723 760 acceptor_pool.cc:254] collecting diagnostics on the listening RPC socket unix:/tmp/dist-test-taskawU7Jg/test-tmp/rpc-test-3fc1d6a9bf6643ce8537bc30321c77af.sock every 8 connection(s)
I20260923 19:30:56.282964 761 acceptor_pool.cc:254] collecting diagnostics on the listening RPC socket unix:/tmp/dist-test-taskawU7Jg/test-tmp/rpc-test-3fc1d6a9bf6643ce8537bc30321c77af.sock every 8 connection(s)
I20260923 19:30:56.283864 379 rpc-test.cc:1716] Connecting to unix:/tmp/dist-test-taskawU7Jg/test-tmp/rpc-test-3fc1d6a9bf6643ce8537bc30321c77af.sock
I20260923 19:30:56.287904 379 test_util.cc:268] Using random seed: -2052292468
I20260923 19:30:56.306082 764 rpc-test-base.h:240] got call: sleep_micros: 500 pattern: 4294967295 num_repetitions: 2097152 sidecar_idx: 0
I20260923 19:30:56.316524 763 rpc-test-base.h:240] got call: sleep_micros: 500 pattern: 4294967295 num_repetitions: 2097152 sidecar_idx: 0
I20260923 19:30:56.328084 762 rpc-test-base.h:240] got call: sleep_micros: 500 pattern: 4294967295 num_repetitions: 2097152 sidecar_idx: 0
I20260923 19:30:56.356218 764 rpc-test-base.h:240] got call: sleep_micros: 500 pattern: 4294967295 num_repetitions: 2097152 sidecar_idx: 0
I20260923 19:30:56.378338 763 rpc-test-base.h:240] got call: sleep_micros: 500 pattern: 4294967295 num_repetitions: 2097152 sidecar_idx: 0
I20260923 19:30:56.391700 762 rpc-test-base.h:240] got call: sleep_micros: 500 pattern: 4294967295 num_repetitions: 2097152 sidecar_idx: 0
W20260923 19:30:56.409027 757 connection.cc:698] server connection from unix:<unnamed> send error: Network error: sendmsg error: Broken pipe (error 32)
W20260923 19:30:56.409291 757 connection.cc:441] server connection from unix:<unnamed> torn down before Call kudu.rpc.GenericCalculatorService.SleepWithSidecar from unix:<unnamed> (request call id 3) could send its response
W20260923 19:30:56.409689 757 connection.cc:441] server connection from unix:<unnamed> torn down before Call kudu.rpc.GenericCalculatorService.SleepWithSidecar from unix:<unnamed> (request call id 9) could send its response
I20260923 19:30:56.416493 764 rpc-test-base.h:240] got call: sleep_micros: 500 pattern: 4294967295 num_repetitions: 2097152 sidecar_idx: 0
W20260923 19:30:56.416495 757 connection.cc:441] server connection from unix:<unnamed> torn down before Call kudu.rpc.GenericCalculatorService.SleepWithSidecar from unix:<unnamed> (request call id 4) could send its response
W20260923 19:30:56.431728 757 connection.cc:441] server connection from unix:<unnamed> torn down before Call kudu.rpc.GenericCalculatorService.SleepWithSidecar from unix:<unnamed> (request call id 6) could send its response
I20260923 19:30:56.431746 762 rpc-test-base.h:240] got call: sleep_micros: 500 pattern: 4294967295 num_repetitions: 2097152 sidecar_idx: 0
W20260923 19:30:56.445218 757 connection.cc:441] server connection from unix:<unnamed> torn down before Call kudu.rpc.GenericCalculatorService.SleepWithSidecar from unix:<unnamed> (request call id 5) could send its response
W20260923 19:30:56.463156 757 connection.cc:441] server connection from unix:<unnamed> torn down before Call kudu.rpc.GenericCalculatorService.SleepWithSidecar from unix:<unnamed> (request call id 7) could send its response
W20260923 19:30:56.465544 757 connection.cc:441] server connection from unix:<unnamed> torn down before Call kudu.rpc.GenericCalculatorService.SleepWithSidecar from unix:<unnamed> (request call id 8) could send its response
[ OK ] Parameters/TestRpc.TestCancellationAsync/NoSSL_UnixSocket (191 ms)
[ RUN ] Parameters/TestRpc.TestPerformanceBySocketType/NoSSL_UnixSocket
I20260923 19:30:56.478503 785 acceptor_pool.cc:254] collecting diagnostics on the listening RPC socket unix:/tmp/dist-test-taskawU7Jg/test-tmp/rpc-test-290efb1a92f8471d926f10f0d839c3a3.sock every 8 connection(s)
I20260923 19:30:56.478771 786 acceptor_pool.cc:254] collecting diagnostics on the listening RPC socket unix:/tmp/dist-test-taskawU7Jg/test-tmp/rpc-test-290efb1a92f8471d926f10f0d839c3a3.sock every 8 connection(s)
I20260923 19:30:56.479895 379 rpc-test.cc:1846] Connecting to unix:/tmp/dist-test-taskawU7Jg/test-tmp/rpc-test-290efb1a92f8471d926f10f0d839c3a3.sock
I20260923 19:30:58.079296 379 rpc-test.cc:1859] Sending 1024MB via unix socket: real 1.593s user 0.727s sys 1.358s
I20260923 19:30:59.623327 379 rpc-test.cc:1859] Sending 1024MB via unix socket: real 1.544s user 0.688s sys 1.340s
I20260923 19:31:01.215042 379 rpc-test.cc:1859] Sending 1024MB via unix socket: real 1.592s user 0.609s sys 1.486s
I20260923 19:31:02.814508 379 rpc-test.cc:1859] Sending 1024MB via unix socket: real 1.599s user 0.686s sys 1.419s
I20260923 19:31:04.425160 379 rpc-test.cc:1859] Sending 1024MB via unix socket: real 1.610s user 0.648s sys 1.470s
[ OK ] Parameters/TestRpc.TestPerformanceBySocketType/NoSSL_UnixSocket (7964 ms)
[----------] 20 tests from Parameters/TestRpc (26942 ms total)
[----------] 1 test from Parameters/TestRpcSocketTxRxQueue
[ RUN ] Parameters/TestRpcSocketTxRxQueue.AtCapacity/0
W20260923 19:31:04.711887 829 negotiation.cc:337] Failed RPC negotiation. Trace:
0923 19:31:04.447523 (+ 0us) reactor.cc:625] Submitting negotiation task for client connection to 0.0.0.0:42633 (local address 127.0.0.1:60114)
0923 19:31:04.447806 (+ 283us) negotiation.cc:107] Waiting for socket to connect
0923 19:31:04.447826 (+ 20us) client_negotiation.cc:174] Beginning negotiation
0923 19:31:04.447944 (+ 118us) client_negotiation.cc:252] Sending NEGOTIATE NegotiatePB request
0923 19:31:04.711485 (+263541us) negotiation.cc:327] Negotiation complete: Network error: Client connection negotiation failed: client connection to 0.0.0.0:42633: BlockingRecv error: recv error from unknown peer: Transport endpoint is not connected (error 107)
Metrics: {"client-negotiator.queue_time_us":83}
W20260923 19:31:04.712044 811 negotiation.cc:337] Failed RPC negotiation. Trace:
0923 19:31:04.441148 (+ 0us) reactor.cc:625] Submitting negotiation task for client connection to 0.0.0.0:42633 (local address 127.0.0.1:60090)
0923 19:31:04.441350 (+ 202us) negotiation.cc:107] Waiting for socket to connect
0923 19:31:04.441379 (+ 29us) client_negotiation.cc:174] Beginning negotiation
0923 19:31:04.441499 (+ 120us) client_negotiation.cc:252] Sending NEGOTIATE NegotiatePB request
0923 19:31:04.711590 (+270091us) negotiation.cc:327] Negotiation complete: Network error: Client connection negotiation failed: client connection to 0.0.0.0:42633: BlockingRecv error: recv error from unknown peer: Transport endpoint is not connected (error 107)
Metrics: {"client-negotiator.queue_time_us":60}
W20260923 19:31:04.712280 802 negotiation.cc:337] Failed RPC negotiation. Trace:
0923 19:31:04.438058 (+ 0us) reactor.cc:625] Submitting negotiation task for client connection to 0.0.0.0:42633 (local address 127.0.0.1:60086)
0923 19:31:04.438256 (+ 198us) negotiation.cc:107] Waiting for socket to connect
0923 19:31:04.438272 (+ 16us) client_negotiation.cc:174] Beginning negotiation
0923 19:31:04.438384 (+ 112us) client_negotiation.cc:252] Sending NEGOTIATE NegotiatePB request
0923 19:31:04.711546 (+273162us) negotiation.cc:327] Negotiation complete: Network error: Client connection negotiation failed: client connection to 0.0.0.0:42633: BlockingRecv error: recv error from unknown peer: Transport endpoint is not connected (error 107)
Metrics: {"client-negotiator.queue_time_us":63}
W20260923 19:31:04.713167 856 negotiation.cc:337] Failed RPC negotiation. Trace:
0923 19:31:04.457864 (+ 0us) reactor.cc:625] Submitting negotiation task for client connection to 0.0.0.0:42633 (local address 127.0.0.1:60132)
0923 19:31:04.458130 (+ 266us) negotiation.cc:107] Waiting for socket to connect
0923 19:31:04.458150 (+ 20us) client_negotiation.cc:174] Beginning negotiation
0923 19:31:04.458274 (+ 124us) client_negotiation.cc:252] Sending NEGOTIATE NegotiatePB request
0923 19:31:04.712108 (+253834us) negotiation.cc:327] Negotiation complete: Network error: Client connection negotiation failed: client connection to 0.0.0.0:42633: BlockingRecv error: recv error from unknown peer: Transport endpoint is not connected (error 107)
Metrics: {"client-negotiator.queue_time_us":136}
W20260923 19:31:04.715075 865 negotiation.cc:337] Failed RPC negotiation. Trace:
0923 19:31:04.461095 (+ 0us) reactor.cc:625] Submitting negotiation task for client connection to 0.0.0.0:42633 (local address 127.0.0.1:60142)
0923 19:31:04.461315 (+ 220us) negotiation.cc:107] Waiting for socket to connect
0923 19:31:04.461341 (+ 26us) client_negotiation.cc:174] Beginning negotiation
0923 19:31:04.461436 (+ 95us) client_negotiation.cc:252] Sending NEGOTIATE NegotiatePB request
0923 19:31:04.712783 (+251347us) negotiation.cc:327] Negotiation complete: Network error: Client connection negotiation failed: client connection to 0.0.0.0:42633: BlockingRecv error: recv error from unknown peer: Transport endpoint is not connected (error 107)
Metrics: {"client-negotiator.queue_time_us":82}
W20260923 19:31:04.715372 820 negotiation.cc:337] Failed RPC negotiation. Trace:
0923 19:31:04.444544 (+ 0us) reactor.cc:625] Submitting negotiation task for client connection to 0.0.0.0:42633 (local address 127.0.0.1:60104)
0923 19:31:04.444827 (+ 283us) negotiation.cc:107] Waiting for socket to connect
0923 19:31:04.444846 (+ 19us) client_negotiation.cc:174] Beginning negotiation
0923 19:31:04.445072 (+ 226us) client_negotiation.cc:252] Sending NEGOTIATE NegotiatePB request
0923 19:31:04.711522 (+266450us) negotiation.cc:327] Negotiation complete: Network error: Client connection negotiation failed: client connection to 0.0.0.0:42633: BlockingRecv error: recv error from unknown peer: Transport endpoint is not connected (error 107)
Metrics: {"client-negotiator.queue_time_us":114}
W20260923 19:31:04.718302 847 negotiation.cc:337] Failed RPC negotiation. Trace:
0923 19:31:04.454033 (+ 0us) reactor.cc:625] Submitting negotiation task for client connection to 0.0.0.0:42633 (local address 127.0.0.1:60130)
0923 19:31:04.454253 (+ 220us) negotiation.cc:107] Waiting for socket to connect
0923 19:31:04.454268 (+ 15us) client_negotiation.cc:174] Beginning negotiation
0923 19:31:04.454404 (+ 136us) client_negotiation.cc:252] Sending NEGOTIATE NegotiatePB request
0923 19:31:04.712341 (+257937us) negotiation.cc:327] Negotiation complete: Network error: Client connection negotiation failed: client connection to 0.0.0.0:42633: BlockingRecv error: recv error from unknown peer: Transport endpoint is not connected (error 107)
Metrics: {"client-negotiator.queue_time_us":63}
W20260923 19:31:04.718298 838 negotiation.cc:337] Failed RPC negotiation. Trace:
0923 19:31:04.450976 (+ 0us) reactor.cc:625] Submitting negotiation task for client connection to 0.0.0.0:42633 (local address 127.0.0.1:60120)
0923 19:31:04.451245 (+ 269us) negotiation.cc:107] Waiting for socket to connect
0923 19:31:04.451260 (+ 15us) client_negotiation.cc:174] Beginning negotiation
0923 19:31:04.451350 (+ 90us) client_negotiation.cc:252] Sending NEGOTIATE NegotiatePB request
0923 19:31:04.712254 (+260904us) negotiation.cc:327] Negotiation complete: Network error: Client connection negotiation failed: client connection to 0.0.0.0:42633: BlockingRecv error: recv error from unknown peer: Transport endpoint is not connected (error 107)
Metrics: {"client-negotiator.queue_time_us":60}
[ OK ] Parameters/TestRpcSocketTxRxQueue.AtCapacity/0 (290 ms)
[----------] 1 test from Parameters/TestRpcSocketTxRxQueue (290 ms total)
[----------] Global test environment tear-down
[==========] 21 tests from 2 test suites ran. (27233 ms total)
[ PASSED ] 18 tests.
[ SKIPPED ] 2 tests, listed below:
[ SKIPPED ] Parameters/TestRpc.TestCallWithChainCertAndChainCA/NoSSL_UnixSocket
[ SKIPPED ] Parameters/TestRpc.TestCallWithPasswordProtectedKey/NoSSL_UnixSocket
[ FAILED ] 1 test, listed below:
[ FAILED ] Parameters/TestRpc.TimedOutOnResponseMetricServiceQueue/NoSSL_UnixSocket, where GetParam() = (false, true)
1 FAILED TEST