Parameters/TestRpc.TestCallWithChainCertAndRootCA/SSL_TCP: /data0/somelongdirectorytoavoidrpathissues/src/kudu/src/kudu/rpc/rpc-test.cc:303: Failure
Failed
Bad status: Runtime error: could not verify certificate chain (error with cert: subject=CN = localhost, ST = sadfjas, C = AS, emailAddress = sdflkdsajf, O = lskdfjlsad, OU = sldfkja, issuer=C = AS, ST = ASDfkjdhf, L = lskdjf, O = saldfja, OU = skdjf, CN = localhost, emailAddress = sadjflkadsj): : certificate has expired
Google Test trace:
/data0/somelongdirectorytoavoidrpathissues/src/kudu/src/kudu/rpc/rpc-test.cc:300: Connecting to 0.0.0.0:37433
I20260929 02:19:43.331956 22964 test_util.cc:175] -----------------------------------------------
I20260929 02:19:43.332136 22964 test_util.cc:176] Had fatal failures, leaving test files at /tmp/dist-test-taskgeSNuo/test-tmp/rpc-test.1.Parameters_TestRpc.TestCallWithChainCertAndRootCA_SSL_TCP.1790648381876039-22964-0
Note: This is test shard 2 of 8.
[==========] Running 21 tests from 2 test suites.
[----------] Global test environment set-up.
[----------] 1 test from TestRpc
[ RUN ] TestRpc.TestMethodsByName
[ OK ] TestRpc.TestMethodsByName (6 ms)
[----------] 1 test from TestRpc (6 ms total)
[----------] 20 tests from Parameters/TestRpc
[ RUN ] Parameters/TestRpc.TestAcceptorPoolStartStop/SSL_TCP
WARNING: Logging before InitGoogleLogging() is written to STDERR
I20260929 02:19:41.981840 22979 acceptor_pool.cc:254] collecting diagnostics on the listening RPC socket 0.0.0.0:41485 every 8 connection(s)
I20260929 02:19:41.983369 22980 acceptor_pool.cc:254] collecting diagnostics on the listening RPC socket 0.0.0.0:41485 every 8 connection(s)
I20260929 02:19:43.062198 22991 acceptor_pool.cc:254] collecting diagnostics on the listening RPC socket 0.0.0.0:42909 every 8 connection(s)
I20260929 02:19:43.063557 22992 acceptor_pool.cc:254] collecting diagnostics on the listening RPC socket 0.0.0.0:42909 every 8 connection(s)
I20260929 02:19:43.095497 23002 acceptor_pool.cc:254] collecting diagnostics on the listening RPC socket 0.0.0.0:33813 every 8 connection(s)
I20260929 02:19:43.096872 23003 acceptor_pool.cc:254] collecting diagnostics on the listening RPC socket 0.0.0.0:33813 every 8 connection(s)
I20260929 02:19:43.138984 23013 acceptor_pool.cc:254] collecting diagnostics on the listening RPC socket 0.0.0.0:45923 every 8 connection(s)
I20260929 02:19:43.139640 23014 acceptor_pool.cc:254] collecting diagnostics on the listening RPC socket 0.0.0.0:45923 every 8 connection(s)
I20260929 02:19:43.171587 23024 acceptor_pool.cc:254] collecting diagnostics on the listening RPC socket 0.0.0.0:44733 every 8 connection(s)
I20260929 02:19:43.172288 23025 acceptor_pool.cc:254] collecting diagnostics on the listening RPC socket 0.0.0.0:44733 every 8 connection(s)
[ OK ] Parameters/TestRpc.TestAcceptorPoolStartStop/SSL_TCP (1241 ms)
[ RUN ] Parameters/TestRpc.TestCall/SSL_TCP
I20260929 02:19:43.199783 23037 acceptor_pool.cc:254] collecting diagnostics on the listening RPC socket 0.0.0.0:45693 every 8 connection(s)
I20260929 02:19:43.201733 23038 acceptor_pool.cc:254] collecting diagnostics on the listening RPC socket 0.0.0.0:45693 every 8 connection(s)
I20260929 02:19:43.206611 22964 rpc-test.cc:234] Connecting to 0.0.0.0:45693
[ OK ] Parameters/TestRpc.TestCall/SSL_TCP (104 ms)
[ RUN ] Parameters/TestRpc.TestCallWithChainCertAndRootCA/SSL_TCP
I20260929 02:19:43.311372 23062 acceptor_pool.cc:254] collecting diagnostics on the listening RPC socket 0.0.0.0:37433 every 8 connection(s)
I20260929 02:19:43.312186 23063 acceptor_pool.cc:254] collecting diagnostics on the listening RPC socket 0.0.0.0:37433 every 8 connection(s)
/data0/somelongdirectorytoavoidrpathissues/src/kudu/src/kudu/rpc/rpc-test.cc:303: Failure
Failed
Bad status: Runtime error: could not verify certificate chain (error with cert: subject=CN = localhost, ST = sadfjas, C = AS, emailAddress = sdflkdsajf, O = lskdfjlsad, OU = sldfkja, issuer=C = AS, ST = ASDfkjdhf, L = lskdjf, O = saldfja, OU = skdjf, CN = localhost, emailAddress = sadjflkadsj): : certificate has expired
Google Test trace:
/data0/somelongdirectorytoavoidrpathissues/src/kudu/src/kudu/rpc/rpc-test.cc:300: Connecting to 0.0.0.0:37433
I20260929 02:19:43.331956 22964 test_util.cc:175] -----------------------------------------------
I20260929 02:19:43.332136 22964 test_util.cc:176] Had fatal failures, leaving test files at /tmp/dist-test-taskgeSNuo/test-tmp/rpc-test.1.Parameters_TestRpc.TestCallWithChainCertAndRootCA_SSL_TCP.1790648381876039-22964-0
[ FAILED ] Parameters/TestRpc.TestCallWithChainCertAndRootCA/SSL_TCP, where GetParam() = (true, false) (50 ms)
[ RUN ] Parameters/TestRpc.TestCallWithBadPasswordProtectedKey/SSL_TCP
[ OK ] Parameters/TestRpc.TestCallWithBadPasswordProtectedKey/SSL_TCP (30 ms)
[ RUN ] Parameters/TestRpc.TestInvalidMethodCall/SSL_TCP
I20260929 02:19:43.380730 23099 acceptor_pool.cc:254] collecting diagnostics on the listening RPC socket 0.0.0.0:36401 every 8 connection(s)
I20260929 02:19:43.381512 23100 acceptor_pool.cc:254] collecting diagnostics on the listening RPC socket 0.0.0.0:36401 every 8 connection(s)
I20260929 02:19:43.384941 22964 rpc-test.cc:406] Connecting to 0.0.0.0:36401
[ OK ] Parameters/TestRpc.TestInvalidMethodCall/SSL_TCP (65 ms)
[ RUN ] Parameters/TestRpc.TestHighFDs/SSL_TCP
I20260929 02:19:43.638811 23124 acceptor_pool.cc:254] collecting diagnostics on the listening RPC socket 0.0.0.0:40541 every 8 connection(s)
I20260929 02:19:43.639460 23125 acceptor_pool.cc:254] collecting diagnostics on the listening RPC socket 0.0.0.0:40541 every 8 connection(s)
[ OK ] Parameters/TestRpc.TestHighFDs/SSL_TCP (271 ms)
[ RUN ] Parameters/TestRpc.TestConnectionAlwaysKeepalive/SSL_TCP
I20260929 02:19:43.718043 23147 acceptor_pool.cc:254] collecting diagnostics on the listening RPC socket 0.0.0.0:45311 every 8 connection(s)
I20260929 02:19:43.718707 23148 acceptor_pool.cc:254] collecting diagnostics on the listening RPC socket 0.0.0.0:45311 every 8 connection(s)
I20260929 02:19:43.721942 22964 rpc-test.cc:532] Connecting to 0.0.0.0:45311
[ OK ] Parameters/TestRpc.TestConnectionAlwaysKeepalive/SSL_TCP (3059 ms)
[ RUN ] Parameters/TestRpc.TestReopenOutboundConnections/SSL_TCP
I20260929 02:19:46.789160 23170 acceptor_pool.cc:254] collecting diagnostics on the listening RPC socket 0.0.0.0:42447 every 8 connection(s)
I20260929 02:19:46.789819 23171 acceptor_pool.cc:254] collecting diagnostics on the listening RPC socket 0.0.0.0:42447 every 8 connection(s)
I20260929 02:19:46.792912 22964 rpc-test.cc:658] Connecting to 0.0.0.0:42447
[ OK ] Parameters/TestRpc.TestReopenOutboundConnections/SSL_TCP (375 ms)
[ RUN ] Parameters/TestRpc.TestConnectionNetworkPlane/SSL_TCP
I20260929 02:19:47.158142 23193 acceptor_pool.cc:254] collecting diagnostics on the listening RPC socket 0.0.0.0:38479 every 8 connection(s)
I20260929 02:19:47.158819 23194 acceptor_pool.cc:254] collecting diagnostics on the listening RPC socket 0.0.0.0:38479 every 8 connection(s)
I20260929 02:19:47.161880 22964 rpc-test.cc:772] Connecting to 0.0.0.0:38479
[ OK ] Parameters/TestRpc.TestConnectionNetworkPlane/SSL_TCP (81 ms)
[ RUN ] Parameters/TestRpc.TestTCPKeepalive/SSL_TCP
I20260929 02:19:47.237238 23218 acceptor_pool.cc:254] collecting diagnostics on the listening RPC socket 0.0.0.0:40209 every 8 connection(s)
I20260929 02:19:47.237924 23219 acceptor_pool.cc:254] collecting diagnostics on the listening RPC socket 0.0.0.0:40209 every 8 connection(s)
I20260929 02:19:47.263257 23222 rpc-test-base.h:222] got call: sleep_micros: 8000000 deferred: true
I20260929 02:19:55.267422 23222 rpcz_store.cc:275] Call kudu.rpc.GenericCalculatorService.Sleep from 127.0.0.1:34966 (request call id 0) took 8004 ms. Trace:
I20260929 02:19:55.267882 23222 rpcz_store.cc:276] 0929 02:19:47.262973 (+ 0us) service_pool.cc:170] Inserting onto call queue
0929 02:19:47.263102 (+ 129us) service_pool.cc:227] Handling call
0929 02:19:55.267264 (+8004162us) inbound_call.cc:173] Queueing success response
Metrics: {}
[ OK ] Parameters/TestRpc.TestTCPKeepalive/SSL_TCP (8064 ms)
[ RUN ] Parameters/TestRpc.TestMaxSmallSidecars/SSL_TCP
I20260929 02:19:55.306370 23244 acceptor_pool.cc:254] collecting diagnostics on the listening RPC socket 0.0.0.0:38829 every 8 connection(s)
I20260929 02:19:55.307209 23245 acceptor_pool.cc:254] collecting diagnostics on the listening RPC socket 0.0.0.0:38829 every 8 connection(s)
[ OK ] Parameters/TestRpc.TestMaxSmallSidecars/SSL_TCP (197 ms)
[ RUN ] Parameters/TestRpc.TestCallTimeout/SSL_TCP
I20260929 02:19:55.513566 23269 acceptor_pool.cc:254] collecting diagnostics on the listening RPC socket 0.0.0.0:45989 every 8 connection(s)
I20260929 02:19:55.514241 23270 acceptor_pool.cc:254] collecting diagnostics on the listening RPC socket 0.0.0.0:45989 every 8 connection(s)
I20260929 02:19:55.544428 22964 rpc-test-base.h:595] status: Timed out: connection negotiation to 0.0.0.0:45989 for RPC Sleep timed out after 0.000s (ON_OUTBOUND_QUEUE), seconds elapsed: 0.0028829
I20260929 02:19:55.551649 23273 rpc-test-base.h:222] got call: sleep_micros: 700000
I20260929 02:19:55.746393 22964 rpc-test-base.h:595] status: Timed out: Sleep RPC to 0.0.0.0:45989 timed out after 0.200s (SENT), seconds elapsed: 0.201479
I20260929 02:19:55.747857 23272 rpc-test-base.h:222] got call: sleep_micros: 2000000
W20260929 02:19:56.252360 23273 rpcz_store.cc:267] Call kudu.rpc.GenericCalculatorService.Sleep from 127.0.0.1:59872 (request call id 1) took 700 ms (client timeout 200 ms). Trace:
W20260929 02:19:56.252702 23273 rpcz_store.cc:269] 0929 02:19:55.551480 (+ 0us) service_pool.cc:170] Inserting onto call queue
0929 02:19:55.551589 (+ 109us) service_pool.cc:227] Handling call
0929 02:19:56.252294 (+700705us) inbound_call.cc:173] Queueing success response
Metrics: {}
I20260929 02:19:57.248548 22964 rpc-test-base.h:595] status: Timed out: Sleep RPC to 0.0.0.0:45989 timed out after 1.500s (SENT), seconds elapsed: 1.50183
W20260929 02:19:57.748404 23272 rpcz_store.cc:267] Call kudu.rpc.GenericCalculatorService.Sleep from 127.0.0.1:59872 (request call id 2) took 2000 ms (client timeout 1500 ms). Trace:
W20260929 02:19:57.748706 23272 rpcz_store.cc:269] 0929 02:19:55.747527 (+ 0us) service_pool.cc:170] Inserting onto call queue
0929 02:19:55.747650 (+ 123us) service_pool.cc:227] Handling call
0929 02:19:57.748344 (+2000694us) inbound_call.cc:173] Queueing success response
Metrics: {}
W20260929 02:19:57.749262 23268 connection.cc:441] server connection from 127.0.0.1:59872 torn down before Call kudu.rpc.GenericCalculatorService.Sleep from 127.0.0.1:59872 (request call id 2) could send its response
[ OK ] Parameters/TestRpc.TestCallTimeout/SSL_TCP (2275 ms)
[ RUN ] Parameters/TestRpc.TestServerShutsDown/SSL_TCP
I20260929 02:19:57.756726 22964 rpc-test.cc:1125] Connecting to 0.0.0.0:40563
W20260929 02:19:57.765924 23286 negotiation.cc:337] Failed RPC negotiation. Trace:
0929 02:19:57.764451 (+ 0us) reactor.cc:625] Submitting negotiation task for client connection to 0.0.0.0:40563 (local address 127.0.0.1:56112)
0929 02:19:57.764886 (+ 435us) negotiation.cc:107] Waiting for socket to connect
0929 02:19:57.764916 (+ 30us) client_negotiation.cc:174] Beginning negotiation
0929 02:19:57.765125 (+ 209us) client_negotiation.cc:252] Sending NEGOTIATE NegotiatePB request
0929 02:19:57.765345 (+ 220us) negotiation.cc:327] Negotiation complete: Network error: Client connection negotiation failed: client connection to 0.0.0.0:40563: BlockingWrite error: write error: Broken pipe (error 32)
Metrics: {"client-negotiator.queue_time_us":100}
[ OK ] Parameters/TestRpc.TestServerShutsDown/SSL_TCP (13 ms)
[ RUN ] Parameters/TestRpc.TimedOutOnResponseMetric/SSL_TCP
I20260929 02:19:57.789358 23303 acceptor_pool.cc:254] collecting diagnostics on the listening RPC socket 0.0.0.0:43361 every 8 connection(s)
I20260929 02:19:57.790051 23304 acceptor_pool.cc:254] collecting diagnostics on the listening RPC socket 0.0.0.0:43361 every 8 connection(s)
W20260929 02:19:58.032085 23307 rpcz_store.cc:267] Call kudu.rpc_test.CalculatorService.Sleep from 127.0.0.1:37174 (request call id 3) took 50 ms (client timeout 25 ms). Trace:
W20260929 02:19:58.032366 23307 rpcz_store.cc:269] 0929 02:19:57.981553 (+ 0us) service_pool.cc:170] Inserting onto call queue
0929 02:19:57.981648 (+ 95us) service_pool.cc:227] Handling call
0929 02:19:58.032013 (+ 50365us) inbound_call.cc:173] Queueing success response
Related trace 'test_child':
Metrics: {"test_sleep_us":50000,"child_traces":[["test_child",{"related_trace_metric":1}]]}
W20260929 02:19:58.091416 23307 rpcz_store.cc:267] Call kudu.rpc_test.CalculatorService.Sleep from 127.0.0.1:37174 (request call id 4) took 50 ms (client timeout 50 ms). Trace:
W20260929 02:19:58.091710 23307 rpcz_store.cc:269] 0929 02:19:58.040977 (+ 0us) service_pool.cc:170] Inserting onto call queue
0929 02:19:58.041066 (+ 89us) service_pool.cc:227] Handling call
0929 02:19:58.091363 (+ 50297us) inbound_call.cc:173] Queueing success response
Related trace 'test_child':
Metrics: {"test_sleep_us":50000,"child_traces":[["test_child",{"related_trace_metric":1}]]}
[ OK ] Parameters/TestRpc.TimedOutOnResponseMetric/SSL_TCP (331 ms)
[ RUN ] Parameters/TestRpc.AcceptorDispatchingTimesMetric/SSL_TCP
I20260929 02:19:58.113364 23328 acceptor_pool.cc:254] collecting diagnostics on the listening RPC socket 0.0.0.0:37785 every 8 connection(s)
I20260929 02:19:58.113976 23329 acceptor_pool.cc:254] collecting diagnostics on the listening RPC socket 0.0.0.0:37785 every 8 connection(s)
W20260929 02:19:58.119195 23324 negotiation.cc:337] Failed RPC negotiation. Trace:
0929 02:19:58.118117 (+ 0us) reactor.cc:625] Submitting negotiation task for server connection from 127.0.0.1:35030 (local address 127.0.0.1:37785)
0929 02:19:58.118501 (+ 384us) server_negotiation.cc:206] Beginning negotiation
0929 02:19:58.118518 (+ 17us) server_negotiation.cc:399] Waiting for connection header
0929 02:19:58.118741 (+ 223us) negotiation.cc:327] Negotiation complete: Network error: Server connection negotiation failed: server connection from 127.0.0.1:35030: BlockingRecv error: recv got EOF from 127.0.0.1:35030 (error 108)
Metrics: {"server-negotiator.queue_time_us":95}
[ OK ] Parameters/TestRpc.AcceptorDispatchingTimesMetric/SSL_TCP (24 ms)
[ RUN ] Parameters/TestRpc.TestRpcCallbackDestroysMessenger/SSL_TCP
[ OK ] Parameters/TestRpc.TestRpcCallbackDestroysMessenger/SSL_TCP (36 ms)
[ RUN ] Parameters/TestRpc.TestApplicationFeatureFlag/SSL_TCP
I20260929 02:19:58.179306 23353 acceptor_pool.cc:254] collecting diagnostics on the listening RPC socket 0.0.0.0:39185 every 8 connection(s)
I20260929 02:19:58.179975 23354 acceptor_pool.cc:254] collecting diagnostics on the listening RPC socket 0.0.0.0:39185 every 8 connection(s)
W20260929 02:19:58.221021 23350 messenger.cc:357] Unable to handle RPC call: Not implemented: call requires unsupported application feature flags: 99
[ OK ] Parameters/TestRpc.TestApplicationFeatureFlag/SSL_TCP (67 ms)
[ RUN ] Parameters/TestRpc.TestCancellation/SSL_TCP
I20260929 02:19:58.247249 23378 acceptor_pool.cc:254] collecting diagnostics on the listening RPC socket 0.0.0.0:44329 every 8 connection(s)
I20260929 02:19:58.247941 23379 acceptor_pool.cc:254] collecting diagnostics on the listening RPC socket 0.0.0.0:44329 every 8 connection(s)
I20260929 02:19:58.250903 22964 rpc-test.cc:1648] Connecting to 0.0.0.0:44329
I20260929 02:19:58.347885 22964 rpc-test-base.h:595] status: Aborted: Sleep RPC to 0.0.0.0:44329 is cancelled in state READY, seconds elapsed: 0.000341995
I20260929 02:19:58.500869 22964 rpc-test-base.h:595] status: Aborted: Sleep RPC to 0.0.0.0:44329 is cancelled in state SENT, seconds elapsed: 0.000809651
I20260929 02:19:58.531170 23381 rpc-test-base.h:222] got call: sleep_micros: 510000
I20260929 02:19:58.659631 22964 rpc-test-base.h:595] status: Aborted: Sleep RPC to 0.0.0.0:44329 is cancelled in state SENT, seconds elapsed: 0.000971323
I20260929 02:19:58.700672 23380 rpc-test-base.h:222] got call: sleep_micros: 510000
I20260929 02:19:58.826943 22964 rpc-test-base.h:595] status: Aborted: Sleep RPC to 0.0.0.0:44329 is cancelled in state SENT, seconds elapsed: 0.00077957
W20260929 02:19:58.863097 23382 rpcz_store.cc:267] Call kudu.rpc.GenericCalculatorService.Sleep from 127.0.0.1:47598 (request call id 11) took 15 ms (client timeout 10 ms). Trace:
W20260929 02:19:58.863402 23382 rpcz_store.cc:269] 0929 02:19:58.847410 (+ 0us) service_pool.cc:170] Inserting onto call queue
0929 02:19:58.862818 (+ 15408us) service_pool.cc:214] Skipping call since client already timed out
0929 02:19:58.862924 (+ 106us) inbound_call.cc:173] Queueing failure response
Metrics: {}
I20260929 02:19:58.863960 23382 rpc-test-base.h:222] got call: sleep_micros: 1500000
W20260929 02:19:59.041849 23381 rpcz_store.cc:267] Call kudu.rpc.GenericCalculatorService.Sleep from 127.0.0.1:47598 (request call id 3) took 510 ms (client timeout 10 ms). Trace:
W20260929 02:19:59.042146 23381 rpcz_store.cc:269] 0929 02:19:58.530964 (+ 0us) service_pool.cc:170] Inserting onto call queue
0929 02:19:58.531095 (+ 131us) service_pool.cc:227] Handling call
0929 02:19:59.041799 (+510704us) inbound_call.cc:173] Queueing success response
Metrics: {}
W20260929 02:19:59.211436 23380 rpcz_store.cc:267] Call kudu.rpc.GenericCalculatorService.Sleep from 127.0.0.1:47598 (request call id 7) took 511 ms (client timeout 10 ms). Trace:
W20260929 02:19:59.211778 23380 rpcz_store.cc:269] 0929 02:19:58.700353 (+ 0us) service_pool.cc:170] Inserting onto call queue
0929 02:19:58.700591 (+ 238us) service_pool.cc:227] Handling call
0929 02:19:59.211383 (+510792us) inbound_call.cc:173] Queueing success response
Metrics: {}
I20260929 02:19:59.828365 22964 rpc-test-base.h:595] status: Timed out: Sleep RPC to 0.0.0.0:44329 timed out after 1.000s (SENT), seconds elapsed: 1.00099
I20260929 02:19:59.829615 23380 rpc-test-base.h:222] got call: sleep_micros: 1500000
W20260929 02:20:00.364488 23382 rpcz_store.cc:267] Call kudu.rpc.GenericCalculatorService.Sleep from 127.0.0.1:47598 (request call id 12) took 1516 ms (client timeout 1000 ms). Trace:
W20260929 02:20:00.364801 23382 rpcz_store.cc:269] 0929 02:19:58.847766 (+ 0us) service_pool.cc:170] Inserting onto call queue
0929 02:19:58.863919 (+ 16153us) service_pool.cc:227] Handling call
0929 02:20:00.364438 (+1500519us) inbound_call.cc:173] Queueing success response
Metrics: {}
I20260929 02:20:00.830835 22964 rpc-test-base.h:595] status: Timed out: Sleep RPC to 0.0.0.0:44329 timed out after 1.000s (SENT), seconds elapsed: 1.00215
W20260929 02:20:00.832234 23375 messenger.cc:357] Unable to handle RPC call: Not implemented: call requires unsupported application feature flags: 99, 1
W20260929 02:20:00.833585 23375 messenger.cc:357] Unable to handle RPC call: Not implemented: call requires unsupported application feature flags: 99, 1
W20260929 02:20:01.330082 23380 rpcz_store.cc:267] Call kudu.rpc.GenericCalculatorService.Sleep from 127.0.0.1:47598 (request call id 13) took 1500 ms (client timeout 1000 ms). Trace:
W20260929 02:20:01.330376 23380 rpcz_store.cc:269] 0929 02:19:59.829466 (+ 0us) service_pool.cc:170] Inserting onto call queue
0929 02:19:59.829567 (+ 101us) service_pool.cc:227] Handling call
0929 02:20:01.330032 (+1500465us) inbound_call.cc:173] Queueing success response
Metrics: {}
W20260929 02:20:01.330924 23375 connection.cc:441] server connection from 127.0.0.1:47598 torn down before Call kudu.rpc.GenericCalculatorService.Sleep from 127.0.0.1:47598 (request call id 13) could send its response
[ OK ] Parameters/TestRpc.TestCancellation/SSL_TCP (3107 ms)
[ RUN ] Parameters/TestRpc.TestCancellationMultiThreads/SSL_TCP
I20260929 02:20:01.384281 23403 acceptor_pool.cc:254] collecting diagnostics on the listening RPC socket 0.0.0.0:38499 every 8 connection(s)
I20260929 02:20:01.384929 23404 acceptor_pool.cc:254] collecting diagnostics on the listening RPC socket 0.0.0.0:38499 every 8 connection(s)
I20260929 02:20:01.387902 22964 rpc-test.cc:1808] Connecting to 0.0.0.0:38499
I20260929 02:20:01.526731 23417 test_util.cc:268] Using random seed: -773587023
I20260929 02:20:01.527908 23418 test_util.cc:268] Using random seed: -773585845
I20260929 02:20:01.529232 23419 test_util.cc:268] Using random seed: -773584520
I20260929 02:20:01.530488 23420 test_util.cc:268] Using random seed: -773583287
I20260929 02:20:01.532024 23421 test_util.cc:268] Using random seed: -773581874
I20260929 02:20:01.533373 23422 test_util.cc:268] Using random seed: -773580515
I20260929 02:20:01.534588 23423 test_util.cc:268] Using random seed: -773579259
I20260929 02:20:01.536104 23424 test_util.cc:268] Using random seed: -773577741
I20260929 02:20:01.537458 23425 test_util.cc:268] Using random seed: -773576424
I20260929 02:20:01.539139 23426 test_util.cc:268] Using random seed: -773574756
I20260929 02:20:01.540414 23427 test_util.cc:268] Using random seed: -773573437
I20260929 02:20:01.543299 23428 test_util.cc:268] Using random seed: -773570616
I20260929 02:20:01.545133 23429 test_util.cc:268] Using random seed: -773568764
I20260929 02:20:01.546866 23430 test_util.cc:268] Using random seed: -773567019
I20260929 02:20:01.548349 23431 test_util.cc:268] Using random seed: -773565585
I20260929 02:20:01.550027 23432 test_util.cc:268] Using random seed: -773563901
I20260929 02:20:01.551772 23433 test_util.cc:268] Using random seed: -773562182
I20260929 02:20:01.553439 23434 test_util.cc:268] Using random seed: -773560496
I20260929 02:20:01.555068 23435 test_util.cc:268] Using random seed: -773558875
I20260929 02:20:01.556686 23436 test_util.cc:268] Using random seed: -773557244
I20260929 02:20:01.558866 23437 test_util.cc:268] Using random seed: -773555061
I20260929 02:20:01.560485 23438 test_util.cc:268] Using random seed: -773553461
I20260929 02:20:01.562071 23439 test_util.cc:268] Using random seed: -773551854
I20260929 02:20:01.564111 23440 test_util.cc:268] Using random seed: -773549790
I20260929 02:20:01.566226 23441 test_util.cc:268] Using random seed: -773547691
I20260929 02:20:01.567773 23442 test_util.cc:268] Using random seed: -773546168
I20260929 02:20:01.569022 23443 test_util.cc:268] Using random seed: -773544825
I20260929 02:20:01.570549 23444 test_util.cc:268] Using random seed: -773543339
I20260929 02:20:01.572188 23445 test_util.cc:268] Using random seed: -773541739
I20260929 02:20:01.573760 23446 test_util.cc:268] Using random seed: -773540168
[ OK ] Parameters/TestRpc.TestCancellationMultiThreads/SSL_TCP (17017 ms)
[ RUN ] Parameters/TestRpc.TestCallId/SSL_TCP
I20260929 02:20:18.369858 23460 acceptor_pool.cc:254] collecting diagnostics on the listening RPC socket 0.0.0.0:45823 every 8 connection(s)
I20260929 02:20:18.370620 23461 acceptor_pool.cc:254] collecting diagnostics on the listening RPC socket 0.0.0.0:45823 every 8 connection(s)
[ OK ] Parameters/TestRpc.TestCallId/SSL_TCP (69 ms)
[----------] 20 tests from Parameters/TestRpc (36487 ms total)
[----------] Global test environment tear-down
[==========] 21 tests from 2 test suites ran. (36495 ms total)
[ PASSED ] 20 tests.
[ FAILED ] 1 test, listed below:
[ FAILED ] Parameters/TestRpc.TestCallWithChainCertAndRootCA/SSL_TCP, where GetParam() = (true, false)
1 FAILED TEST