Diagnosed failure

Parameters/TestRpc.TestCallWithChainCertAndChainCA/SSL_TCP: /data0/somelongdirectorytoavoidrpathissues/src/kudu/src/kudu/rpc/rpc-test.cc:270: Failure
Failed
Bad status: Runtime error: could not verify certificate chain (error with cert: subject=CN = localhost, ST = sadfjas, C = AS, emailAddress = sdflkdsajf, O = lskdfjlsad, OU = sldfkja, issuer=C = AS, ST = ASDfkjdhf, L = lskdjf, O = saldfja, OU = skdjf, CN = localhost, emailAddress = sadjflkadsj): : certificate has expired
Google Test trace:
/data0/somelongdirectorytoavoidrpathissues/src/kudu/src/kudu/rpc/rpc-test.cc:267: Connecting to 0.0.0.0:42597
I20260928 06:31:29.587687  2808 test_util.cc:175] -----------------------------------------------
I20260928 06:31:29.587744  2808 test_util.cc:176] Had fatal failures, leaving test files at /tmp/dist-test-taskJp16xc/test-tmp/rpc-test.5.Parameters_TestRpc.TestCallWithChainCertAndChainCA_SSL_TCP.1790577089535831-2808-0

Full log

Note: This is test shard 6 of 8.
[==========] Running 21 tests from 2 test suites.
[----------] Global test environment set-up.
[----------] 20 tests from Parameters/TestRpc
[ RUN      ] Parameters/TestRpc.TestMessengerCreateDestroy/SSL_TCP
WARNING: Logging before InitGoogleLogging() is written to STDERR
I20260928 06:31:29.553362  2808 rpc-test.cc:169] started messenger TestCreateDestroy
[       OK ] Parameters/TestRpc.TestMessengerCreateDestroy/SSL_TCP (15 ms)
[ RUN      ] Parameters/TestRpc.TestNegotiationDeadlock/SSL_TCP
I20260928 06:31:29.564635  2828 acceptor_pool.cc:254] collecting diagnostics on the listening RPC socket 0.0.0.0:42713 every 8 connection(s)
I20260928 06:31:29.564640  2829 acceptor_pool.cc:254] collecting diagnostics on the listening RPC socket 0.0.0.0:42713 every 8 connection(s)
[       OK ] Parameters/TestRpc.TestNegotiationDeadlock/SSL_TCP (17 ms)
[ RUN      ] Parameters/TestRpc.TestCallWithChainCertAndChainCA/SSL_TCP
I20260928 06:31:29.583843  2844 acceptor_pool.cc:254] collecting diagnostics on the listening RPC socket 0.0.0.0:42597 every 8 connection(s)
I20260928 06:31:29.583897  2845 acceptor_pool.cc:254] collecting diagnostics on the listening RPC socket 0.0.0.0:42597 every 8 connection(s)
/data0/somelongdirectorytoavoidrpathissues/src/kudu/src/kudu/rpc/rpc-test.cc:270: Failure
Failed
Bad status: Runtime error: could not verify certificate chain (error with cert: subject=CN = localhost, ST = sadfjas, C = AS, emailAddress = sdflkdsajf, O = lskdfjlsad, OU = sldfkja, issuer=C = AS, ST = ASDfkjdhf, L = lskdjf, O = saldfja, OU = skdjf, CN = localhost, emailAddress = sadjflkadsj): : certificate has expired
Google Test trace:
/data0/somelongdirectorytoavoidrpathissues/src/kudu/src/kudu/rpc/rpc-test.cc:267: Connecting to 0.0.0.0:42597
I20260928 06:31:29.587687  2808 test_util.cc:175] -----------------------------------------------
I20260928 06:31:29.587744  2808 test_util.cc:176] Had fatal failures, leaving test files at /tmp/dist-test-taskJp16xc/test-tmp/rpc-test.5.Parameters_TestRpc.TestCallWithChainCertAndChainCA_SSL_TCP.1790577089535831-2808-0
[  FAILED  ] Parameters/TestRpc.TestCallWithChainCertAndChainCA/SSL_TCP, where GetParam() = (true, false) (15 ms)
[ RUN      ] Parameters/TestRpc.TestCallWithPasswordProtectedKey/SSL_TCP
I20260928 06:31:29.601565  2870 acceptor_pool.cc:254] collecting diagnostics on the listening RPC socket 0.0.0.0:37545 every 8 connection(s)
I20260928 06:31:29.601565  2869 acceptor_pool.cc:254] collecting diagnostics on the listening RPC socket 0.0.0.0:37545 every 8 connection(s)
[       OK ] Parameters/TestRpc.TestCallWithPasswordProtectedKey/SSL_TCP (30 ms)
[ RUN      ] Parameters/TestRpc.TestCallToBadServer/SSL_TCP
I20260928 06:31:29.625205  2808 rpc-test.cc:394] Status: Network error: Client connection negotiation failed: client connection to 0.0.0.0:0: connect: Connection refused (error 111)
I20260928 06:31:29.625484  2808 rpc-test.cc:394] Status: Network error: Client connection negotiation failed: client connection to 0.0.0.0:0: connect: Connection refused (error 111)
I20260928 06:31:29.625715  2808 rpc-test.cc:394] Status: Network error: Client connection negotiation failed: client connection to 0.0.0.0:0: connect: Connection refused (error 111)
I20260928 06:31:29.625937  2808 rpc-test.cc:394] Status: Network error: Client connection negotiation failed: client connection to 0.0.0.0:0: connect: Connection refused (error 111)
I20260928 06:31:29.626184  2808 rpc-test.cc:394] Status: Network error: Client connection negotiation failed: client connection to 0.0.0.0:0: connect: Connection refused (error 111)
[       OK ] Parameters/TestRpc.TestCallToBadServer/SSL_TCP (8 ms)
[ RUN      ] Parameters/TestRpc.TestWrongService/SSL_TCP
I20260928 06:31:29.633057  2904 acceptor_pool.cc:254] collecting diagnostics on the listening RPC socket 0.0.0.0:36077 every 8 connection(s)
I20260928 06:31:29.633229  2905 acceptor_pool.cc:254] collecting diagnostics on the listening RPC socket 0.0.0.0:36077 every 8 connection(s)
I20260928 06:31:29.649061  2901 messenger.cc:345] service WrongServiceName not registered on TestServer
[       OK ] Parameters/TestRpc.TestWrongService/SSL_TCP (24 ms)
[ RUN      ] Parameters/TestRpc.TestConnectionKeepalive/SSL_TCP
I20260928 06:31:29.666262  2927 acceptor_pool.cc:254] collecting diagnostics on the listening RPC socket 0.0.0.0:41129 every 8 connection(s)
I20260928 06:31:29.666316  2928 acceptor_pool.cc:254] collecting diagnostics on the listening RPC socket 0.0.0.0:41129 every 8 connection(s)
I20260928 06:31:29.666494  2808 rpc-test.cc:488] Connecting to 0.0.0.0:41129
[       OK ] Parameters/TestRpc.TestConnectionKeepalive/SSL_TCP (1059 ms)
[ RUN      ] Parameters/TestRpc.TestClientConnectionMetrics/SSL_TCP
I20260928 06:31:30.719691  2952 acceptor_pool.cc:254] collecting diagnostics on the listening RPC socket 0.0.0.0:38823 every 8 connection(s)
I20260928 06:31:30.719764  2953 acceptor_pool.cc:254] collecting diagnostics on the listening RPC socket 0.0.0.0:38823 every 8 connection(s)
I20260928 06:31:30.719897  2808 rpc-test.cc:569] Connecting to 0.0.0.0:38823
[       OK ] Parameters/TestRpc.TestClientConnectionMetrics/SSL_TCP (9379 ms)
[ RUN      ] Parameters/TestRpc.TestCredentialsPolicy/SSL_TCP
I20260928 06:31:40.097553  2975 acceptor_pool.cc:254] collecting diagnostics on the listening RPC socket 0.0.0.0:39765 every 8 connection(s)
I20260928 06:31:40.097625  2976 acceptor_pool.cc:254] collecting diagnostics on the listening RPC socket 0.0.0.0:39765 every 8 connection(s)
I20260928 06:31:40.097787  2808 rpc-test.cc:700] Connecting to 0.0.0.0:39765
[       OK ] Parameters/TestRpc.TestCredentialsPolicy/SSL_TCP (31 ms)
[ RUN      ] Parameters/TestRpc.TestCallLongerThanKeepalive/SSL_TCP
I20260928 06:31:40.131772  3000 acceptor_pool.cc:254] collecting diagnostics on the listening RPC socket 0.0.0.0:38417 every 8 connection(s)
I20260928 06:31:40.131850  3001 acceptor_pool.cc:254] collecting diagnostics on the listening RPC socket 0.0.0.0:38417 every 8 connection(s)
I20260928 06:31:40.148021  3002 rpc-test-base.h:222] got call: sleep_micros: 3000000 deferred: true
I20260928 06:31:43.148828  3002 rpcz_store.cc:275] Call kudu.rpc.GenericCalculatorService.Sleep from 127.0.0.1:45696 (request call id 0) took 3000 ms. Trace:
I20260928 06:31:43.148947  3002 rpcz_store.cc:276] 0928 06:31:40.147955 (+     0us) service_pool.cc:170] Inserting onto call queue
0928 06:31:40.147993 (+    38us) service_pool.cc:227] Handling call
0928 06:31:43.148808 (+3000815us) inbound_call.cc:173] Queueing success response
Metrics: {}
[       OK ] Parameters/TestRpc.TestCallLongerThanKeepalive/SSL_TCP (3029 ms)
[ RUN      ] Parameters/TestRpc.TestRpcSidecar/SSL_TCP
I20260928 06:31:43.159006  3025 acceptor_pool.cc:254] collecting diagnostics on the listening RPC socket 0.0.0.0:46497 every 8 connection(s)
I20260928 06:31:43.159085  3026 acceptor_pool.cc:254] collecting diagnostics on the listening RPC socket 0.0.0.0:46497 every 8 connection(s)
[       OK ] Parameters/TestRpc.TestRpcSidecar/SSL_TCP (62 ms)
[ RUN      ] Parameters/TestRpc.TestRpcSidecarLimits/SSL_TCP
I20260928 06:31:46.306763  3050 acceptor_pool.cc:254] collecting diagnostics on the listening RPC socket 0.0.0.0:46805 every 8 connection(s)
I20260928 06:31:46.306818  3051 acceptor_pool.cc:254] collecting diagnostics on the listening RPC socket 0.0.0.0:46805 every 8 connection(s)
W20260928 06:31:46.317927  2808 serialization.cc:72] Serialized kudu.rpc_test.PushStringsRequestPB (2147483654 bytes) is larger than the maximum configured RPC message size (52428800 bytes). Sending anyway, but peer may reject the data.
W20260928 06:31:46.321332  3047 connection.cc:535] server connection from 127.0.0.1:34934 recv error: Network error: RPC frame had a length of 2147483714, but we only support messages up to 52428800 bytes long.
W20260928 06:31:46.321424  3047 connection.cc:158] shutting down server connection from 127.0.0.1:34934 with pending inbound data: 4/2147483714 bytes received; last active 0 ns ago: status Network error: RPC frame had a length of 2147483714, but we only support messages up to 52428800 bytes long.
W20260928 06:31:46.321702  3063 connection.cc:196] Error closing socket: Network error: TlsSocket::Close: Connection reset by peer
I20260928 06:31:46.327925  3075 acceptor_pool.cc:254] collecting diagnostics on the listening RPC socket 0.0.0.0:35065 every 8 connection(s)
I20260928 06:31:46.327957  3076 acceptor_pool.cc:254] collecting diagnostics on the listening RPC socket 0.0.0.0:35065 every 8 connection(s)
W20260928 06:31:51.405129  3072 connection.cc:577] server connection from 127.0.0.1:37580: received bad data: 'Corruption: Invalid packet: message had a length of 2147483710, but we only support messages up to 2147483647 bytes
'
[       OK ] Parameters/TestRpc.TestRpcSidecarLimits/SSL_TCP (8193 ms)
[ RUN      ] Parameters/TestRpc.TestCallTimeoutDoesntAffectNegotiation/SSL_TCP
I20260928 06:31:51.427645  3100 acceptor_pool.cc:254] collecting diagnostics on the listening RPC socket 0.0.0.0:41809 every 8 connection(s)
I20260928 06:31:51.427690  3101 acceptor_pool.cc:254] collecting diagnostics on the listening RPC socket 0.0.0.0:41809 every 8 connection(s)
W20260928 06:31:51.436920  3093 negotiation.cc:266] Injecting 500ms delay in negotiation
I20260928 06:31:51.487295  2808 rpc-test-base.h:595] status: Timed out: connection negotiation to 0.0.0.0:41809 for RPC Sleep timed out after 0.050s (ON_OUTBOUND_QUEUE), seconds elapsed: 0.0507859
[       OK ] Parameters/TestRpc.TestCallTimeoutDoesntAffectNegotiation/SSL_TCP (534 ms)
[ RUN      ] Parameters/TestRpc.TestRpcHandlerLatencyMetric/SSL_TCP
I20260928 06:31:51.962209  3125 acceptor_pool.cc:254] collecting diagnostics on the listening RPC socket 0.0.0.0:34019 every 8 connection(s)
I20260928 06:31:51.962231  3126 acceptor_pool.cc:254] collecting diagnostics on the listening RPC socket 0.0.0.0:34019 every 8 connection(s)
I20260928 06:31:52.000322  2808 rpc-test.cc:1236] Sleep() min lat: 20356
I20260928 06:31:52.000417  2808 rpc-test.cc:1237] Sleep() mean lat: 20356
I20260928 06:31:52.000449  2808 rpc-test.cc:1238] Sleep() max lat: 20356
I20260928 06:31:52.000466  2808 rpc-test.cc:1239] Sleep() #calls: 1
[       OK ] Parameters/TestRpc.TestRpcHandlerLatencyMetric/SSL_TCP (59 ms)
[ RUN      ] Parameters/TestRpc.TimedOutOnResponseMetricServiceQueue/SSL_TCP
I20260928 06:31:52.009006  3151 acceptor_pool.cc:254] collecting diagnostics on the listening RPC socket 0.0.0.0:33837 every 8 connection(s)
I20260928 06:31:52.009069  3152 acceptor_pool.cc:254] collecting diagnostics on the listening RPC socket 0.0.0.0:33837 every 8 connection(s)
W20260928 06:31:52.072451  3153 rpcz_store.cc:267] Call kudu.rpc_test.CalculatorService.Sleep from 127.0.0.1:38986 (request call id 2) took 20 ms (client timeout 20 ms). Trace:
W20260928 06:31:52.072594  3153 rpcz_store.cc:269] 0928 06:31:52.052058 (+     0us) service_pool.cc:170] Inserting onto call queue
0928 06:31:52.072382 (+ 20324us) service_pool.cc:214] Skipping call since client already timed out
0928 06:31:52.072400 (+    18us) inbound_call.cc:173] Queueing failure response
Metrics: {}
[       OK ] Parameters/TestRpc.TimedOutOnResponseMetricServiceQueue/SSL_TCP (72 ms)
[ RUN      ] Parameters/TestRpc.RpcPendingConnectionsMetric/SSL_TCP
I20260928 06:31:52.076057  3174 acceptor_pool.cc:254] collecting diagnostics on the listening RPC socket 0.0.0.0:32893 every 8 connection(s)
I20260928 06:31:52.076136  3175 acceptor_pool.cc:254] collecting diagnostics on the listening RPC socket 0.0.0.0:32893 every 8 connection(s)
W20260928 06:31:52.076716  3170 negotiation.cc:337] Failed RPC negotiation. Trace:
0928 06:31:52.076549 (+     0us) reactor.cc:625] Submitting negotiation task for server connection from 127.0.0.1:49648 (local address 127.0.0.1:32893)
0928 06:31:52.076591 (+    42us) server_negotiation.cc:206] Beginning negotiation
0928 06:31:52.076593 (+     2us) server_negotiation.cc:399] Waiting for connection header
0928 06:31:52.076658 (+    65us) negotiation.cc:327] Negotiation complete: Network error: Server connection negotiation failed: server connection from 127.0.0.1:49648: BlockingRecv error: recv got EOF from 127.0.0.1:49648 (error 108)
Metrics: {"server-negotiator.queue_time_us":13}
[       OK ] Parameters/TestRpc.RpcPendingConnectionsMetric/SSL_TCP (13 ms)
[ RUN      ] Parameters/TestRpc.TestRpcContextClientDeadline/SSL_TCP
I20260928 06:31:52.118779  3190 acceptor_pool.cc:254] collecting diagnostics on the listening RPC socket 0.0.0.0:39707 every 8 connection(s)
I20260928 06:31:52.118827  3191 acceptor_pool.cc:254] collecting diagnostics on the listening RPC socket 0.0.0.0:39707 every 8 connection(s)
[       OK ] Parameters/TestRpc.TestRpcContextClientDeadline/SSL_TCP (73 ms)
[ RUN      ] Parameters/TestRpc.TestApplicationFeatureFlagUnsupportedServer/SSL_TCP
I20260928 06:31:52.166414  3215 acceptor_pool.cc:254] collecting diagnostics on the listening RPC socket 0.0.0.0:42337 every 8 connection(s)
I20260928 06:31:52.166443  3216 acceptor_pool.cc:254] collecting diagnostics on the listening RPC socket 0.0.0.0:42337 every 8 connection(s)
[       OK ] Parameters/TestRpc.TestApplicationFeatureFlagUnsupportedServer/SSL_TCP (24 ms)
[ RUN      ] Parameters/TestRpc.TestCancellationAsync/SSL_TCP
I20260928 06:31:52.206753  3240 acceptor_pool.cc:254] collecting diagnostics on the listening RPC socket 0.0.0.0:34001 every 8 connection(s)
I20260928 06:31:52.206784  3241 acceptor_pool.cc:254] collecting diagnostics on the listening RPC socket 0.0.0.0:34001 every 8 connection(s)
I20260928 06:31:52.206949  2808 rpc-test.cc:1716] Connecting to 0.0.0.0:34001
I20260928 06:31:52.221536  2808 test_util.cc:268] Using random seed: 951551836
I20260928 06:31:52.239230  3244 rpc-test-base.h:240] got call: sleep_micros: 500 pattern: 4294967295 num_repetitions: 2097152 sidecar_idx: 0
I20260928 06:31:52.252872  3244 rpc-test-base.h:240] got call: sleep_micros: 500 pattern: 4294967295 num_repetitions: 2097152 sidecar_idx: 0
I20260928 06:31:52.266523  3244 rpc-test-base.h:240] got call: sleep_micros: 500 pattern: 4294967295 num_repetitions: 2097152 sidecar_idx: 0
I20260928 06:31:52.280490  3244 rpc-test-base.h:240] got call: sleep_micros: 500 pattern: 4294967295 num_repetitions: 2097152 sidecar_idx: 0
I20260928 06:31:52.294305  3244 rpc-test-base.h:240] got call: sleep_micros: 500 pattern: 4294967295 num_repetitions: 2097152 sidecar_idx: 0
I20260928 06:31:52.308018  3244 rpc-test-base.h:240] got call: sleep_micros: 500 pattern: 4294967295 num_repetitions: 2097152 sidecar_idx: 0
I20260928 06:31:52.321641  3244 rpc-test-base.h:240] got call: sleep_micros: 500 pattern: 4294967295 num_repetitions: 2097152 sidecar_idx: 0
I20260928 06:31:52.335096  3244 rpc-test-base.h:240] got call: sleep_micros: 500 pattern: 4294967295 num_repetitions: 2097152 sidecar_idx: 0
I20260928 06:31:52.349897  3244 rpc-test-base.h:240] got call: sleep_micros: 500 pattern: 4294967295 num_repetitions: 2097152 sidecar_idx: 0
W20260928 06:31:52.353958  3238 connection.cc:441] server connection from 127.0.0.1:50676 torn down before Call kudu.rpc.GenericCalculatorService.SleepWithSidecar from 127.0.0.1:50676 (request call id 9) could send its response
[       OK ] Parameters/TestRpc.TestCancellationAsync/SSL_TCP (169 ms)
[ RUN      ] Parameters/TestRpc.TestPerformanceBySocketType/SSL_TCP
I20260928 06:31:52.366290  3265 acceptor_pool.cc:254] collecting diagnostics on the listening RPC socket 0.0.0.0:39641 every 8 connection(s)
I20260928 06:31:52.366323  3266 acceptor_pool.cc:254] collecting diagnostics on the listening RPC socket 0.0.0.0:39641 every 8 connection(s)
I20260928 06:31:52.366497  2808 rpc-test.cc:1846] Connecting to 0.0.0.0:39641
I20260928 06:31:54.069074  2808 rpc-test.cc:1859] Sending 1024MB via ssl-enabled tcp socket: real 1.684s	user 1.645s	sys 1.315s
I20260928 06:31:55.783440  2808 rpc-test.cc:1859] Sending 1024MB via ssl-enabled tcp socket: real 1.714s	user 1.737s	sys 1.294s
I20260928 06:31:57.391739  2808 rpc-test.cc:1859] Sending 1024MB via ssl-enabled tcp socket: real 1.608s	user 1.503s	sys 1.336s
I20260928 06:31:59.052990  2808 rpc-test.cc:1859] Sending 1024MB via ssl-enabled tcp socket: real 1.661s	user 1.607s	sys 1.322s
I20260928 06:32:00.714274  2808 rpc-test.cc:1859] Sending 1024MB via ssl-enabled tcp socket: real 1.661s	user 1.550s	sys 1.355s
[       OK ] Parameters/TestRpc.TestPerformanceBySocketType/SSL_TCP (8360 ms)
[----------] 20 tests from Parameters/TestRpc (31177 ms total)

[----------] 1 test from Parameters/TestRpcSocketTxRxQueue
[ RUN      ] Parameters/TestRpcSocketTxRxQueue.OverCapacity/0
W20260928 06:32:00.981148  3282 negotiation.cc:337] Failed RPC negotiation. Trace:
0928 06:32:00.717660 (+     0us) reactor.cc:625] Submitting negotiation task for client connection to 0.0.0.0:39681 (local address 127.0.0.1:48560)
0928 06:32:00.717704 (+    44us) negotiation.cc:107] Waiting for socket to connect
0928 06:32:00.717715 (+    11us) client_negotiation.cc:174] Beginning negotiation
0928 06:32:00.717770 (+    55us) client_negotiation.cc:252] Sending NEGOTIATE NegotiatePB request
0928 06:32:00.980968 (+263198us) negotiation.cc:327] Negotiation complete: Network error: Client connection negotiation failed: client connection to 0.0.0.0:39681: BlockingRecv error: recv error from unknown peer: Transport endpoint is not connected (error 107)
Metrics: {"client-negotiator.queue_time_us":16}
W20260928 06:32:00.981155  3318 negotiation.cc:337] Failed RPC negotiation. Trace:
0928 06:32:00.721236 (+     0us) reactor.cc:625] Submitting negotiation task for client connection to 0.0.0.0:39681 (local address 127.0.0.1:48594)
0928 06:32:00.721302 (+    66us) negotiation.cc:107] Waiting for socket to connect
0928 06:32:00.721311 (+     9us) client_negotiation.cc:174] Beginning negotiation
0928 06:32:00.721364 (+    53us) client_negotiation.cc:252] Sending NEGOTIATE NegotiatePB request
0928 06:32:00.981056 (+259692us) negotiation.cc:327] Negotiation complete: Network error: Client connection negotiation failed: client connection to 0.0.0.0:39681: BlockingRecv error: recv error from unknown peer: Transport endpoint is not connected (error 107)
Metrics: {"client-negotiator.queue_time_us":44}
W20260928 06:32:00.981153  3291 negotiation.cc:337] Failed RPC negotiation. Trace:
0928 06:32:00.718511 (+     0us) reactor.cc:625] Submitting negotiation task for client connection to 0.0.0.0:39681 (local address 127.0.0.1:48572)
0928 06:32:00.718567 (+    56us) negotiation.cc:107] Waiting for socket to connect
0928 06:32:00.718577 (+    10us) client_negotiation.cc:174] Beginning negotiation
0928 06:32:00.718631 (+    54us) client_negotiation.cc:252] Sending NEGOTIATE NegotiatePB request
0928 06:32:00.981004 (+262373us) negotiation.cc:327] Negotiation complete: Network error: Client connection negotiation failed: client connection to 0.0.0.0:39681: BlockingRecv error: recv error from unknown peer: Transport endpoint is not connected (error 107)
Metrics: {"client-negotiator.queue_time_us":31}
W20260928 06:32:00.981339  3309 negotiation.cc:337] Failed RPC negotiation. Trace:
0928 06:32:00.720325 (+     0us) reactor.cc:625] Submitting negotiation task for client connection to 0.0.0.0:39681 (local address 127.0.0.1:48592)
0928 06:32:00.720364 (+    39us) negotiation.cc:107] Waiting for socket to connect
0928 06:32:00.720373 (+     9us) client_negotiation.cc:174] Beginning negotiation
0928 06:32:00.720426 (+    53us) client_negotiation.cc:252] Sending NEGOTIATE NegotiatePB request
0928 06:32:00.980968 (+260542us) negotiation.cc:327] Negotiation complete: Network error: Client connection negotiation failed: client connection to 0.0.0.0:39681: BlockingRecv error: recv error from unknown peer: Transport endpoint is not connected (error 107)
Metrics: {"client-negotiator.queue_time_us":17}
W20260928 06:32:00.981495  3327 negotiation.cc:337] Failed RPC negotiation. Trace:
0928 06:32:00.722120 (+     0us) reactor.cc:625] Submitting negotiation task for client connection to 0.0.0.0:39681 (local address 127.0.0.1:48602)
0928 06:32:00.722169 (+    49us) negotiation.cc:107] Waiting for socket to connect
0928 06:32:00.722177 (+     8us) client_negotiation.cc:174] Beginning negotiation
0928 06:32:00.722222 (+    45us) client_negotiation.cc:252] Sending NEGOTIATE NegotiatePB request
0928 06:32:00.981192 (+258970us) negotiation.cc:327] Negotiation complete: Network error: Client connection negotiation failed: client connection to 0.0.0.0:39681: BlockingRecv error: recv error from unknown peer: Transport endpoint is not connected (error 107)
Metrics: {"client-negotiator.queue_time_us":28}
W20260928 06:32:00.981246  3300 negotiation.cc:337] Failed RPC negotiation. Trace:
0928 06:32:00.719408 (+     0us) reactor.cc:625] Submitting negotiation task for client connection to 0.0.0.0:39681 (local address 127.0.0.1:48578)
0928 06:32:00.719459 (+    51us) negotiation.cc:107] Waiting for socket to connect
0928 06:32:00.719467 (+     8us) client_negotiation.cc:174] Beginning negotiation
0928 06:32:00.719513 (+    46us) client_negotiation.cc:252] Sending NEGOTIATE NegotiatePB request
0928 06:32:00.981004 (+261491us) negotiation.cc:327] Negotiation complete: Network error: Client connection negotiation failed: client connection to 0.0.0.0:39681: BlockingRecv error: recv error from unknown peer: Transport endpoint is not connected (error 107)
Metrics: {"client-negotiator.queue_time_us":28}
[       OK ] Parameters/TestRpcSocketTxRxQueue.OverCapacity/0 (1041 ms)
[----------] 1 test from Parameters/TestRpcSocketTxRxQueue (1041 ms total)

[----------] Global test environment tear-down
[==========] 21 tests from 2 test suites ran. (32219 ms total)
[  PASSED  ] 20 tests.
[  FAILED  ] 1 test, listed below:
[  FAILED  ] Parameters/TestRpc.TestCallWithChainCertAndChainCA/SSL_TCP, where GetParam() = (true, false)

 1 FAILED TEST