Diagnosed failure

Parameters/TestRpc.TestCallWithChainCertAndChainCA/SSL_TCP: /data0/somelongdirectorytoavoidrpathissues/src/kudu/src/kudu/rpc/rpc-test.cc:270: Failure
Failed
Bad status: Runtime error: could not verify certificate chain (error with cert: subject=CN = localhost, ST = sadfjas, C = AS, emailAddress = sdflkdsajf, O = lskdfjlsad, OU = sldfkja, issuer=C = AS, ST = ASDfkjdhf, L = lskdjf, O = saldfja, OU = skdjf, CN = localhost, emailAddress = sadjflkadsj): : certificate has expired
Google Test trace:
/data0/somelongdirectorytoavoidrpathissues/src/kudu/src/kudu/rpc/rpc-test.cc:267: Connecting to 0.0.0.0:35635
I20260926 16:17:19.227905 24609 test_util.cc:175] -----------------------------------------------
I20260926 16:17:19.228129 24609 test_util.cc:176] Had fatal failures, leaving test files at /tmp/dist-test-task7weJfg/test-tmp/rpc-test.5.Parameters_TestRpc.TestCallWithChainCertAndChainCA_SSL_TCP.1790439437952008-24609-0

Full log

Note: This is test shard 6 of 8.
[==========] Running 21 tests from 2 test suites.
[----------] Global test environment set-up.
[----------] 20 tests from Parameters/TestRpc
[ RUN      ] Parameters/TestRpc.TestMessengerCreateDestroy/SSL_TCP
WARNING: Logging before InitGoogleLogging() is written to STDERR
I20260926 16:17:18.046490 24609 rpc-test.cc:169] started messenger TestCreateDestroy
[       OK ] Parameters/TestRpc.TestMessengerCreateDestroy/SSL_TCP (1092 ms)
[ RUN      ] Parameters/TestRpc.TestNegotiationDeadlock/SSL_TCP
I20260926 16:17:19.119895 24631 acceptor_pool.cc:254] collecting diagnostics on the listening RPC socket 0.0.0.0:37023 every 8 connection(s)
I20260926 16:17:19.121276 24632 acceptor_pool.cc:254] collecting diagnostics on the listening RPC socket 0.0.0.0:37023 every 8 connection(s)
[       OK ] Parameters/TestRpc.TestNegotiationDeadlock/SSL_TCP (77 ms)
[ RUN      ] Parameters/TestRpc.TestCallWithChainCertAndChainCA/SSL_TCP
I20260926 16:17:19.197671 24647 acceptor_pool.cc:254] collecting diagnostics on the listening RPC socket 0.0.0.0:35635 every 8 connection(s)
I20260926 16:17:19.199681 24648 acceptor_pool.cc:254] collecting diagnostics on the listening RPC socket 0.0.0.0:35635 every 8 connection(s)
/data0/somelongdirectorytoavoidrpathissues/src/kudu/src/kudu/rpc/rpc-test.cc:270: Failure
Failed
Bad status: Runtime error: could not verify certificate chain (error with cert: subject=CN = localhost, ST = sadfjas, C = AS, emailAddress = sdflkdsajf, O = lskdfjlsad, OU = sldfkja, issuer=C = AS, ST = ASDfkjdhf, L = lskdjf, O = saldfja, OU = skdjf, CN = localhost, emailAddress = sadjflkadsj): : certificate has expired
Google Test trace:
/data0/somelongdirectorytoavoidrpathissues/src/kudu/src/kudu/rpc/rpc-test.cc:267: Connecting to 0.0.0.0:35635
I20260926 16:17:19.227905 24609 test_util.cc:175] -----------------------------------------------
I20260926 16:17:19.228129 24609 test_util.cc:176] Had fatal failures, leaving test files at /tmp/dist-test-task7weJfg/test-tmp/rpc-test.5.Parameters_TestRpc.TestCallWithChainCertAndChainCA_SSL_TCP.1790439437952008-24609-0
[  FAILED  ] Parameters/TestRpc.TestCallWithChainCertAndChainCA/SSL_TCP, where GetParam() = (true, false) (53 ms)
[ RUN      ] Parameters/TestRpc.TestCallWithPasswordProtectedKey/SSL_TCP
I20260926 16:17:19.249434 24672 acceptor_pool.cc:254] collecting diagnostics on the listening RPC socket 0.0.0.0:42701 every 8 connection(s)
I20260926 16:17:19.250227 24673 acceptor_pool.cc:254] collecting diagnostics on the listening RPC socket 0.0.0.0:42701 every 8 connection(s)
[       OK ] Parameters/TestRpc.TestCallWithPasswordProtectedKey/SSL_TCP (72 ms)
[ RUN      ] Parameters/TestRpc.TestCallToBadServer/SSL_TCP
I20260926 16:17:19.330456 24609 rpc-test.cc:394] Status: Network error: Client connection negotiation failed: client connection to 0.0.0.0:0: connect: Connection refused (error 111)
I20260926 16:17:19.332444 24609 rpc-test.cc:394] Status: Network error: Client connection negotiation failed: client connection to 0.0.0.0:0: connect: Connection refused (error 111)
I20260926 16:17:19.333949 24609 rpc-test.cc:394] Status: Network error: Client connection negotiation failed: client connection to 0.0.0.0:0: connect: Connection refused (error 111)
I20260926 16:17:19.335453 24609 rpc-test.cc:394] Status: Network error: Client connection negotiation failed: client connection to 0.0.0.0:0: connect: Connection refused (error 111)
I20260926 16:17:19.336813 24609 rpc-test.cc:394] Status: Network error: Client connection negotiation failed: client connection to 0.0.0.0:0: connect: Connection refused (error 111)
[       OK ] Parameters/TestRpc.TestCallToBadServer/SSL_TCP (39 ms)
[ RUN      ] Parameters/TestRpc.TestWrongService/SSL_TCP
I20260926 16:17:19.372802 24707 acceptor_pool.cc:254] collecting diagnostics on the listening RPC socket 0.0.0.0:41527 every 8 connection(s)
I20260926 16:17:19.373579 24708 acceptor_pool.cc:254] collecting diagnostics on the listening RPC socket 0.0.0.0:41527 every 8 connection(s)
I20260926 16:17:19.406327 24705 messenger.cc:345] service WrongServiceName not registered on TestServer
[       OK ] Parameters/TestRpc.TestWrongService/SSL_TCP (77 ms)
[ RUN      ] Parameters/TestRpc.TestConnectionKeepalive/SSL_TCP
I20260926 16:17:19.451653 24730 acceptor_pool.cc:254] collecting diagnostics on the listening RPC socket 0.0.0.0:39007 every 8 connection(s)
I20260926 16:17:19.452332 24731 acceptor_pool.cc:254] collecting diagnostics on the listening RPC socket 0.0.0.0:39007 every 8 connection(s)
I20260926 16:17:19.455682 24609 rpc-test.cc:488] Connecting to 0.0.0.0:39007
[       OK ] Parameters/TestRpc.TestConnectionKeepalive/SSL_TCP (1109 ms)
[ RUN      ] Parameters/TestRpc.TestClientConnectionMetrics/SSL_TCP
I20260926 16:17:20.550118 24755 acceptor_pool.cc:254] collecting diagnostics on the listening RPC socket 0.0.0.0:42147 every 8 connection(s)
I20260926 16:17:20.550824 24756 acceptor_pool.cc:254] collecting diagnostics on the listening RPC socket 0.0.0.0:42147 every 8 connection(s)
I20260926 16:17:20.554623 24609 rpc-test.cc:569] Connecting to 0.0.0.0:42147
[       OK ] Parameters/TestRpc.TestClientConnectionMetrics/SSL_TCP (119690 ms)
[ RUN      ] Parameters/TestRpc.TestCredentialsPolicy/SSL_TCP
I20260926 16:19:20.252658 24790 acceptor_pool.cc:254] collecting diagnostics on the listening RPC socket 0.0.0.0:41897 every 8 connection(s)
I20260926 16:19:20.253453 24791 acceptor_pool.cc:254] collecting diagnostics on the listening RPC socket 0.0.0.0:41897 every 8 connection(s)
I20260926 16:19:20.257146 24609 rpc-test.cc:700] Connecting to 0.0.0.0:41897
[       OK ] Parameters/TestRpc.TestCredentialsPolicy/SSL_TCP (102 ms)
[ RUN      ] Parameters/TestRpc.TestCallLongerThanKeepalive/SSL_TCP
I20260926 16:19:20.338611 24815 acceptor_pool.cc:254] collecting diagnostics on the listening RPC socket 0.0.0.0:41071 every 8 connection(s)
I20260926 16:19:20.339426 24816 acceptor_pool.cc:254] collecting diagnostics on the listening RPC socket 0.0.0.0:41071 every 8 connection(s)
I20260926 16:19:20.370862 24819 rpc-test-base.h:222] got call: sleep_micros: 3000000 deferred: true
I20260926 16:19:23.375424 24819 rpcz_store.cc:275] Call kudu.rpc.GenericCalculatorService.Sleep from 127.0.0.1:52394 (request call id 0) took 3004 ms. Trace:
I20260926 16:19:23.375805 24819 rpcz_store.cc:276] 0926 16:19:20.370590 (+     0us) service_pool.cc:170] Inserting onto call queue
0926 16:19:20.370709 (+   119us) service_pool.cc:227] Handling call
0926 16:19:23.375349 (+3004640us) inbound_call.cc:173] Queueing success response
Metrics: {}
[       OK ] Parameters/TestRpc.TestCallLongerThanKeepalive/SSL_TCP (3067 ms)
[ RUN      ] Parameters/TestRpc.TestRpcSidecar/SSL_TCP
I20260926 16:19:23.421906 24840 acceptor_pool.cc:254] collecting diagnostics on the listening RPC socket 0.0.0.0:46781 every 8 connection(s)
I20260926 16:19:23.422760 24841 acceptor_pool.cc:254] collecting diagnostics on the listening RPC socket 0.0.0.0:46781 every 8 connection(s)
[       OK ] Parameters/TestRpc.TestRpcSidecar/SSL_TCP (553 ms)
[ RUN      ] Parameters/TestRpc.TestRpcSidecarLimits/SSL_TCP
I20260926 16:19:40.397420 24867 acceptor_pool.cc:254] collecting diagnostics on the listening RPC socket 0.0.0.0:42373 every 8 connection(s)
I20260926 16:19:40.398257 24868 acceptor_pool.cc:254] collecting diagnostics on the listening RPC socket 0.0.0.0:42373 every 8 connection(s)
W20260926 16:19:40.428421 24609 serialization.cc:72] Serialized kudu.rpc_test.PushStringsRequestPB (2147483654 bytes) is larger than the maximum configured RPC message size (52428800 bytes). Sending anyway, but peer may reject the data.
W20260926 16:19:40.440521 24865 connection.cc:535] server connection from 127.0.0.1:40434 recv error: Network error: RPC frame had a length of 2147483714, but we only support messages up to 52428800 bytes long.
W20260926 16:19:40.440889 24865 connection.cc:158] shutting down server connection from 127.0.0.1:40434 with pending inbound data: 4/2147483714 bytes received; last active 0 ns ago: status Network error: RPC frame had a length of 2147483714, but we only support messages up to 52428800 bytes long.
W20260926 16:19:40.441783 24880 connection.cc:698] client connection to 0.0.0.0:42373 send error: Network error: failed to write to TLS socket: Connection reset by peer
W20260926 16:19:40.442410 24880 connection.cc:196] Error closing socket: Network error: TlsSocket::Close: Success
[       OK ] Parameters/TestRpc.TestRpcSidecarLimits/SSL_TCP (17090 ms)
[ RUN      ] Parameters/TestRpc.TestCallTimeoutDoesntAffectNegotiation/SSL_TCP
I20260926 16:19:41.054327 24892 acceptor_pool.cc:254] collecting diagnostics on the listening RPC socket 0.0.0.0:42893 every 8 connection(s)
I20260926 16:19:41.055015 24893 acceptor_pool.cc:254] collecting diagnostics on the listening RPC socket 0.0.0.0:42893 every 8 connection(s)
W20260926 16:19:41.083772 24888 negotiation.cc:266] Injecting 500ms delay in negotiation
I20260926 16:19:41.133765 24609 rpc-test-base.h:595] status: Timed out: connection negotiation to 0.0.0.0:42893 for RPC Sleep timed out after 0.050s (ON_OUTBOUND_QUEUE), seconds elapsed: 0.0510011
[       OK ] Parameters/TestRpc.TestCallTimeoutDoesntAffectNegotiation/SSL_TCP (568 ms)
[ RUN      ] Parameters/TestRpc.TestRpcHandlerLatencyMetric/SSL_TCP
I20260926 16:19:41.622644 24917 acceptor_pool.cc:254] collecting diagnostics on the listening RPC socket 0.0.0.0:39261 every 8 connection(s)
I20260926 16:19:41.623255 24918 acceptor_pool.cc:254] collecting diagnostics on the listening RPC socket 0.0.0.0:39261 every 8 connection(s)
I20260926 16:19:41.679692 24609 rpc-test.cc:1236] Sleep() min lat: 21666
I20260926 16:19:41.679893 24609 rpc-test.cc:1237] Sleep() mean lat: 21666
I20260926 16:19:41.680023 24609 rpc-test.cc:1238] Sleep() max lat: 21666
I20260926 16:19:41.680169 24609 rpc-test.cc:1239] Sleep() #calls: 1
[       OK ] Parameters/TestRpc.TestRpcHandlerLatencyMetric/SSL_TCP (86 ms)
[ RUN      ] Parameters/TestRpc.TimedOutOnResponseMetricServiceQueue/SSL_TCP
I20260926 16:19:41.714366 24943 acceptor_pool.cc:254] collecting diagnostics on the listening RPC socket 0.0.0.0:45721 every 8 connection(s)
I20260926 16:19:41.715044 24944 acceptor_pool.cc:254] collecting diagnostics on the listening RPC socket 0.0.0.0:45721 every 8 connection(s)
W20260926 16:19:41.786804 24945 rpcz_store.cc:267] Call kudu.rpc_test.CalculatorService.Sleep from 127.0.0.1:35370 (request call id 2) took 20 ms (client timeout 20 ms). Trace:
W20260926 16:19:41.787104 24945 rpcz_store.cc:269] 0926 16:19:41.766245 (+     0us) service_pool.cc:170] Inserting onto call queue
0926 16:19:41.786675 (+ 20430us) service_pool.cc:214] Skipping call since client already timed out
0926 16:19:41.786761 (+    86us) inbound_call.cc:173] Queueing failure response
Metrics: {}
[       OK ] Parameters/TestRpc.TimedOutOnResponseMetricServiceQueue/SSL_TCP (106 ms)
[ RUN      ] Parameters/TestRpc.RpcPendingConnectionsMetric/SSL_TCP
I20260926 16:19:41.805363 24966 acceptor_pool.cc:254] collecting diagnostics on the listening RPC socket 0.0.0.0:44605 every 8 connection(s)
I20260926 16:19:41.806111 24967 acceptor_pool.cc:254] collecting diagnostics on the listening RPC socket 0.0.0.0:44605 every 8 connection(s)
W20260926 16:19:41.811357 24962 negotiation.cc:337] Failed RPC negotiation. Trace:
0926 16:19:41.809988 (+     0us) reactor.cc:625] Submitting negotiation task for server connection from 127.0.0.1:33640 (local address 127.0.0.1:44605)
0926 16:19:41.810548 (+   560us) server_negotiation.cc:206] Beginning negotiation
0926 16:19:41.810566 (+    18us) server_negotiation.cc:399] Waiting for connection header
0926 16:19:41.810801 (+   235us) negotiation.cc:327] Negotiation complete: Network error: Server connection negotiation failed: server connection from 127.0.0.1:33640: BlockingRecv error: recv got EOF from 127.0.0.1:33640 (error 108)
Metrics: {"server-negotiator.queue_time_us":125}
[       OK ] Parameters/TestRpc.RpcPendingConnectionsMetric/SSL_TCP (31 ms)
[ RUN      ] Parameters/TestRpc.TestRpcContextClientDeadline/SSL_TCP
I20260926 16:19:41.847795 24982 acceptor_pool.cc:254] collecting diagnostics on the listening RPC socket 0.0.0.0:43237 every 8 connection(s)
I20260926 16:19:41.848508 24983 acceptor_pool.cc:254] collecting diagnostics on the listening RPC socket 0.0.0.0:43237 every 8 connection(s)
[       OK ] Parameters/TestRpc.TestRpcContextClientDeadline/SSL_TCP (104 ms)
[ RUN      ] Parameters/TestRpc.TestApplicationFeatureFlagUnsupportedServer/SSL_TCP
I20260926 16:19:41.947697 25007 acceptor_pool.cc:254] collecting diagnostics on the listening RPC socket 0.0.0.0:33865 every 8 connection(s)
I20260926 16:19:41.948357 25008 acceptor_pool.cc:254] collecting diagnostics on the listening RPC socket 0.0.0.0:33865 every 8 connection(s)
[       OK ] Parameters/TestRpc.TestApplicationFeatureFlagUnsupportedServer/SSL_TCP (68 ms)
[ RUN      ] Parameters/TestRpc.TestCancellationAsync/SSL_TCP
I20260926 16:19:42.019476 25032 acceptor_pool.cc:254] collecting diagnostics on the listening RPC socket 0.0.0.0:37297 every 8 connection(s)
I20260926 16:19:42.020157 25033 acceptor_pool.cc:254] collecting diagnostics on the listening RPC socket 0.0.0.0:37297 every 8 connection(s)
I20260926 16:19:42.023386 24609 rpc-test.cc:1716] Connecting to 0.0.0.0:37297
I20260926 16:19:42.048894 24609 test_util.cc:268] Using random seed: 860332648
I20260926 16:19:42.283181 25036 rpc-test-base.h:240] got call: sleep_micros: 500 pattern: 4294967295 num_repetitions: 2097152 sidecar_idx: 0
I20260926 16:19:42.444386 25035 rpc-test-base.h:240] got call: sleep_micros: 500 pattern: 4294967295 num_repetitions: 2097152 sidecar_idx: 0
I20260926 16:19:42.650811 25036 rpc-test-base.h:240] got call: sleep_micros: 500 pattern: 4294967295 num_repetitions: 2097152 sidecar_idx: 0
I20260926 16:19:42.827159 25035 rpc-test-base.h:240] got call: sleep_micros: 500 pattern: 4294967295 num_repetitions: 2097152 sidecar_idx: 0
I20260926 16:19:42.990463 25036 rpc-test-base.h:240] got call: sleep_micros: 500 pattern: 4294967295 num_repetitions: 2097152 sidecar_idx: 0
I20260926 16:19:43.172075 25035 rpc-test-base.h:240] got call: sleep_micros: 500 pattern: 4294967295 num_repetitions: 2097152 sidecar_idx: 0
I20260926 16:19:43.354511 25036 rpc-test-base.h:240] got call: sleep_micros: 500 pattern: 4294967295 num_repetitions: 2097152 sidecar_idx: 0
I20260926 16:19:43.523701 25035 rpc-test-base.h:240] got call: sleep_micros: 500 pattern: 4294967295 num_repetitions: 2097152 sidecar_idx: 0
W20260926 16:19:43.705247 25031 connection.cc:698] server connection from 127.0.0.1:52992 send error: Network error: failed to write to TLS socket: Broken pipe
W20260926 16:19:43.705494 25031 connection.cc:441] server connection from 127.0.0.1:52992 torn down before Call kudu.rpc.GenericCalculatorService.SleepWithSidecar from 127.0.0.1:52992 (request call id 9) could send its response
W20260926 16:19:43.710019 25031 connection.cc:196] Error closing socket: Network error: TlsSocket::Close: Success
W20260926 16:19:43.745106 25031 connection.cc:441] server connection from 127.0.0.1:52992 torn down before Call kudu.rpc.GenericCalculatorService.SleepWithSidecar from 127.0.0.1:52992 (request call id 8) could send its response
[       OK ] Parameters/TestRpc.TestCancellationAsync/SSL_TCP (1753 ms)
[ RUN      ] Parameters/TestRpc.TestPerformanceBySocketType/SSL_TCP
I20260926 16:19:43.841886 25057 acceptor_pool.cc:254] collecting diagnostics on the listening RPC socket 0.0.0.0:35345 every 8 connection(s)
I20260926 16:19:43.842613 25058 acceptor_pool.cc:254] collecting diagnostics on the listening RPC socket 0.0.0.0:35345 every 8 connection(s)
I20260926 16:19:43.845839 24609 rpc-test.cc:1846] Connecting to 0.0.0.0:35345
I20260926 16:20:03.121853 24609 rpc-test.cc:1859] Sending 1024MB via ssl-enabled tcp socket: real 19.257s	user 17.204s	sys 10.454s
I20260926 16:20:22.136534 24609 rpc-test.cc:1859] Sending 1024MB via ssl-enabled tcp socket: real 19.014s	user 16.795s	sys 10.447s
I20260926 16:20:41.262616 24609 rpc-test.cc:1859] Sending 1024MB via ssl-enabled tcp socket: real 19.124s	user 16.966s	sys 10.432s
I20260926 16:21:00.160655 24609 rpc-test.cc:1859] Sending 1024MB via ssl-enabled tcp socket: real 18.898s	user 16.589s	sys 10.478s
I20260926 16:21:18.952793 24609 rpc-test.cc:1859] Sending 1024MB via ssl-enabled tcp socket: real 18.792s	user 16.561s	sys 10.329s
[       OK ] Parameters/TestRpc.TestPerformanceBySocketType/SSL_TCP (95215 ms)
[----------] 20 tests from Parameters/TestRpc (240965 ms total)

[----------] 1 test from Parameters/TestRpcSocketTxRxQueue
[ RUN      ] Parameters/TestRpcSocketTxRxQueue.OverCapacity/0
W20260926 16:21:19.397641 25111 negotiation.cc:337] Failed RPC negotiation. Trace:
0926 16:21:19.006390 (+     0us) reactor.cc:625] Submitting negotiation task for client connection to 0.0.0.0:36379 (local address 127.0.0.1:53046)
0926 16:21:19.007008 (+   618us) negotiation.cc:107] Waiting for socket to connect
0926 16:21:19.007050 (+    42us) client_negotiation.cc:174] Beginning negotiation
0926 16:21:19.007311 (+   261us) client_negotiation.cc:252] Sending NEGOTIATE NegotiatePB request
0926 16:21:19.396493 (+389182us) negotiation.cc:327] Negotiation complete: Network error: Client connection negotiation failed: client connection to 0.0.0.0:36379: BlockingRecv error: recv error from unknown peer: Transport endpoint is not connected (error 107)
Metrics: {"client-negotiator.queue_time_us":151}
W20260926 16:21:19.397727 25093 negotiation.cc:337] Failed RPC negotiation. Trace:
0926 16:21:18.986282 (+     0us) reactor.cc:625] Submitting negotiation task for client connection to 0.0.0.0:36379 (local address 127.0.0.1:53028)
0926 16:21:18.986908 (+   626us) negotiation.cc:107] Waiting for socket to connect
0926 16:21:18.986947 (+    39us) client_negotiation.cc:174] Beginning negotiation
0926 16:21:18.987198 (+   251us) client_negotiation.cc:252] Sending NEGOTIATE NegotiatePB request
0926 16:21:19.396569 (+409371us) negotiation.cc:327] Negotiation complete: Network error: Client connection negotiation failed: client connection to 0.0.0.0:36379: BlockingRecv error: recv error from unknown peer: Transport endpoint is not connected (error 107)
Metrics: {"client-negotiator.queue_time_us":139}
W20260926 16:21:19.399497 25129 negotiation.cc:337] Failed RPC negotiation. Trace:
0926 16:21:19.029946 (+     0us) reactor.cc:625] Submitting negotiation task for client connection to 0.0.0.0:36379 (local address 127.0.0.1:53064)
0926 16:21:19.030529 (+   583us) negotiation.cc:107] Waiting for socket to connect
0926 16:21:19.030559 (+    30us) client_negotiation.cc:174] Beginning negotiation
0926 16:21:19.030752 (+   193us) client_negotiation.cc:252] Sending NEGOTIATE NegotiatePB request
0926 16:21:19.397461 (+366709us) negotiation.cc:327] Negotiation complete: Network error: Client connection negotiation failed: client connection to 0.0.0.0:36379: BlockingRecv error: recv error from unknown peer: Transport endpoint is not connected (error 107)
Metrics: {"client-negotiator.queue_time_us":141}
W20260926 16:21:19.399958 25102 negotiation.cc:337] Failed RPC negotiation. Trace:
0926 16:21:18.994131 (+     0us) reactor.cc:625] Submitting negotiation task for client connection to 0.0.0.0:36379 (local address 127.0.0.1:53040)
0926 16:21:18.994816 (+   685us) negotiation.cc:107] Waiting for socket to connect
0926 16:21:18.994857 (+    41us) client_negotiation.cc:174] Beginning negotiation
0926 16:21:18.995129 (+   272us) client_negotiation.cc:252] Sending NEGOTIATE NegotiatePB request
0926 16:21:19.396596 (+401467us) negotiation.cc:327] Negotiation complete: Network error: Client connection negotiation failed: client connection to 0.0.0.0:36379: BlockingRecv error: recv error from unknown peer: Transport endpoint is not connected (error 107)
Metrics: {"client-negotiator.queue_time_us":178}
W20260926 16:21:19.400195 25084 negotiation.cc:337] Failed RPC negotiation. Trace:
0926 16:21:18.979205 (+     0us) reactor.cc:625] Submitting negotiation task for client connection to 0.0.0.0:36379 (local address 127.0.0.1:53024)
0926 16:21:18.979921 (+   716us) negotiation.cc:107] Waiting for socket to connect
0926 16:21:18.979974 (+    53us) client_negotiation.cc:174] Beginning negotiation
0926 16:21:18.980451 (+   477us) client_negotiation.cc:252] Sending NEGOTIATE NegotiatePB request
0926 16:21:19.396494 (+416043us) negotiation.cc:327] Negotiation complete: Network error: Client connection negotiation failed: client connection to 0.0.0.0:36379: BlockingRecv error: recv error from unknown peer: Transport endpoint is not connected (error 107)
Metrics: {"client-negotiator.queue_time_us":144}
W20260926 16:21:19.400202 25120 negotiation.cc:337] Failed RPC negotiation. Trace:
0926 16:21:19.018000 (+     0us) reactor.cc:625] Submitting negotiation task for client connection to 0.0.0.0:36379 (local address 127.0.0.1:53056)
0926 16:21:19.018565 (+   565us) negotiation.cc:107] Waiting for socket to connect
0926 16:21:19.018596 (+    31us) client_negotiation.cc:174] Beginning negotiation
0926 16:21:19.018782 (+   186us) client_negotiation.cc:252] Sending NEGOTIATE NegotiatePB request
0926 16:21:19.398025 (+379243us) negotiation.cc:327] Negotiation complete: Network error: Client connection negotiation failed: client connection to 0.0.0.0:36379: BlockingRecv error: recv error from unknown peer: Transport endpoint is not connected (error 107)
Metrics: {"client-negotiator.queue_time_us":145}
[       OK ] Parameters/TestRpcSocketTxRxQueue.OverCapacity/0 (1211 ms)
[----------] 1 test from Parameters/TestRpcSocketTxRxQueue (1212 ms total)

[----------] Global test environment tear-down
[==========] 21 tests from 2 test suites ran. (242178 ms total)
[  PASSED  ] 20 tests.
[  FAILED  ] 1 test, listed below:
[  FAILED  ] Parameters/TestRpc.TestCallWithChainCertAndChainCA/SSL_TCP, where GetParam() = (true, false)

 1 FAILED TEST