Diagnosed failure

Parameters/TestRpc.TestCallWithChainCertAndChainCA/SSL_TCP: /data0/somelongdirectorytoavoidrpathissues/src/kudu/src/kudu/rpc/rpc-test.cc:270: Failure
Failed
Bad status: Runtime error: could not verify certificate chain (error with cert: subject=CN = localhost, ST = sadfjas, C = AS, emailAddress = sdflkdsajf, O = lskdfjlsad, OU = sldfkja, issuer=C = AS, ST = ASDfkjdhf, L = lskdjf, O = saldfja, OU = skdjf, CN = localhost, emailAddress = sadjflkadsj): : certificate has expired
Google Test trace:
/data0/somelongdirectorytoavoidrpathissues/src/kudu/src/kudu/rpc/rpc-test.cc:267: Connecting to 0.0.0.0:40433
I20260927 10:43:02.816273   383 test_util.cc:175] -----------------------------------------------
I20260927 10:43:02.816335   383 test_util.cc:176] Had fatal failures, leaving test files at /tmp/dist-test-taskzVv93r/test-tmp/rpc-test.5.Parameters_TestRpc.TestCallWithChainCertAndChainCA_SSL_TCP.1790505782743843-383-0

Full log

Note: This is test shard 6 of 8.
[==========] Running 21 tests from 2 test suites.
[----------] Global test environment set-up.
[----------] 20 tests from Parameters/TestRpc
[ RUN      ] Parameters/TestRpc.TestMessengerCreateDestroy/SSL_TCP
WARNING: Logging before InitGoogleLogging() is written to STDERR
I20260927 10:43:02.775635   383 rpc-test.cc:169] started messenger TestCreateDestroy
[       OK ] Parameters/TestRpc.TestMessengerCreateDestroy/SSL_TCP (26 ms)
[ RUN      ] Parameters/TestRpc.TestNegotiationDeadlock/SSL_TCP
I20260927 10:43:02.783787   403 acceptor_pool.cc:254] collecting diagnostics on the listening RPC socket 0.0.0.0:38549 every 8 connection(s)
I20260927 10:43:02.783787   404 acceptor_pool.cc:254] collecting diagnostics on the listening RPC socket 0.0.0.0:38549 every 8 connection(s)
[       OK ] Parameters/TestRpc.TestNegotiationDeadlock/SSL_TCP (18 ms)
[ RUN      ] Parameters/TestRpc.TestCallWithChainCertAndChainCA/SSL_TCP
I20260927 10:43:02.810370   420 acceptor_pool.cc:254] collecting diagnostics on the listening RPC socket 0.0.0.0:40433 every 8 connection(s)
I20260927 10:43:02.810371   419 acceptor_pool.cc:254] collecting diagnostics on the listening RPC socket 0.0.0.0:40433 every 8 connection(s)
/data0/somelongdirectorytoavoidrpathissues/src/kudu/src/kudu/rpc/rpc-test.cc:270: Failure
Failed
Bad status: Runtime error: could not verify certificate chain (error with cert: subject=CN = localhost, ST = sadfjas, C = AS, emailAddress = sdflkdsajf, O = lskdfjlsad, OU = sldfkja, issuer=C = AS, ST = ASDfkjdhf, L = lskdjf, O = saldfja, OU = skdjf, CN = localhost, emailAddress = sadjflkadsj): : certificate has expired
Google Test trace:
/data0/somelongdirectorytoavoidrpathissues/src/kudu/src/kudu/rpc/rpc-test.cc:267: Connecting to 0.0.0.0:40433
I20260927 10:43:02.816273   383 test_util.cc:175] -----------------------------------------------
I20260927 10:43:02.816335   383 test_util.cc:176] Had fatal failures, leaving test files at /tmp/dist-test-taskzVv93r/test-tmp/rpc-test.5.Parameters_TestRpc.TestCallWithChainCertAndChainCA_SSL_TCP.1790505782743843-383-0
[  FAILED  ] Parameters/TestRpc.TestCallWithChainCertAndChainCA/SSL_TCP, where GetParam() = (true, false) (19 ms)
[ RUN      ] Parameters/TestRpc.TestCallWithPasswordProtectedKey/SSL_TCP
I20260927 10:43:02.832000   444 acceptor_pool.cc:254] collecting diagnostics on the listening RPC socket 0.0.0.0:37765 every 8 connection(s)
I20260927 10:43:02.832053   445 acceptor_pool.cc:254] collecting diagnostics on the listening RPC socket 0.0.0.0:37765 every 8 connection(s)
[       OK ] Parameters/TestRpc.TestCallWithPasswordProtectedKey/SSL_TCP (32 ms)
[ RUN      ] Parameters/TestRpc.TestCallToBadServer/SSL_TCP
I20260927 10:43:02.856948   383 rpc-test.cc:394] Status: Network error: Client connection negotiation failed: client connection to 0.0.0.0:0: connect: Connection refused (error 111)
I20260927 10:43:02.857398   383 rpc-test.cc:394] Status: Network error: Client connection negotiation failed: client connection to 0.0.0.0:0: connect: Connection refused (error 111)
I20260927 10:43:02.857805   383 rpc-test.cc:394] Status: Network error: Client connection negotiation failed: client connection to 0.0.0.0:0: connect: Connection refused (error 111)
I20260927 10:43:02.858182   383 rpc-test.cc:394] Status: Network error: Client connection negotiation failed: client connection to 0.0.0.0:0: connect: Connection refused (error 111)
I20260927 10:43:02.858620   383 rpc-test.cc:394] Status: Network error: Client connection negotiation failed: client connection to 0.0.0.0:0: connect: Connection refused (error 111)
[       OK ] Parameters/TestRpc.TestCallToBadServer/SSL_TCP (10 ms)
[ RUN      ] Parameters/TestRpc.TestWrongService/SSL_TCP
I20260927 10:43:02.869652   479 acceptor_pool.cc:254] collecting diagnostics on the listening RPC socket 0.0.0.0:43985 every 8 connection(s)
I20260927 10:43:02.869702   480 acceptor_pool.cc:254] collecting diagnostics on the listening RPC socket 0.0.0.0:43985 every 8 connection(s)
I20260927 10:43:02.892381   478 messenger.cc:345] service WrongServiceName not registered on TestServer
[       OK ] Parameters/TestRpc.TestWrongService/SSL_TCP (36 ms)
[ RUN      ] Parameters/TestRpc.TestConnectionKeepalive/SSL_TCP
I20260927 10:43:02.909132   502 acceptor_pool.cc:254] collecting diagnostics on the listening RPC socket 0.0.0.0:37767 every 8 connection(s)
I20260927 10:43:02.909158   503 acceptor_pool.cc:254] collecting diagnostics on the listening RPC socket 0.0.0.0:37767 every 8 connection(s)
I20260927 10:43:02.909443   383 rpc-test.cc:488] Connecting to 0.0.0.0:37767
[       OK ] Parameters/TestRpc.TestConnectionKeepalive/SSL_TCP (1057 ms)
[ RUN      ] Parameters/TestRpc.TestClientConnectionMetrics/SSL_TCP
I20260927 10:43:03.967552   527 acceptor_pool.cc:254] collecting diagnostics on the listening RPC socket 0.0.0.0:34205 every 8 connection(s)
I20260927 10:43:03.967689   528 acceptor_pool.cc:254] collecting diagnostics on the listening RPC socket 0.0.0.0:34205 every 8 connection(s)
I20260927 10:43:03.967969   383 rpc-test.cc:569] Connecting to 0.0.0.0:34205
[       OK ] Parameters/TestRpc.TestClientConnectionMetrics/SSL_TCP (15096 ms)
[ RUN      ] Parameters/TestRpc.TestCredentialsPolicy/SSL_TCP
I20260927 10:43:19.078094   550 acceptor_pool.cc:254] collecting diagnostics on the listening RPC socket 0.0.0.0:46283 every 8 connection(s)
I20260927 10:43:19.078132   551 acceptor_pool.cc:254] collecting diagnostics on the listening RPC socket 0.0.0.0:46283 every 8 connection(s)
I20260927 10:43:19.078456   383 rpc-test.cc:700] Connecting to 0.0.0.0:46283
[       OK ] Parameters/TestRpc.TestCredentialsPolicy/SSL_TCP (58 ms)
[ RUN      ] Parameters/TestRpc.TestCallLongerThanKeepalive/SSL_TCP
I20260927 10:43:19.116928   575 acceptor_pool.cc:254] collecting diagnostics on the listening RPC socket 0.0.0.0:44431 every 8 connection(s)
I20260927 10:43:19.116963   576 acceptor_pool.cc:254] collecting diagnostics on the listening RPC socket 0.0.0.0:44431 every 8 connection(s)
I20260927 10:43:19.131944   579 rpc-test-base.h:222] got call: sleep_micros: 3000000 deferred: true
I20260927 10:43:22.132843   579 rpcz_store.cc:275] Call kudu.rpc.GenericCalculatorService.Sleep from 127.0.0.1:40856 (request call id 0) took 3000 ms. Trace:
I20260927 10:43:22.132969   579 rpcz_store.cc:276] 0927 10:43:19.131851 (+     0us) service_pool.cc:170] Inserting onto call queue
0927 10:43:19.131907 (+    56us) service_pool.cc:227] Handling call
0927 10:43:22.132798 (+3000891us) inbound_call.cc:173] Queueing success response
Metrics: {}
[       OK ] Parameters/TestRpc.TestCallLongerThanKeepalive/SSL_TCP (3028 ms)
[ RUN      ] Parameters/TestRpc.TestRpcSidecar/SSL_TCP
I20260927 10:43:22.154408   601 acceptor_pool.cc:254] collecting diagnostics on the listening RPC socket 0.0.0.0:33779 every 8 connection(s)
I20260927 10:43:22.154376   600 acceptor_pool.cc:254] collecting diagnostics on the listening RPC socket 0.0.0.0:33779 every 8 connection(s)
[       OK ] Parameters/TestRpc.TestRpcSidecar/SSL_TCP (83 ms)
[ RUN      ] Parameters/TestRpc.TestRpcSidecarLimits/SSL_TCP
I20260927 10:43:23.980695   625 acceptor_pool.cc:254] collecting diagnostics on the listening RPC socket 0.0.0.0:45295 every 8 connection(s)
I20260927 10:43:23.980718   626 acceptor_pool.cc:254] collecting diagnostics on the listening RPC socket 0.0.0.0:45295 every 8 connection(s)
W20260927 10:43:23.997433   383 serialization.cc:72] Serialized kudu.rpc_test.PushStringsRequestPB (2147483654 bytes) is larger than the maximum configured RPC message size (52428800 bytes). Sending anyway, but peer may reject the data.
W20260927 10:43:24.001922   624 connection.cc:535] server connection from 127.0.0.1:59216 recv error: Network error: RPC frame had a length of 2147483714, but we only support messages up to 52428800 bytes long.
W20260927 10:43:24.002038   624 connection.cc:158] shutting down server connection from 127.0.0.1:59216 with pending inbound data: 4/2147483714 bytes received; last active 0 ns ago: status Network error: RPC frame had a length of 2147483714, but we only support messages up to 52428800 bytes long.
W20260927 10:43:24.002411   638 connection.cc:196] Error closing socket: Network error: TlsSocket::Close: Connection reset by peer
I20260927 10:43:24.018193   650 acceptor_pool.cc:254] collecting diagnostics on the listening RPC socket 0.0.0.0:41235 every 8 connection(s)
I20260927 10:43:24.018334   651 acceptor_pool.cc:254] collecting diagnostics on the listening RPC socket 0.0.0.0:41235 every 8 connection(s)
W20260927 10:43:28.521873   649 connection.cc:577] server connection from 127.0.0.1:58016: received bad data: 'Corruption: Invalid packet: message had a length of 2147483710, but we only support messages up to 2147483647 bytes
'
[       OK ] Parameters/TestRpc.TestRpcSidecarLimits/SSL_TCP (6305 ms)
[ RUN      ] Parameters/TestRpc.TestCallTimeoutDoesntAffectNegotiation/SSL_TCP
I20260927 10:43:28.544760   675 acceptor_pool.cc:254] collecting diagnostics on the listening RPC socket 0.0.0.0:35537 every 8 connection(s)
I20260927 10:43:28.544786   676 acceptor_pool.cc:254] collecting diagnostics on the listening RPC socket 0.0.0.0:35537 every 8 connection(s)
W20260927 10:43:28.558056   671 negotiation.cc:266] Injecting 500ms delay in negotiation
I20260927 10:43:28.608399   383 rpc-test-base.h:595] status: Timed out: connection negotiation to 0.0.0.0:35537 for RPC Sleep timed out after 0.050s (ON_OUTBOUND_QUEUE), seconds elapsed: 0.0509147
[       OK ] Parameters/TestRpc.TestCallTimeoutDoesntAffectNegotiation/SSL_TCP (540 ms)
[ RUN      ] Parameters/TestRpc.TestRpcHandlerLatencyMetric/SSL_TCP
I20260927 10:43:29.075029   700 acceptor_pool.cc:254] collecting diagnostics on the listening RPC socket 0.0.0.0:40331 every 8 connection(s)
I20260927 10:43:29.075145   701 acceptor_pool.cc:254] collecting diagnostics on the listening RPC socket 0.0.0.0:40331 every 8 connection(s)
I20260927 10:43:29.121898   383 rpc-test.cc:1236] Sleep() min lat: 20627
I20260927 10:43:29.121976   383 rpc-test.cc:1237] Sleep() mean lat: 20627
I20260927 10:43:29.122004   383 rpc-test.cc:1238] Sleep() max lat: 20627
I20260927 10:43:29.122017   383 rpc-test.cc:1239] Sleep() #calls: 1
[       OK ] Parameters/TestRpc.TestRpcHandlerLatencyMetric/SSL_TCP (59 ms)
[ RUN      ] Parameters/TestRpc.TimedOutOnResponseMetricServiceQueue/SSL_TCP
I20260927 10:43:29.143175   726 acceptor_pool.cc:254] collecting diagnostics on the listening RPC socket 0.0.0.0:46203 every 8 connection(s)
I20260927 10:43:29.143196   727 acceptor_pool.cc:254] collecting diagnostics on the listening RPC socket 0.0.0.0:46203 every 8 connection(s)
W20260927 10:43:29.198046   728 rpcz_store.cc:267] Call kudu.rpc_test.CalculatorService.Sleep from 127.0.0.1:40960 (request call id 2) took 20 ms (client timeout 20 ms). Trace:
W20260927 10:43:29.198161   728 rpcz_store.cc:269] 0927 10:43:29.177515 (+     0us) service_pool.cc:170] Inserting onto call queue
0927 10:43:29.197992 (+ 20477us) service_pool.cc:214] Skipping call since client already timed out
0927 10:43:29.198027 (+    35us) inbound_call.cc:173] Queueing failure response
Metrics: {}
[       OK ] Parameters/TestRpc.TimedOutOnResponseMetricServiceQueue/SSL_TCP (75 ms)
[ RUN      ] Parameters/TestRpc.RpcPendingConnectionsMetric/SSL_TCP
I20260927 10:43:29.202704   749 acceptor_pool.cc:254] collecting diagnostics on the listening RPC socket 0.0.0.0:41297 every 8 connection(s)
I20260927 10:43:29.202780   750 acceptor_pool.cc:254] collecting diagnostics on the listening RPC socket 0.0.0.0:41297 every 8 connection(s)
W20260927 10:43:29.213182   745 negotiation.cc:337] Failed RPC negotiation. Trace:
0927 10:43:29.212585 (+     0us) reactor.cc:625] Submitting negotiation task for server connection from 127.0.0.1:42914 (local address 127.0.0.1:41297)
0927 10:43:29.212738 (+   153us) server_negotiation.cc:206] Beginning negotiation
0927 10:43:29.212743 (+     5us) server_negotiation.cc:399] Waiting for connection header
0927 10:43:29.212864 (+   121us) negotiation.cc:327] Negotiation complete: Network error: Server connection negotiation failed: server connection from 127.0.0.1:42914: BlockingRecv error: recv got EOF from 127.0.0.1:42914 (error 108)
Metrics: {"server-negotiator.queue_time_us":35}
[       OK ] Parameters/TestRpc.RpcPendingConnectionsMetric/SSL_TCP (23 ms)
[ RUN      ] Parameters/TestRpc.TestRpcContextClientDeadline/SSL_TCP
I20260927 10:43:29.240217   765 acceptor_pool.cc:254] collecting diagnostics on the listening RPC socket 0.0.0.0:38705 every 8 connection(s)
I20260927 10:43:29.240254   766 acceptor_pool.cc:254] collecting diagnostics on the listening RPC socket 0.0.0.0:38705 every 8 connection(s)
[       OK ] Parameters/TestRpc.TestRpcContextClientDeadline/SSL_TCP (68 ms)
[ RUN      ] Parameters/TestRpc.TestApplicationFeatureFlagUnsupportedServer/SSL_TCP
I20260927 10:43:29.307232   790 acceptor_pool.cc:254] collecting diagnostics on the listening RPC socket 0.0.0.0:33867 every 8 connection(s)
I20260927 10:43:29.307238   791 acceptor_pool.cc:254] collecting diagnostics on the listening RPC socket 0.0.0.0:33867 every 8 connection(s)
[       OK ] Parameters/TestRpc.TestApplicationFeatureFlagUnsupportedServer/SSL_TCP (38 ms)
[ RUN      ] Parameters/TestRpc.TestCancellationAsync/SSL_TCP
I20260927 10:43:29.343086   815 acceptor_pool.cc:254] collecting diagnostics on the listening RPC socket 0.0.0.0:35301 every 8 connection(s)
I20260927 10:43:29.343123   816 acceptor_pool.cc:254] collecting diagnostics on the listening RPC socket 0.0.0.0:35301 every 8 connection(s)
I20260927 10:43:29.343451   383 rpc-test.cc:1716] Connecting to 0.0.0.0:35301
I20260927 10:43:29.354221   383 test_util.cc:268] Using random seed: -1631838741
I20260927 10:43:29.383482   819 rpc-test-base.h:240] got call: sleep_micros: 500 pattern: 4294967295 num_repetitions: 2097152 sidecar_idx: 0
I20260927 10:43:29.407296   819 rpc-test-base.h:240] got call: sleep_micros: 500 pattern: 4294967295 num_repetitions: 2097152 sidecar_idx: 0
I20260927 10:43:29.430506   819 rpc-test-base.h:240] got call: sleep_micros: 500 pattern: 4294967295 num_repetitions: 2097152 sidecar_idx: 0
I20260927 10:43:29.447383   818 rpc-test-base.h:240] got call: sleep_micros: 500 pattern: 4294967295 num_repetitions: 2097152 sidecar_idx: 0
I20260927 10:43:29.468397   819 rpc-test-base.h:240] got call: sleep_micros: 500 pattern: 4294967295 num_repetitions: 2097152 sidecar_idx: 0
I20260927 10:43:29.486492   818 rpc-test-base.h:240] got call: sleep_micros: 500 pattern: 4294967295 num_repetitions: 2097152 sidecar_idx: 0
I20260927 10:43:29.504005   819 rpc-test-base.h:240] got call: sleep_micros: 500 pattern: 4294967295 num_repetitions: 2097152 sidecar_idx: 0
I20260927 10:43:29.525110   818 rpc-test-base.h:240] got call: sleep_micros: 500 pattern: 4294967295 num_repetitions: 2097152 sidecar_idx: 0
W20260927 10:43:29.529734   814 connection.cc:441] server connection from 127.0.0.1:58196 torn down before Call kudu.rpc.GenericCalculatorService.SleepWithSidecar from 127.0.0.1:58196 (request call id 8) could send its response
W20260927 10:43:29.544325   814 connection.cc:441] server connection from 127.0.0.1:58196 torn down before Call kudu.rpc.GenericCalculatorService.SleepWithSidecar from 127.0.0.1:58196 (request call id 9) could send its response
[       OK ] Parameters/TestRpc.TestCancellationAsync/SSL_TCP (214 ms)
[ RUN      ] Parameters/TestRpc.TestPerformanceBySocketType/SSL_TCP
I20260927 10:43:29.554713   840 acceptor_pool.cc:254] collecting diagnostics on the listening RPC socket 0.0.0.0:33963 every 8 connection(s)
I20260927 10:43:29.554858   841 acceptor_pool.cc:254] collecting diagnostics on the listening RPC socket 0.0.0.0:33963 every 8 connection(s)
I20260927 10:43:29.555079   383 rpc-test.cc:1846] Connecting to 0.0.0.0:33963
I20260927 10:43:32.076326   383 rpc-test.cc:1859] Sending 1024MB via ssl-enabled tcp socket: real 2.503s	user 2.664s	sys 1.753s
I20260927 10:43:34.306305   383 rpc-test.cc:1859] Sending 1024MB via ssl-enabled tcp socket: real 2.230s	user 2.457s	sys 1.487s
I20260927 10:43:36.661485   383 rpc-test.cc:1859] Sending 1024MB via ssl-enabled tcp socket: real 2.355s	user 2.425s	sys 1.706s
I20260927 10:43:38.836966   383 rpc-test.cc:1859] Sending 1024MB via ssl-enabled tcp socket: real 2.175s	user 2.263s	sys 1.584s
I20260927 10:43:41.072453   383 rpc-test.cc:1859] Sending 1024MB via ssl-enabled tcp socket: real 2.235s	user 2.242s	sys 1.657s
[       OK ] Parameters/TestRpc.TestPerformanceBySocketType/SSL_TCP (11528 ms)
[----------] 20 tests from Parameters/TestRpc (38323 ms total)

[----------] 1 test from Parameters/TestRpcSocketTxRxQueue
[ RUN      ] Parameters/TestRpcSocketTxRxQueue.OverCapacity/0
W20260927 10:43:41.344132   884 negotiation.cc:337] Failed RPC negotiation. Trace:
0927 10:43:41.080117 (+     0us) reactor.cc:625] Submitting negotiation task for client connection to 0.0.0.0:34701 (local address 127.0.0.1:41238)
0927 10:43:41.080236 (+   119us) negotiation.cc:107] Waiting for socket to connect
0927 10:43:41.080252 (+    16us) client_negotiation.cc:174] Beginning negotiation
0927 10:43:41.080326 (+    74us) client_negotiation.cc:252] Sending NEGOTIATE NegotiatePB request
0927 10:43:41.343906 (+263580us) negotiation.cc:327] Negotiation complete: Network error: Client connection negotiation failed: client connection to 0.0.0.0:34701: BlockingRecv error: recv error from unknown peer: Transport endpoint is not connected (error 107)
Metrics: {"client-negotiator.queue_time_us":40}
W20260927 10:43:41.344339   902 negotiation.cc:337] Failed RPC negotiation. Trace:
0927 10:43:41.082153 (+     0us) reactor.cc:625] Submitting negotiation task for client connection to 0.0.0.0:34701 (local address 127.0.0.1:41258)
0927 10:43:41.082254 (+   101us) negotiation.cc:107] Waiting for socket to connect
0927 10:43:41.082266 (+    12us) client_negotiation.cc:174] Beginning negotiation
0927 10:43:41.082336 (+    70us) client_negotiation.cc:252] Sending NEGOTIATE NegotiatePB request
0927 10:43:41.344258 (+261922us) negotiation.cc:327] Negotiation complete: Network error: Client connection negotiation failed: client connection to 0.0.0.0:34701: BlockingRecv error: recv error from unknown peer: Transport endpoint is not connected (error 107)
Metrics: {"client-negotiator.queue_time_us":41}
W20260927 10:43:41.344362   893 negotiation.cc:337] Failed RPC negotiation. Trace:
0927 10:43:41.081051 (+     0us) reactor.cc:625] Submitting negotiation task for client connection to 0.0.0.0:34701 (local address 127.0.0.1:41244)
0927 10:43:41.081145 (+    94us) negotiation.cc:107] Waiting for socket to connect
0927 10:43:41.081154 (+     9us) client_negotiation.cc:174] Beginning negotiation
0927 10:43:41.081239 (+    85us) client_negotiation.cc:252] Sending NEGOTIATE NegotiatePB request
0927 10:43:41.344117 (+262878us) negotiation.cc:327] Negotiation complete: Network error: Client connection negotiation failed: client connection to 0.0.0.0:34701: BlockingRecv error: recv error from unknown peer: Transport endpoint is not connected (error 107)
Metrics: {"client-negotiator.queue_time_us":28}
W20260927 10:43:41.344617   857 negotiation.cc:337] Failed RPC negotiation. Trace:
0927 10:43:41.076863 (+     0us) reactor.cc:625] Submitting negotiation task for client connection to 0.0.0.0:34701 (local address 127.0.0.1:41214)
0927 10:43:41.077050 (+   187us) negotiation.cc:107] Waiting for socket to connect
0927 10:43:41.077063 (+    13us) client_negotiation.cc:174] Beginning negotiation
0927 10:43:41.077144 (+    81us) client_negotiation.cc:252] Sending NEGOTIATE NegotiatePB request
0927 10:43:41.343906 (+266762us) negotiation.cc:327] Negotiation complete: Network error: Client connection negotiation failed: client connection to 0.0.0.0:34701: BlockingRecv error: recv error from unknown peer: Transport endpoint is not connected (error 107)
Metrics: {"client-negotiator.queue_time_us":41}
W20260927 10:43:41.344128   866 negotiation.cc:337] Failed RPC negotiation. Trace:
0927 10:43:41.077882 (+     0us) reactor.cc:625] Submitting negotiation task for client connection to 0.0.0.0:34701 (local address 127.0.0.1:41226)
0927 10:43:41.078004 (+   122us) negotiation.cc:107] Waiting for socket to connect
0927 10:43:41.078015 (+    11us) client_negotiation.cc:174] Beginning negotiation
0927 10:43:41.078087 (+    72us) client_negotiation.cc:252] Sending NEGOTIATE NegotiatePB request
0927 10:43:41.343926 (+265839us) negotiation.cc:327] Negotiation complete: Network error: Client connection negotiation failed: client connection to 0.0.0.0:34701: BlockingRecv error: recv error from unknown peer: Transport endpoint is not connected (error 107)
Metrics: {"client-negotiator.queue_time_us":41}
W20260927 10:43:41.344128   875 negotiation.cc:337] Failed RPC negotiation. Trace:
0927 10:43:41.078940 (+     0us) reactor.cc:625] Submitting negotiation task for client connection to 0.0.0.0:34701 (local address 127.0.0.1:41230)
0927 10:43:41.079105 (+   165us) negotiation.cc:107] Waiting for socket to connect
0927 10:43:41.079116 (+    11us) client_negotiation.cc:174] Beginning negotiation
0927 10:43:41.079175 (+    59us) client_negotiation.cc:252] Sending NEGOTIATE NegotiatePB request
0927 10:43:41.343926 (+264751us) negotiation.cc:327] Negotiation complete: Network error: Client connection negotiation failed: client connection to 0.0.0.0:34701: BlockingRecv error: recv error from unknown peer: Transport endpoint is not connected (error 107)
Metrics: {"client-negotiator.queue_time_us":107}
[       OK ] Parameters/TestRpcSocketTxRxQueue.OverCapacity/0 (1040 ms)
[----------] 1 test from Parameters/TestRpcSocketTxRxQueue (1040 ms total)

[----------] Global test environment tear-down
[==========] 21 tests from 2 test suites ran. (39364 ms total)
[  PASSED  ] 20 tests.
[  FAILED  ] 1 test, listed below:
[  FAILED  ] Parameters/TestRpc.TestCallWithChainCertAndChainCA/SSL_TCP, where GetParam() = (true, false)

 1 FAILED TEST