Diagnosed failure

Parameters/TestRpc.TestCallWithChainCertAndRootCA/SSL_TCP: /data0/somelongdirectorytoavoidrpathissues/src/kudu/src/kudu/rpc/rpc-test.cc:303: Failure
Failed
Bad status: Runtime error: could not verify certificate chain (error with cert: subject=CN = localhost, ST = sadfjas, C = AS, emailAddress = sdflkdsajf, O = lskdfjlsad, OU = sldfkja, issuer=C = AS, ST = ASDfkjdhf, L = lskdjf, O = saldfja, OU = skdjf, CN = localhost, emailAddress = sadjflkadsj): : certificate has expired
Google Test trace:
/data0/somelongdirectorytoavoidrpathissues/src/kudu/src/kudu/rpc/rpc-test.cc:300: Connecting to 0.0.0.0:42445
I20260926 16:13:32.527143   788 test_util.cc:175] -----------------------------------------------
I20260926 16:13:32.527344   788 test_util.cc:176] Had fatal failures, leaving test files at /tmp/dist-test-taskC1vB2W/test-tmp/rpc-test.1.Parameters_TestRpc.TestCallWithChainCertAndRootCA_SSL_TCP.1790439210981732-788-0

Full log

Note: This is test shard 2 of 8.
[==========] Running 21 tests from 2 test suites.
[----------] Global test environment set-up.
[----------] 1 test from TestRpc
[ RUN      ] TestRpc.TestMethodsByName
[       OK ] TestRpc.TestMethodsByName (7 ms)
[----------] 1 test from TestRpc (7 ms total)

[----------] 20 tests from Parameters/TestRpc
[ RUN      ] Parameters/TestRpc.TestAcceptorPoolStartStop/SSL_TCP
WARNING: Logging before InitGoogleLogging() is written to STDERR
I20260926 16:13:31.102852   803 acceptor_pool.cc:254] collecting diagnostics on the listening RPC socket 0.0.0.0:38955 every 8 connection(s)
I20260926 16:13:31.104839   804 acceptor_pool.cc:254] collecting diagnostics on the listening RPC socket 0.0.0.0:38955 every 8 connection(s)
I20260926 16:13:32.281273   815 acceptor_pool.cc:254] collecting diagnostics on the listening RPC socket 0.0.0.0:37283 every 8 connection(s)
I20260926 16:13:32.282859   816 acceptor_pool.cc:254] collecting diagnostics on the listening RPC socket 0.0.0.0:37283 every 8 connection(s)
I20260926 16:13:32.307636   826 acceptor_pool.cc:254] collecting diagnostics on the listening RPC socket 0.0.0.0:34053 every 8 connection(s)
I20260926 16:13:32.309556   827 acceptor_pool.cc:254] collecting diagnostics on the listening RPC socket 0.0.0.0:34053 every 8 connection(s)
I20260926 16:13:32.329178   837 acceptor_pool.cc:254] collecting diagnostics on the listening RPC socket 0.0.0.0:42133 every 8 connection(s)
I20260926 16:13:32.329900   838 acceptor_pool.cc:254] collecting diagnostics on the listening RPC socket 0.0.0.0:42133 every 8 connection(s)
I20260926 16:13:32.359762   848 acceptor_pool.cc:254] collecting diagnostics on the listening RPC socket 0.0.0.0:34909 every 8 connection(s)
I20260926 16:13:32.360605   849 acceptor_pool.cc:254] collecting diagnostics on the listening RPC socket 0.0.0.0:34909 every 8 connection(s)
[       OK ] Parameters/TestRpc.TestAcceptorPoolStartStop/SSL_TCP (1316 ms)
[ RUN      ] Parameters/TestRpc.TestCall/SSL_TCP
I20260926 16:13:32.381076   861 acceptor_pool.cc:254] collecting diagnostics on the listening RPC socket 0.0.0.0:46393 every 8 connection(s)
I20260926 16:13:32.383599   862 acceptor_pool.cc:254] collecting diagnostics on the listening RPC socket 0.0.0.0:46393 every 8 connection(s)
I20260926 16:13:32.389364   788 rpc-test.cc:234] Connecting to 0.0.0.0:46393
[       OK ] Parameters/TestRpc.TestCall/SSL_TCP (107 ms)
[ RUN      ] Parameters/TestRpc.TestCallWithChainCertAndRootCA/SSL_TCP
I20260926 16:13:32.505188   886 acceptor_pool.cc:254] collecting diagnostics on the listening RPC socket 0.0.0.0:42445 every 8 connection(s)
I20260926 16:13:32.506084   887 acceptor_pool.cc:254] collecting diagnostics on the listening RPC socket 0.0.0.0:42445 every 8 connection(s)
/data0/somelongdirectorytoavoidrpathissues/src/kudu/src/kudu/rpc/rpc-test.cc:303: Failure
Failed
Bad status: Runtime error: could not verify certificate chain (error with cert: subject=CN = localhost, ST = sadfjas, C = AS, emailAddress = sdflkdsajf, O = lskdfjlsad, OU = sldfkja, issuer=C = AS, ST = ASDfkjdhf, L = lskdjf, O = saldfja, OU = skdjf, CN = localhost, emailAddress = sadjflkadsj): : certificate has expired
Google Test trace:
/data0/somelongdirectorytoavoidrpathissues/src/kudu/src/kudu/rpc/rpc-test.cc:300: Connecting to 0.0.0.0:42445
I20260926 16:13:32.527143   788 test_util.cc:175] -----------------------------------------------
I20260926 16:13:32.527344   788 test_util.cc:176] Had fatal failures, leaving test files at /tmp/dist-test-taskC1vB2W/test-tmp/rpc-test.1.Parameters_TestRpc.TestCallWithChainCertAndRootCA_SSL_TCP.1790439210981732-788-0
[  FAILED  ] Parameters/TestRpc.TestCallWithChainCertAndRootCA/SSL_TCP, where GetParam() = (true, false) (55 ms)
[ RUN      ] Parameters/TestRpc.TestCallWithBadPasswordProtectedKey/SSL_TCP
[       OK ] Parameters/TestRpc.TestCallWithBadPasswordProtectedKey/SSL_TCP (31 ms)
[ RUN      ] Parameters/TestRpc.TestInvalidMethodCall/SSL_TCP
I20260926 16:13:32.575960   923 acceptor_pool.cc:254] collecting diagnostics on the listening RPC socket 0.0.0.0:36893 every 8 connection(s)
I20260926 16:13:32.576817   924 acceptor_pool.cc:254] collecting diagnostics on the listening RPC socket 0.0.0.0:36893 every 8 connection(s)
I20260926 16:13:32.580188   788 rpc-test.cc:406] Connecting to 0.0.0.0:36893
[       OK ] Parameters/TestRpc.TestInvalidMethodCall/SSL_TCP (74 ms)
[ RUN      ] Parameters/TestRpc.TestHighFDs/SSL_TCP
I20260926 16:13:32.842864   948 acceptor_pool.cc:254] collecting diagnostics on the listening RPC socket 0.0.0.0:44107 every 8 connection(s)
I20260926 16:13:32.843588   949 acceptor_pool.cc:254] collecting diagnostics on the listening RPC socket 0.0.0.0:44107 every 8 connection(s)
[       OK ] Parameters/TestRpc.TestHighFDs/SSL_TCP (259 ms)
[ RUN      ] Parameters/TestRpc.TestConnectionAlwaysKeepalive/SSL_TCP
I20260926 16:13:32.910058   971 acceptor_pool.cc:254] collecting diagnostics on the listening RPC socket 0.0.0.0:44957 every 8 connection(s)
I20260926 16:13:32.910773   972 acceptor_pool.cc:254] collecting diagnostics on the listening RPC socket 0.0.0.0:44957 every 8 connection(s)
I20260926 16:13:32.914502   788 rpc-test.cc:532] Connecting to 0.0.0.0:44957
[       OK ] Parameters/TestRpc.TestConnectionAlwaysKeepalive/SSL_TCP (3064 ms)
[ RUN      ] Parameters/TestRpc.TestReopenOutboundConnections/SSL_TCP
I20260926 16:13:35.978034   994 acceptor_pool.cc:254] collecting diagnostics on the listening RPC socket 0.0.0.0:35093 every 8 connection(s)
I20260926 16:13:35.978833   995 acceptor_pool.cc:254] collecting diagnostics on the listening RPC socket 0.0.0.0:35093 every 8 connection(s)
I20260926 16:13:35.981968   788 rpc-test.cc:658] Connecting to 0.0.0.0:35093
[       OK ] Parameters/TestRpc.TestReopenOutboundConnections/SSL_TCP (396 ms)
[ RUN      ] Parameters/TestRpc.TestConnectionNetworkPlane/SSL_TCP
I20260926 16:13:36.377658  1017 acceptor_pool.cc:254] collecting diagnostics on the listening RPC socket 0.0.0.0:38941 every 8 connection(s)
I20260926 16:13:36.378312  1018 acceptor_pool.cc:254] collecting diagnostics on the listening RPC socket 0.0.0.0:38941 every 8 connection(s)
I20260926 16:13:36.381517   788 rpc-test.cc:772] Connecting to 0.0.0.0:38941
[       OK ] Parameters/TestRpc.TestConnectionNetworkPlane/SSL_TCP (86 ms)
[ RUN      ] Parameters/TestRpc.TestTCPKeepalive/SSL_TCP
I20260926 16:13:36.468844  1042 acceptor_pool.cc:254] collecting diagnostics on the listening RPC socket 0.0.0.0:46855 every 8 connection(s)
I20260926 16:13:36.469619  1043 acceptor_pool.cc:254] collecting diagnostics on the listening RPC socket 0.0.0.0:46855 every 8 connection(s)
I20260926 16:13:36.499347  1046 rpc-test-base.h:222] got call: sleep_micros: 8000000 deferred: true
I20260926 16:13:44.503522  1046 rpcz_store.cc:275] Call kudu.rpc.GenericCalculatorService.Sleep from 127.0.0.1:50186 (request call id 0) took 8004 ms. Trace:
I20260926 16:13:44.504052  1046 rpcz_store.cc:276] 0926 16:13:36.499091 (+     0us) service_pool.cc:170] Inserting onto call queue
0926 16:13:36.499195 (+   104us) service_pool.cc:227] Handling call
0926 16:13:44.503338 (+8004143us) inbound_call.cc:173] Queueing success response
Metrics: {}
[       OK ] Parameters/TestRpc.TestTCPKeepalive/SSL_TCP (8076 ms)
[ RUN      ] Parameters/TestRpc.TestMaxSmallSidecars/SSL_TCP
I20260926 16:13:44.553501  1068 acceptor_pool.cc:254] collecting diagnostics on the listening RPC socket 0.0.0.0:35641 every 8 connection(s)
I20260926 16:13:44.554344  1069 acceptor_pool.cc:254] collecting diagnostics on the listening RPC socket 0.0.0.0:35641 every 8 connection(s)
[       OK ] Parameters/TestRpc.TestMaxSmallSidecars/SSL_TCP (204 ms)
[ RUN      ] Parameters/TestRpc.TestCallTimeout/SSL_TCP
I20260926 16:13:44.763345  1093 acceptor_pool.cc:254] collecting diagnostics on the listening RPC socket 0.0.0.0:43719 every 8 connection(s)
I20260926 16:13:44.764153  1094 acceptor_pool.cc:254] collecting diagnostics on the listening RPC socket 0.0.0.0:43719 every 8 connection(s)
I20260926 16:13:44.791081   788 rpc-test-base.h:595] status: Timed out: connection negotiation to 0.0.0.0:43719 for RPC Sleep timed out after 0.000s (ON_OUTBOUND_QUEUE), seconds elapsed: 0.00254337
I20260926 16:13:44.798674  1097 rpc-test-base.h:222] got call: sleep_micros: 700000
I20260926 16:13:44.992746   788 rpc-test-base.h:595] status: Timed out: Sleep RPC to 0.0.0.0:43719 timed out after 0.200s (SENT), seconds elapsed: 0.201304
I20260926 16:13:44.994390  1096 rpc-test-base.h:222] got call: sleep_micros: 2000000
W20260926 16:13:45.499341  1097 rpcz_store.cc:267] Call kudu.rpc.GenericCalculatorService.Sleep from 127.0.0.1:41374 (request call id 1) took 700 ms (client timeout 200 ms). Trace:
W20260926 16:13:45.499763  1097 rpcz_store.cc:269] 0926 16:13:44.798513 (+     0us) service_pool.cc:170] Inserting onto call queue
0926 16:13:44.798620 (+   107us) service_pool.cc:227] Handling call
0926 16:13:45.499279 (+700659us) inbound_call.cc:173] Queueing success response
Metrics: {}
I20260926 16:13:46.495486   788 rpc-test-base.h:595] status: Timed out: Sleep RPC to 0.0.0.0:43719 timed out after 1.500s (SENT), seconds elapsed: 1.50234
W20260926 16:13:46.994951  1096 rpcz_store.cc:267] Call kudu.rpc.GenericCalculatorService.Sleep from 127.0.0.1:41374 (request call id 2) took 2000 ms (client timeout 1500 ms). Trace:
W20260926 16:13:46.995332  1096 rpcz_store.cc:269] 0926 16:13:44.994089 (+     0us) service_pool.cc:170] Inserting onto call queue
0926 16:13:44.994238 (+   149us) service_pool.cc:227] Handling call
0926 16:13:46.994899 (+2000661us) inbound_call.cc:173] Queueing success response
Metrics: {}
W20260926 16:13:46.996059  1090 connection.cc:441] server connection from 127.0.0.1:41374 torn down before Call kudu.rpc.GenericCalculatorService.Sleep from 127.0.0.1:41374 (request call id 2) could send its response
[       OK ] Parameters/TestRpc.TestCallTimeout/SSL_TCP (2280 ms)
[ RUN      ] Parameters/TestRpc.TestServerShutsDown/SSL_TCP
I20260926 16:13:47.004094   788 rpc-test.cc:1125] Connecting to 0.0.0.0:33725
W20260926 16:13:47.014418  1110 negotiation.cc:337] Failed RPC negotiation. Trace:
0926 16:13:47.012764 (+     0us) reactor.cc:625] Submitting negotiation task for client connection to 0.0.0.0:33725 (local address 127.0.0.1:32984)
0926 16:13:47.013278 (+   514us) negotiation.cc:107] Waiting for socket to connect
0926 16:13:47.013310 (+    32us) client_negotiation.cc:174] Beginning negotiation
0926 16:13:47.013530 (+   220us) client_negotiation.cc:252] Sending NEGOTIATE NegotiatePB request
0926 16:13:47.013823 (+   293us) negotiation.cc:327] Negotiation complete: Network error: Client connection negotiation failed: client connection to 0.0.0.0:33725: BlockingWrite error: write error: Broken pipe (error 32)
Metrics: {"client-negotiator.queue_time_us":123}
[       OK ] Parameters/TestRpc.TestServerShutsDown/SSL_TCP (14 ms)
[ RUN      ] Parameters/TestRpc.TimedOutOnResponseMetric/SSL_TCP
I20260926 16:13:47.052599  1127 acceptor_pool.cc:254] collecting diagnostics on the listening RPC socket 0.0.0.0:36423 every 8 connection(s)
I20260926 16:13:47.053267  1128 acceptor_pool.cc:254] collecting diagnostics on the listening RPC socket 0.0.0.0:36423 every 8 connection(s)
W20260926 16:13:47.289804  1131 rpcz_store.cc:267] Call kudu.rpc_test.CalculatorService.Sleep from 127.0.0.1:59214 (request call id 3) took 50 ms (client timeout 25 ms). Trace:
W20260926 16:13:47.290165  1131 rpcz_store.cc:269] 0926 16:13:47.239106 (+     0us) service_pool.cc:170] Inserting onto call queue
0926 16:13:47.239224 (+   118us) service_pool.cc:227] Handling call
0926 16:13:47.289715 (+ 50491us) inbound_call.cc:173] Queueing success response
Related trace 'test_child':
Metrics: {"test_sleep_us":50000,"child_traces":[["test_child",{"related_trace_metric":1}]]}
W20260926 16:13:47.349910  1131 rpcz_store.cc:267] Call kudu.rpc_test.CalculatorService.Sleep from 127.0.0.1:59214 (request call id 4) took 50 ms (client timeout 50 ms). Trace:
W20260926 16:13:47.350337  1131 rpcz_store.cc:269] 0926 16:13:47.299263 (+     0us) service_pool.cc:170] Inserting onto call queue
0926 16:13:47.299399 (+   136us) service_pool.cc:227] Handling call
0926 16:13:47.349780 (+ 50381us) inbound_call.cc:173] Queueing success response
Related trace 'test_child':
Metrics: {"test_sleep_us":50000,"child_traces":[["test_child",{"related_trace_metric":1}]]}
[       OK ] Parameters/TestRpc.TimedOutOnResponseMetric/SSL_TCP (341 ms)
[ RUN      ] Parameters/TestRpc.AcceptorDispatchingTimesMetric/SSL_TCP
I20260926 16:13:47.370386  1152 acceptor_pool.cc:254] collecting diagnostics on the listening RPC socket 0.0.0.0:41135 every 8 connection(s)
I20260926 16:13:47.371162  1153 acceptor_pool.cc:254] collecting diagnostics on the listening RPC socket 0.0.0.0:41135 every 8 connection(s)
W20260926 16:13:47.377907  1148 negotiation.cc:337] Failed RPC negotiation. Trace:
0926 16:13:47.375485 (+     0us) reactor.cc:625] Submitting negotiation task for server connection from 127.0.0.1:49744 (local address 127.0.0.1:41135)
0926 16:13:47.376037 (+   552us) server_negotiation.cc:206] Beginning negotiation
0926 16:13:47.376070 (+    33us) server_negotiation.cc:399] Waiting for connection header
0926 16:13:47.376442 (+   372us) negotiation.cc:327] Negotiation complete: Network error: Server connection negotiation failed: server connection from 127.0.0.1:49744: BlockingRecv error: recv got EOF from 127.0.0.1:49744 (error 108)
Metrics: {"server-negotiator.queue_time_us":142}
[       OK ] Parameters/TestRpc.AcceptorDispatchingTimesMetric/SSL_TCP (21 ms)
[ RUN      ] Parameters/TestRpc.TestRpcCallbackDestroysMessenger/SSL_TCP
[       OK ] Parameters/TestRpc.TestRpcCallbackDestroysMessenger/SSL_TCP (38 ms)
[ RUN      ] Parameters/TestRpc.TestApplicationFeatureFlag/SSL_TCP
I20260926 16:13:47.460762  1177 acceptor_pool.cc:254] collecting diagnostics on the listening RPC socket 0.0.0.0:36645 every 8 connection(s)
I20260926 16:13:47.461498  1178 acceptor_pool.cc:254] collecting diagnostics on the listening RPC socket 0.0.0.0:36645 every 8 connection(s)
W20260926 16:13:47.506953  1176 messenger.cc:357] Unable to handle RPC call: Not implemented: call requires unsupported application feature flags: 99
[       OK ] Parameters/TestRpc.TestApplicationFeatureFlag/SSL_TCP (96 ms)
[ RUN      ] Parameters/TestRpc.TestCancellation/SSL_TCP
I20260926 16:13:47.541762  1202 acceptor_pool.cc:254] collecting diagnostics on the listening RPC socket 0.0.0.0:46057 every 8 connection(s)
I20260926 16:13:47.542531  1203 acceptor_pool.cc:254] collecting diagnostics on the listening RPC socket 0.0.0.0:46057 every 8 connection(s)
I20260926 16:13:47.545929   788 rpc-test.cc:1648] Connecting to 0.0.0.0:46057
I20260926 16:13:47.672456   788 rpc-test-base.h:595] status: Aborted: Sleep RPC to 0.0.0.0:46057 is cancelled in state READY, seconds elapsed: 0.000452192
I20260926 16:13:47.817245   788 rpc-test-base.h:595] status: Aborted: Sleep RPC to 0.0.0.0:46057 is cancelled in state SENT, seconds elapsed: 0.00107894
I20260926 16:13:47.870348  1205 rpc-test-base.h:222] got call: sleep_micros: 510000
I20260926 16:13:47.991178   788 rpc-test-base.h:595] status: Aborted: Sleep RPC to 0.0.0.0:46057 is cancelled in state SENT, seconds elapsed: 0.000860374
I20260926 16:13:48.034823  1204 rpc-test-base.h:222] got call: sleep_micros: 510000
I20260926 16:13:48.151664   788 rpc-test-base.h:595] status: Aborted: Sleep RPC to 0.0.0.0:46057 is cancelled in state SENT, seconds elapsed: 0.000849057
W20260926 16:13:48.193933  1206 rpcz_store.cc:267] Call kudu.rpc.GenericCalculatorService.Sleep from 127.0.0.1:36490 (request call id 11) took 14 ms (client timeout 10 ms). Trace:
W20260926 16:13:48.194262  1206 rpcz_store.cc:269] 0926 16:13:48.178908 (+     0us) service_pool.cc:170] Inserting onto call queue
0926 16:13:48.193645 (+ 14737us) service_pool.cc:214] Skipping call since client already timed out
0926 16:13:48.193751 (+   106us) inbound_call.cc:173] Queueing failure response
Metrics: {}
I20260926 16:13:48.194821  1206 rpc-test-base.h:222] got call: sleep_micros: 1500000
W20260926 16:13:48.381034  1205 rpcz_store.cc:267] Call kudu.rpc.GenericCalculatorService.Sleep from 127.0.0.1:36490 (request call id 3) took 510 ms (client timeout 10 ms). Trace:
W20260926 16:13:48.381349  1205 rpcz_store.cc:269] 0926 16:13:47.870129 (+     0us) service_pool.cc:170] Inserting onto call queue
0926 16:13:47.870276 (+   147us) service_pool.cc:227] Handling call
0926 16:13:48.380983 (+510707us) inbound_call.cc:173] Queueing success response
Metrics: {}
W20260926 16:13:48.545591  1204 rpcz_store.cc:267] Call kudu.rpc.GenericCalculatorService.Sleep from 127.0.0.1:36490 (request call id 7) took 511 ms (client timeout 10 ms). Trace:
W20260926 16:13:48.545945  1204 rpcz_store.cc:269] 0926 16:13:48.034514 (+     0us) service_pool.cc:170] Inserting onto call queue
0926 16:13:48.034731 (+   217us) service_pool.cc:227] Handling call
0926 16:13:48.545526 (+510795us) inbound_call.cc:173] Queueing success response
Metrics: {}
I20260926 16:13:49.154304   788 rpc-test-base.h:595] status: Timed out: Sleep RPC to 0.0.0.0:46057 timed out after 1.000s (SENT), seconds elapsed: 1.00226
I20260926 16:13:49.155771  1204 rpc-test-base.h:222] got call: sleep_micros: 1500000
W20260926 16:13:49.695370  1206 rpcz_store.cc:267] Call kudu.rpc.GenericCalculatorService.Sleep from 127.0.0.1:36490 (request call id 12) took 1516 ms (client timeout 1000 ms). Trace:
W20260926 16:13:49.695772  1206 rpcz_store.cc:269] 0926 16:13:48.179242 (+     0us) service_pool.cc:170] Inserting onto call queue
0926 16:13:48.194786 (+ 15544us) service_pool.cc:227] Handling call
0926 16:13:49.695323 (+1500537us) inbound_call.cc:173] Queueing success response
Metrics: {}
I20260926 16:13:50.156504   788 rpc-test-base.h:595] status: Timed out: Sleep RPC to 0.0.0.0:46057 timed out after 1.000s (SENT), seconds elapsed: 1.00189
W20260926 16:13:50.158072  1201 messenger.cc:357] Unable to handle RPC call: Not implemented: call requires unsupported application feature flags: 99, 1
W20260926 16:13:50.159631  1201 messenger.cc:357] Unable to handle RPC call: Not implemented: call requires unsupported application feature flags: 99, 1
W20260926 16:13:50.656289  1204 rpcz_store.cc:267] Call kudu.rpc.GenericCalculatorService.Sleep from 127.0.0.1:36490 (request call id 13) took 1500 ms (client timeout 1000 ms). Trace:
W20260926 16:13:50.656636  1204 rpcz_store.cc:269] 0926 16:13:49.155567 (+     0us) service_pool.cc:170] Inserting onto call queue
0926 16:13:49.155723 (+   156us) service_pool.cc:227] Handling call
0926 16:13:50.656231 (+1500508us) inbound_call.cc:173] Queueing success response
Metrics: {}
W20260926 16:13:50.657325  1201 connection.cc:441] server connection from 127.0.0.1:36490 torn down before Call kudu.rpc.GenericCalculatorService.Sleep from 127.0.0.1:36490 (request call id 13) could send its response
[       OK ] Parameters/TestRpc.TestCancellation/SSL_TCP (3147 ms)
[ RUN      ] Parameters/TestRpc.TestCancellationMultiThreads/SSL_TCP
I20260926 16:13:50.693266  1227 acceptor_pool.cc:254] collecting diagnostics on the listening RPC socket 0.0.0.0:35995 every 8 connection(s)
I20260926 16:13:50.693969  1228 acceptor_pool.cc:254] collecting diagnostics on the listening RPC socket 0.0.0.0:35995 every 8 connection(s)
I20260926 16:13:50.697150   788 rpc-test.cc:1808] Connecting to 0.0.0.0:35995
I20260926 16:13:50.849982  1241 test_util.cc:268] Using random seed: 509133718
I20260926 16:13:50.851178  1242 test_util.cc:268] Using random seed: 509134930
I20260926 16:13:50.852654  1243 test_util.cc:268] Using random seed: 509136406
I20260926 16:13:50.854218  1244 test_util.cc:268] Using random seed: 509137947
I20260926 16:13:50.855669  1245 test_util.cc:268] Using random seed: 509139311
I20260926 16:13:50.857250  1246 test_util.cc:268] Using random seed: 509140889
I20260926 16:13:50.858633  1247 test_util.cc:268] Using random seed: 509142282
I20260926 16:13:50.860392  1248 test_util.cc:268] Using random seed: 509144036
I20260926 16:13:50.861842  1249 test_util.cc:268] Using random seed: 509145490
I20260926 16:13:50.863768  1250 test_util.cc:268] Using random seed: 509147399
I20260926 16:13:50.866029  1251 test_util.cc:268] Using random seed: 509149614
I20260926 16:13:50.868234  1252 test_util.cc:268] Using random seed: 509151859
I20260926 16:13:50.869560  1253 test_util.cc:268] Using random seed: 509153176
I20260926 16:13:50.872375  1254 test_util.cc:268] Using random seed: 509155891
I20260926 16:13:50.878772  1255 test_util.cc:268] Using random seed: 509162388
I20260926 16:13:50.882437  1256 test_util.cc:268] Using random seed: 509165662
I20260926 16:13:50.884900  1257 test_util.cc:268] Using random seed: 509168350
I20260926 16:13:50.888314  1258 test_util.cc:268] Using random seed: 509171836
I20260926 16:13:50.890733  1259 test_util.cc:268] Using random seed: 509174287
I20260926 16:13:50.894183  1260 test_util.cc:268] Using random seed: 509177352
I20260926 16:13:50.896291  1261 test_util.cc:268] Using random seed: 509179811
I20260926 16:13:50.898767  1262 test_util.cc:268] Using random seed: 509182312
I20260926 16:13:50.901103  1263 test_util.cc:268] Using random seed: 509184686
I20260926 16:13:50.904253  1264 test_util.cc:268] Using random seed: 509187801
I20260926 16:13:50.906708  1265 test_util.cc:268] Using random seed: 509190298
I20260926 16:13:50.909318  1266 test_util.cc:268] Using random seed: 509192901
I20260926 16:13:50.911732  1267 test_util.cc:268] Using random seed: 509195275
I20260926 16:13:50.914146  1268 test_util.cc:268] Using random seed: 509197697
I20260926 16:13:50.916500  1269 test_util.cc:268] Using random seed: 509200098
I20260926 16:13:50.918401  1270 test_util.cc:268] Using random seed: 509202011
[       OK ] Parameters/TestRpc.TestCancellationMultiThreads/SSL_TCP (18139 ms)
[ RUN      ] Parameters/TestRpc.TestCallId/SSL_TCP
I20260926 16:14:08.843457  1284 acceptor_pool.cc:254] collecting diagnostics on the listening RPC socket 0.0.0.0:41967 every 8 connection(s)
I20260926 16:14:08.844296  1285 acceptor_pool.cc:254] collecting diagnostics on the listening RPC socket 0.0.0.0:41967 every 8 connection(s)
[       OK ] Parameters/TestRpc.TestCallId/SSL_TCP (99 ms)
[----------] 20 tests from Parameters/TestRpc (37855 ms total)

[----------] Global test environment tear-down
[==========] 21 tests from 2 test suites ran. (37863 ms total)
[  PASSED  ] 20 tests.
[  FAILED  ] 1 test, listed below:
[  FAILED  ] Parameters/TestRpc.TestCallWithChainCertAndRootCA/SSL_TCP, where GetParam() = (true, false)

 1 FAILED TEST